value: 0
top_left: 0 1
bottom_right: 0.25 0.666667

value: 1
top_left: 0.25 1
bottom_right: 0.5 0.666667

value: 2
top_left: 0.5 1
bottom_right: 0.75 0.666667

value: 3
top_left: 0.75 1
bottom_right: 1 0.666667

value: 4
top_left: 0 0.666667
bottom_right: 0.25 0.333333

value: 5
top_left: 0.25 0.666667
bottom_right: 0.5 0.333333

value: 6
top_left: 0.5 0.666667
bottom_right: 0.75 0.333333

value: 7
top_left: 0.75 0.666667
bottom_right: 1 0.333333

value: 8
top_left: 0 0.333333
bottom_right: 0.25 0

value: 9
top_left: 0.25 0.333333
bottom_right: 0.5 0

value: 10
top_left: 0.5 0.333333
bottom_right: 0.75 0