\beamer@endinputifotherversion {3.36pt}
\select@language {french}
\beamer@sectionintoc {1}{Introdu\IeC {\c c}\IeC {\~a}o}{3}{0}{1}
\beamer@sectionintoc {2}{Contextualiza\IeC {\c c}\IeC {\~a}o}{4}{0}{2}
\beamer@subsectionintoc {2}{1}{Lista de itens}{5}{0}{2}
\beamer@subsubsectionintoc {2}{1}{1}{Lista de itens}{6}{0}{2}
\beamer@sectionintoc {3}{Conclus\IeC {\~a}o}{7}{0}{3}
