\relax 
\providecommand\hyper@newdestlabel[2]{}
\providecommand\BKM@entry[2]{}
\providecommand*{\memsetcounter}[2]{}
\providecommand\HyperFirstAtBeginDocument{\AtBeginDocument}
\HyperFirstAtBeginDocument{\ifx\hyper@anchor\@undefined
\global\let\oldcontentsline\contentsline
\gdef\contentsline#1#2#3#4{\oldcontentsline{#1}{#2}{#3}}
\global\let\oldnewlabel\newlabel
\gdef\newlabel#1#2{\newlabelxx{#1}#2}
\gdef\newlabelxx#1#2#3#4#5#6{\oldnewlabel{#1}{{#2}{#3}}}
\AtEndDocument{\ifx\hyper@anchor\@undefined
\let\contentsline\oldcontentsline
\let\newlabel\oldnewlabel
\fi}
\fi}
\global\let\hyper@last\relax 
\gdef\HyperFirstAtBeginDocument#1{#1}
\providecommand\HyField@AuxAddToFields[1]{}
\providecommand\HyField@AuxAddToCoFields[2]{}
\catcode `"\active 
\citation{abnt-url-package=url}
\citation{abnt-etal-cite=1}
\BKM@entry{id=1,dest={6368617074657262312E30},srcline={162}}{526573756D6F}
\BKM@entry{id=2,dest={73656374696F6E2E302E31},srcline={178}}{496E74726F64755C3334375C3334336F}
\citation{Bassett.2017}
\citation{Derek.2008}
\citation{Zhao.2011}
\citation{Mikum.2017}
\citation{Barros.2000}
\citation{Daschmann.2014}
\citation{Nett.2010}
\@writefile{toc}{\changetocdepth  {4}}
\select@language{brazil}
\@writefile{toc}{\select@language{brazil}}
\@writefile{lof}{\select@language{brazil}}
\@writefile{lot}{\select@language{brazil}}
\select@language{brazil}
\@writefile{toc}{\select@language{brazil}}
\@writefile{lof}{\select@language{brazil}}
\@writefile{lot}{\select@language{brazil}}
\@writefile{toc}{\contentsline {section}{\numberline {1}Introdu\c {c}\~ao}{1}{section.0.1}}
\citation{Carr.2011}
\citation{Sanbonmatsu.2013}
\citation{Markman.2016}
\citation{Asimov.1988}
\citation{Siegel.2013}
\citation{Santos.2014}
\citation{Anshari.2017}
\citation{Hilbert.2011}
\citation{Cutajar.2017}
\citation{Cairns.2017}
\citation{Zakharov.2017}
\citation{Ariely.2009}
\citation{Heyman.2004}
\citation{Lieberman.2013}
\citation{Rilling.2002}
\citation{Khosrow.2017}
\citation{Giles.2005}
\citation{Smith.2017}
\citation{Trivers.1971}
\citation{Nash.1950}
\citation{Nash.1951}
\citation{Surowiecki.2005}
\citation{Well.2016}
\citation{Johnson.1998}
\citation{Surowiecki.2005}
\citation{Harvey.2000}
\citation{Beardsley.2014}
\citation{Mitnick.2017}
\citation{Mandal.2007}
\citation{Vygotsky.2014}
\citation{Vygotsky.2014}
\citation{Culver.1998}
\citation{Palangana.2015}
\citation{Veer.2014}
\citation{Clark.1998}
\citation{Nupedia.2017}
\citation{Wikipedia.2017a}
\citation{Pfeil.2006}
\citation{Greenstein.2007}
\citation{Keim.2007}
\citation{Powell.2008}
\citation{Halavais.2008}
\citation{Liao.2009}
\citation{Zhiqiang.2009}
\citation{Rahurkar.2010}
\citation{Norik.2010}
\citation{Feldstein.2011}
\citation{Jemielniak.2016}
\citation{Adam.2016}
\citation{Samuel.2017}
\citation{Trocky.2016}
\citation{Arriba.2017}
\citation{Biasutti.2017}
\citation{Resnick.2014}
\citation{Resnick.2014}
\citation{Freire.1992}
\citation{Resnick.2017}
\citation{R.2017}
\citation{RDocumentation.2017}
\citation{Moore.2016}
\citation{Ortutay.2017}
\citation{Vinod.2009}
\citation{Gentleman.2006}
\citation{Malone.2016}
\citation{Belhekar.2016}
\citation{Hilbe.2017}
\citation{Monogan.2015}
\citation{Arnold.2015}
\citation{Jockers.2014}
\citation{Cano.2015}
\citation{Chapman.2015}
\citation{Shahbaba.2011}
\citation{Ergul.2013}
\citation{Gries.2013}
\citation{Curran.2010}
\citation{Tattar.2016}
\citation{Heimann.2014}
\citation{Bartolucci.2015}
\citation{Carlson.2017}
\citation{Baker.2017}
\citation{Gonzalez.2017}
\citation{Plant.2012}
\citation{Kaas.2008}
\citation{Chan.2015}
\citation{Vinod.2011}
\citation{Wilcox.2011}
\citation{Kleiber.2008}
\citation{Brunsdon.2015}
\citation{Paradis.2011}
\citation{Horgan.2011}
\citation{Gondro.2015}
\citation{Willekens.2014}
\citation{Ohri.2014}
\citation{Charpentier.2015}
\citation{Vinod.2009}
\citation{Bolstad.2004}
\citation{Chen.2010}
\citation{Pfaff.2016}
\citation{Knoblauch.2012}
\citation{Hothorn.2016}
\citation{Baumer.2017}
\citation{Bloomfield.2014}
\citation{Marchi.2013}
\citation{Beeley.2016}
\citation{Lawson.2014}
\citation{Feigelson.2012}
\citation{Samatova.2013}
\citation{Stevens.2009}
\citation{Qs.2017}
\citation{Harvard.2017}
\citation{MIT.2017}
\citation{Cambridge.2017}
\citation{Stanford.2017}
\citation{Oxford.2017}
\citation{UCL.2017}
\citation{ICL.2017}
\citation{Chicago.2017}
\citation{Zurich.2017}
\citation{Singapore.2017}
\citation{Yale.2017}
\citation{Oregon.2016}
\citation{Cornell.2017}
\citation{Hopkins.2017}
\citation{Columbia.2017}
\citation{ANU.2017}
\citation{KCL.2017}
\citation{Edinburgh.2017}
\citation{Kong.2017}
\citation{Toronto.2017}
\citation{Zurich.2017}
\citation{Munich.2017}
\citation{USP.2017}
\citation{UNICAMP.2017}
\citation{Forbes.2017}
\citation{IBM.2017}
\citation{Oracle.2017}
\citation{Intel.2017}
\citation{Amazon.2017}
\citation{Microsoft.2017}
\citation{Google.2017}
\citation{Northeastern.2017}
\BKM@entry{id=3,dest={73656374696F6E2E302E32},srcline={217}}{4D65746F646F6C6F676961}
\BKM@entry{id=4,dest={73756273656374696F6E2E302E322E31},srcline={222}}{446573656E766F6C76696D656E746F20646120706C617461666F726D61}
\citation{MediaWiki.2017}
\citation{PHP.2017}
\citation{MySQL.2017}
\BKM@entry{id=5,dest={73756273656374696F6E2E302E322E32},srcline={226}}{437572736F2064652052}
\BKM@entry{id=6,dest={73656374696F6E2E302E33},srcline={230}}{50726F6A65746F206465206578706572696D656E746F73}
\BKM@entry{id=7,dest={73756273656374696F6E2E302E332E31},srcline={237}}{566172695C3334317665697320646520726573706F737461}
\BKM@entry{id=8,dest={73756273656374696F6E2E302E332E32},srcline={354}}{4661746F72657320636F6E74726F6C61646F73}
\@writefile{toc}{\contentsline {section}{\numberline {2}Metodologia}{6}{section.0.2}}
\newlabel{sec:Metodologia}{{\M@TitleReference {2}{Metodologia}}{6}{Metodologia}{section.0.2}{}}
\@writefile{toc}{\contentsline {subsection}{\numberline {2.1}Desenvolvimento da plataforma}{6}{subsection.0.2.1}}
\@writefile{toc}{\contentsline {subsection}{\numberline {2.2}Curso de R}{6}{subsection.0.2.2}}
\@writefile{toc}{\contentsline {section}{\numberline {3}Projeto de experimentos}{6}{section.0.3}}
\newlabel{sec:ProjetoExperimentos}{{\M@TitleReference {3}{Projeto de experimentos}}{6}{Projeto de experimentos}{section.0.3}{}}
\@writefile{toc}{\contentsline {subsection}{\numberline {3.1}Vari\IeC {\'a}veis de resposta}{6}{subsection.0.3.1}}
\@writefile{lot}{\contentsline {table}{\numberline {1}{\ignorespaces Notas dos exerc\IeC {\'\i }cios}}{7}{table.0.1}}
\newlabel{tab:notas}{{\M@TitleReference {1}{Notas dos exerc\IeC {\'\i }cios}}{7}{Notas dos exercícios}{table.0.1}{}}
\BKM@entry{id=9,dest={73756273656374696F6E2E302E332E33},srcline={358}}{4661746F72657320636F6E7374616E746573}
\BKM@entry{id=10,dest={73756273656374696F6E2E302E332E34},srcline={369}}{4661746F726573206E5C3334336F2D636F6E7374616E746573205C2872755C333535646F735C29}
\BKM@entry{id=11,dest={73656374696F6E2E302E34},srcline={373}}{416E5C3334316C69736520646F73206578706572696D656E746F73}
\citation{Shapiro.1965}
\@writefile{toc}{\contentsline {subsection}{\numberline {3.2}Fatores controlados}{8}{subsection.0.3.2}}
\@writefile{toc}{\contentsline {subsection}{\numberline {3.3}Fatores constantes}{8}{subsection.0.3.3}}
\@writefile{toc}{\contentsline {subsection}{\numberline {3.4}Fatores n\IeC {\~a}o-constantes (ru\IeC {\'\i }dos)}{8}{subsection.0.3.4}}
\@writefile{toc}{\contentsline {section}{\numberline {4}An\IeC {\'a}lise dos experimentos}{8}{section.0.4}}
\newlabel{sec:AnaliseExperimentos}{{\M@TitleReference {4}{An\IeC {\'a}lise dos experimentos}}{8}{Análise dos experimentos}{section.0.4}{}}
\@writefile{lof}{\contentsline {figure}{\numberline {1}{\ignorespaces Teste de normalidade Shapiro-Wilk para compara\IeC {\c c}\IeC {\~a}o das notas}}{9}{figure.0.1}}
\newlabel{fig:testenormalidade}{{\M@TitleReference {1}{Teste de normalidade Shapiro-Wilk para compara\IeC {\c c}\IeC {\~a}o das notas}}{9}{Teste de normalidade Shapiro-Wilk para comparação das notas}{figure.0.1}{}}
\@writefile{lof}{\contentsline {figure}{\numberline {2}{\ignorespaces Teste de compara\IeC {\c c}\IeC {\~a}o de vari\IeC {\^a}ncias amostrais}}{9}{figure.0.2}}
\newlabel{fig:varteste}{{\M@TitleReference {2}{Teste de compara\IeC {\c c}\IeC {\~a}o de vari\IeC {\^a}ncias amostrais}}{9}{Teste de comparação de variâncias amostrais}{figure.0.2}{}}
\citation{Gelman.2013}
\@writefile{lof}{\contentsline {figure}{\numberline {3}{\ignorespaces Compara\IeC {\c c}\IeC {\~a}o entre as duas sub-amostras}}{10}{figure.0.3}}
\newlabel{fig:anova}{{\M@TitleReference {3}{Compara\IeC {\c c}\IeC {\~a}o entre as duas sub-amostras}}{10}{Comparação entre as duas sub-amostras}{figure.0.3}{}}
\BKM@entry{id=12,dest={73656374696F6E2E302E35},srcline={416}}{436F6E7369646572615C3334375C33363565732066696E616973}
\@writefile{lof}{\contentsline {figure}{\numberline {4}{\ignorespaces Modelo linear log\IeC {\'\i }stico bayesiano}}{11}{figure.0.4}}
\newlabel{fig:glmbayes}{{\M@TitleReference {4}{Modelo linear log\IeC {\'\i }stico bayesiano}}{11}{Modelo linear logístico bayesiano}{figure.0.4}{}}
\@writefile{toc}{\contentsline {section}{\numberline {5}Considera\IeC {\c c}\IeC {\~o}es finais}{11}{section.0.5}}
\newlabel{sec:Considera\IeC {\c c}\IeC {\~o}esFinais}{{\M@TitleReference {5}{Considera\IeC {\c c}\IeC {\~o}es finais}}{11}{Considerações finais}{section.0.5}{}}
\bibdata{abntex2-options,referencias}
\BKM@entry{id=13,dest={73656374696F6E2A2E33},srcline={3}}{52656665725C3335326E63696173}
\bibcite{Amazon.2017}{{Amazon} 2017}
\bibciteEXPL{Amazon.2017}{{Amazon}}
\bibciteIMPL{Amazon.2017}{{Amazon}}
\bibciteYEAR{Amazon.2017}{2017}
\bibcite{Beardsley.2014}{Amrein-Beardsley 2014}
\bibciteEXPL{Beardsley.2014}{Amrein-Beardsley}
\bibciteIMPL{Beardsley.2014}{AMREIN-BEARDSLEY}
\bibciteYEAR{Beardsley.2014}{2014}
\bibcite{Anshari.2017}{Anshari et al. 2017}
\bibciteEXPL{Anshari.2017}{Anshari et al.}
\bibciteIMPL{Anshari.2017}{ANSHARI et al.}
\bibciteYEAR{Anshari.2017}{2017}
\bibcite{Ariely.2009}{Ariely et al. 2009}
\bibciteEXPL{Ariely.2009}{Ariely et al.}
\bibciteIMPL{Ariely.2009}{ARIELY et al.}
\bibciteYEAR{Ariely.2009}{2009}
\bibcite{Arnold.2015}{Arnold e Tilton 2015}
\bibciteEXPL{Arnold.2015}{Arnold e Tilton}
\bibciteIMPL{Arnold.2015}{ARNOLD; TILTON}
\bibciteYEAR{Arnold.2015}{2015}
\bibcite{Arriba.2017}{Arriba 2017}
\bibciteEXPL{Arriba.2017}{Arriba}
\bibciteIMPL{Arriba.2017}{ARRIBA}
\bibciteYEAR{Arriba.2017}{2017}
\bibcite{Asimov.1988}{Asimov 1988}
\bibciteEXPL{Asimov.1988}{Asimov}
\bibciteIMPL{Asimov.1988}{ASIMOV}
\bibciteYEAR{Asimov.1988}{1988}
\bibcite{Baker.2017}{Baker e Kim 2017}
\bibciteEXPL{Baker.2017}{Baker e Kim}
\bibciteIMPL{Baker.2017}{BAKER; KIM}
\bibciteYEAR{Baker.2017}{2017}
\@writefile{toc}{\contentsline {chapter}{Refer\^encias}{12}{section*.3}}
\bibcite{Barros.2000}{Barros 2000}
\bibciteEXPL{Barros.2000}{Barros}
\bibciteIMPL{Barros.2000}{BARROS}
\bibciteYEAR{Barros.2000}{2000}
\bibcite{Bartolucci.2015}{Bartolucci et al. 2015}
\bibciteEXPL{Bartolucci.2015}{Bartolucci et al.}
\bibciteIMPL{Bartolucci.2015}{BARTOLUCCI et al.}
\bibciteYEAR{Bartolucci.2015}{2015}
\bibcite{Bassett.2017}{Bassett et al. 2017}
\bibciteEXPL{Bassett.2017}{Bassett et al.}
\bibciteIMPL{Bassett.2017}{BASSETT et al.}
\bibciteYEAR{Bassett.2017}{2017}
\bibcite{Baumer.2017}{Baumer et al. 2017}
\bibciteEXPL{Baumer.2017}{Baumer et al.}
\bibciteIMPL{Baumer.2017}{BAUMER et al.}
\bibciteYEAR{Baumer.2017}{2017}
\bibcite{Beeley.2016}{Beeley 2016}
\bibciteEXPL{Beeley.2016}{Beeley}
\bibciteIMPL{Beeley.2016}{BEELEY}
\bibciteYEAR{Beeley.2016}{2016}
\bibcite{Belhekar.2016}{Belhekar 2016}
\bibciteEXPL{Belhekar.2016}{Belhekar}
\bibciteIMPL{Belhekar.2016}{BELHEKAR}
\bibciteYEAR{Belhekar.2016}{2016}
\bibcite{Biasutti.2017}{Biasutti 2017}
\bibciteEXPL{Biasutti.2017}{Biasutti}
\bibciteIMPL{Biasutti.2017}{BIASUTTI}
\bibciteYEAR{Biasutti.2017}{2017}
\bibcite{Bloomfield.2014}{Bloomfield 2014}
\bibciteEXPL{Bloomfield.2014}{Bloomfield}
\bibciteIMPL{Bloomfield.2014}{BLOOMFIELD}
\bibciteYEAR{Bloomfield.2014}{2014}
\bibcite{Bolstad.2004}{Bolstad 2004}
\bibciteEXPL{Bolstad.2004}{Bolstad}
\bibciteIMPL{Bolstad.2004}{BOLSTAD}
\bibciteYEAR{Bolstad.2004}{2004}
\bibcite{Brunsdon.2015}{Brunsdon e Comber 2015}
\bibciteEXPL{Brunsdon.2015}{Brunsdon e Comber}
\bibciteIMPL{Brunsdon.2015}{BRUNSDON; COMBER}
\bibciteYEAR{Brunsdon.2015}{2015}
\bibcite{Cairns.2017}{Cairns e Malloch 2017}
\bibciteEXPL{Cairns.2017}{Cairns e Malloch}
\bibciteIMPL{Cairns.2017}{CAIRNS; MALLOCH}
\bibciteYEAR{Cairns.2017}{2017}
\bibcite{Cambridge.2017}{{Cambridge University} 2017}
\bibciteEXPL{Cambridge.2017}{{Cambridge University}}
\bibciteIMPL{Cambridge.2017}{{Cambridge University}}
\bibciteYEAR{Cambridge.2017}{2017}
\bibcite{Cano.2015}{Cano et al. 2015}
\bibciteEXPL{Cano.2015}{Cano et al.}
\bibciteIMPL{Cano.2015}{CANO et al.}
\bibciteYEAR{Cano.2015}{2015}
\bibcite{Carlson.2017}{Carlson 2017}
\bibciteEXPL{Carlson.2017}{Carlson}
\bibciteIMPL{Carlson.2017}{CARLSON}
\bibciteYEAR{Carlson.2017}{2017}
\bibcite{Carr.2011}{Carr 2011}
\bibciteEXPL{Carr.2011}{Carr}
\bibciteIMPL{Carr.2011}{CARR}
\bibciteYEAR{Carr.2011}{2011}
\bibcite{Chan.2015}{Chan 2015}
\bibciteEXPL{Chan.2015}{Chan}
\bibciteIMPL{Chan.2015}{CHAN}
\bibciteYEAR{Chan.2015}{2015}
\bibcite{Chapman.2015}{Chapman e Feit 2015}
\bibciteEXPL{Chapman.2015}{Chapman e Feit}
\bibciteIMPL{Chapman.2015}{CHAPMAN; FEIT}
\bibciteYEAR{Chapman.2015}{2015}
\bibcite{Charpentier.2015}{Charpentier 2015}
\bibciteEXPL{Charpentier.2015}{Charpentier}
\bibciteIMPL{Charpentier.2015}{CHARPENTIER}
\bibciteYEAR{Charpentier.2015}{2015}
\bibcite{Chen.2010}{Chen e Peace 2010}
\bibciteEXPL{Chen.2010}{Chen e Peace}
\bibciteIMPL{Chen.2010}{CHEN; PEACE}
\bibciteYEAR{Chen.2010}{2010}
\bibcite{Samuel.2017}{Chu et al. 2017}
\bibciteEXPL{Samuel.2017}{Chu et al.}
\bibciteIMPL{Samuel.2017}{CHU et al.}
\bibciteYEAR{Samuel.2017}{2017}
\bibcite{Clark.1998}{Clark e Chalmers 1998}
\bibciteEXPL{Clark.1998}{Clark e Chalmers}
\bibciteIMPL{Clark.1998}{CLARK; CHALMERS}
\bibciteYEAR{Clark.1998}{1998}
\bibcite{Columbia.2017}{{Columbia University} 2017}
\bibciteEXPL{Columbia.2017}{{Columbia University}}
\bibciteIMPL{Columbia.2017}{{Columbia University}}
\bibciteYEAR{Columbia.2017}{2017}
\bibcite{Cornell.2017}{{Cornell University} 2017}
\bibciteEXPL{Cornell.2017}{{Cornell University}}
\bibciteIMPL{Cornell.2017}{{Cornell University}}
\bibciteYEAR{Cornell.2017}{2017}
\bibcite{Culver.1998}{Culver 1998}
\bibciteEXPL{Culver.1998}{Culver}
\bibciteIMPL{Culver.1998}{CULVER}
\bibciteYEAR{Culver.1998}{1998}
\bibcite{Curran.2010}{Curran 2010}
\bibciteEXPL{Curran.2010}{Curran}
\bibciteIMPL{Curran.2010}{CURRAN}
\bibciteYEAR{Curran.2010}{2010}
\bibcite{Cutajar.2017}{Cutajar 2017}
\bibciteEXPL{Cutajar.2017}{Cutajar}
\bibciteIMPL{Cutajar.2017}{CUTAJAR}
\bibciteYEAR{Cutajar.2017}{2017}
\bibcite{Daschmann.2014}{Daschmann et al. 2014}
\bibciteEXPL{Daschmann.2014}{Daschmann et al.}
\bibciteIMPL{Daschmann.2014}{DASCHMANN et al.}
\bibciteYEAR{Daschmann.2014}{2014}
\bibcite{Adam.2016}{Eck et al. 2016}
\bibciteEXPL{Adam.2016}{Eck et al.}
\bibciteIMPL{Adam.2016}{ECK et al.}
\bibciteYEAR{Adam.2016}{2016}
\bibcite{Ergul.2013}{Erg\"ul 2013}
\bibciteEXPL{Ergul.2013}{Erg\"ul}
\bibciteIMPL{Ergul.2013}{ERG\"UL}
\bibciteYEAR{Ergul.2013}{2013}
\bibcite{Feigelson.2012}{Feigelson e Babu 2012}
\bibciteEXPL{Feigelson.2012}{Feigelson e Babu}
\bibciteIMPL{Feigelson.2012}{FEIGELSON; BABU}
\bibciteYEAR{Feigelson.2012}{2012}
\bibcite{Feldstein.2011}{Feldstein 2011}
\bibciteEXPL{Feldstein.2011}{Feldstein}
\bibciteIMPL{Feldstein.2011}{FELDSTEIN}
\bibciteYEAR{Feldstein.2011}{2011}
\bibcite{Forbes.2017}{{Forbes} 2017}
\bibciteEXPL{Forbes.2017}{{Forbes}}
\bibciteIMPL{Forbes.2017}{{Forbes}}
\bibciteYEAR{Forbes.2017}{2017}
\bibcite{Freire.1992}{Freire 1992}
\bibciteEXPL{Freire.1992}{Freire}
\bibciteIMPL{Freire.1992}{FREIRE}
\bibciteYEAR{Freire.1992}{1992}
\bibcite{Gelman.2013}{Gelman et al. 2013}
\bibciteEXPL{Gelman.2013}{Gelman et al.}
\bibciteIMPL{Gelman.2013}{GELMAN et al.}
\bibciteYEAR{Gelman.2013}{2013}
\bibcite{Gentleman.2006}{Gentleman et al. 2006}
\bibciteEXPL{Gentleman.2006}{Gentleman et al.}
\bibciteIMPL{Gentleman.2006}{GENTLEMAN et al.}
\bibciteYEAR{Gentleman.2006}{2006}
\bibcite{Giles.2005}{Giles 2005}
\bibciteEXPL{Giles.2005}{Giles}
\bibciteIMPL{Giles.2005}{GILES}
\bibciteYEAR{Giles.2005}{2005}
\bibcite{Gondro.2015}{Gondro 2015}
\bibciteEXPL{Gondro.2015}{Gondro}
\bibciteIMPL{Gondro.2015}{GONDRO}
\bibciteYEAR{Gondro.2015}{2015}
\bibcite{Gonzalez.2017}{Gonz\'alez e Wiberg 2017}
\bibciteEXPL{Gonzalez.2017}{Gonz\'alez e Wiberg}
\bibciteIMPL{Gonzalez.2017}{GONZ\'ALEZ; WIBERG}
\bibciteYEAR{Gonzalez.2017}{2017}
\bibcite{Google.2017}{{Google} 2017}
\bibciteEXPL{Google.2017}{{Google}}
\bibciteIMPL{Google.2017}{{Google}}
\bibciteYEAR{Google.2017}{2017}
\bibcite{Greenstein.2007}{Greenstein 2007}
\bibciteEXPL{Greenstein.2007}{Greenstein}
\bibciteIMPL{Greenstein.2007}{GREENSTEIN}
\bibciteYEAR{Greenstein.2007}{2007}
\bibcite{Gries.2013}{Gries 2013}
\bibciteEXPL{Gries.2013}{Gries}
\bibciteIMPL{Gries.2013}{GRIES}
\bibciteYEAR{Gries.2013}{2013}
\bibcite{Halavais.2008}{Halavais e Lackaff 2008}
\bibciteEXPL{Halavais.2008}{Halavais e Lackaff}
\bibciteIMPL{Halavais.2008}{HALAVAIS; LACKAFF}
\bibciteYEAR{Halavais.2008}{2008}
\bibcite{Norik.2010}{Hara et al. 2010}
\bibciteEXPL{Norik.2010}{Hara et al.}
\bibciteIMPL{Norik.2010}{HARA et al.}
\bibciteYEAR{Norik.2010}{2010}
\bibcite{Harvard.2017}{{Harvard University} 2017}
\bibciteEXPL{Harvard.2017}{{Harvard University}}
\bibciteIMPL{Harvard.2017}{{Harvard University}}
\bibciteYEAR{Harvard.2017}{2017}
\bibcite{Harvey.2000}{Harvey e Koubek 2000}
\bibciteEXPL{Harvey.2000}{Harvey e Koubek}
\bibciteIMPL{Harvey.2000}{HARVEY; KOUBEK}
\bibciteYEAR{Harvey.2000}{2000}
\bibcite{Heimann.2014}{Heimann e Danneman 2014}
\bibciteEXPL{Heimann.2014}{Heimann e Danneman}
\bibciteIMPL{Heimann.2014}{HEIMANN; DANNEMAN}
\bibciteYEAR{Heimann.2014}{2014}
\bibcite{Heyman.2004}{Heyman e Ariely 2004}
\bibciteEXPL{Heyman.2004}{Heyman e Ariely}
\bibciteIMPL{Heyman.2004}{HEYMAN; ARIELY}
\bibciteYEAR{Heyman.2004}{2004}
\bibcite{Hilbe.2017}{Hilbe et al. 2017}
\bibciteEXPL{Hilbe.2017}{Hilbe et al.}
\bibciteIMPL{Hilbe.2017}{HILBE et al.}
\bibciteYEAR{Hilbe.2017}{2017}
\bibcite{Hilbert.2011}{Hilbert e L{\'o}pez 2011}
\bibciteEXPL{Hilbert.2011}{Hilbert e L{\'o}pez}
\bibciteIMPL{Hilbert.2011}{HILBERT; L{\'O}PEZ}
\bibciteYEAR{Hilbert.2011}{2011}
\bibcite{Horgan.2011}{Horgan 2011}
\bibciteEXPL{Horgan.2011}{Horgan}
\bibciteIMPL{Horgan.2011}{HORGAN}
\bibciteYEAR{Horgan.2011}{2011}
\bibcite{Hothorn.2016}{Hothorn 2016}
\bibciteEXPL{Hothorn.2016}{Hothorn}
\bibciteIMPL{Hothorn.2016}{HOTHORN}
\bibciteYEAR{Hothorn.2016}{2016}
\bibcite{IBM.2017}{{IBM} 2017}
\bibciteEXPL{IBM.2017}{{IBM}}
\bibciteIMPL{IBM.2017}{{IBM}}
\bibciteYEAR{IBM.2017}{2017}
\bibcite{ICL.2017}{{Imperial College London} 2014}
\bibciteEXPL{ICL.2017}{{Imperial College London}}
\bibciteIMPL{ICL.2017}{{Imperial College London}}
\bibciteYEAR{ICL.2017}{2014}
\bibcite{Intel.2017}{{Intel} 2017}
\bibciteEXPL{Intel.2017}{{Intel}}
\bibciteIMPL{Intel.2017}{{Intel}}
\bibciteYEAR{Intel.2017}{2017}
\bibcite{Jemielniak.2016}{Jemielniak 2016}
\bibciteEXPL{Jemielniak.2016}{Jemielniak}
\bibciteIMPL{Jemielniak.2016}{JEMIELNIAK}
\bibciteYEAR{Jemielniak.2016}{2016}
\bibcite{Jockers.2014}{Jockers 2014}
\bibciteEXPL{Jockers.2014}{Jockers}
\bibciteIMPL{Jockers.2014}{JOCKERS}
\bibciteYEAR{Jockers.2014}{2014}
\bibcite{Johnson.1998}{Johnson et al. 1998}
\bibciteEXPL{Johnson.1998}{Johnson et al.}
\bibciteIMPL{Johnson.1998}{JOHNSON et al.}
\bibciteYEAR{Johnson.1998}{1998}
\bibcite{Kaas.2008}{Kaas et al. 2008}
\bibciteEXPL{Kaas.2008}{Kaas et al.}
\bibciteIMPL{Kaas.2008}{KAAS et al.}
\bibciteYEAR{Kaas.2008}{2008}
\bibcite{Keim.2007}{Keim 2007}
\bibciteEXPL{Keim.2007}{Keim}
\bibciteIMPL{Keim.2007}{KEIM}
\bibciteYEAR{Keim.2007}{2007}
\bibcite{Khosrow.2017}{Khosrow-Pour 2017}
\bibciteEXPL{Khosrow.2017}{Khosrow-Pour}
\bibciteIMPL{Khosrow.2017}{KHOSROW-POUR}
\bibciteYEAR{Khosrow.2017}{2017}
\bibcite{KCL.2017}{{King's College London} 2017}
\bibciteEXPL{KCL.2017}{{King's College London}}
\bibciteIMPL{KCL.2017}{{King's College London}}
\bibciteYEAR{KCL.2017}{2017}
\bibcite{Kleiber.2008}{Kleiber e Zeileis 2008}
\bibciteEXPL{Kleiber.2008}{Kleiber e Zeileis}
\bibciteIMPL{Kleiber.2008}{KLEIBER; ZEILEIS}
\bibciteYEAR{Kleiber.2008}{2008}
\bibcite{Knoblauch.2012}{Knoblauch e Maloney 2012}
\bibciteEXPL{Knoblauch.2012}{Knoblauch e Maloney}
\bibciteIMPL{Knoblauch.2012}{KNOBLAUCH; MALONEY}
\bibciteYEAR{Knoblauch.2012}{2012}
\bibcite{Lawson.2014}{Lawson 2014}
\bibciteEXPL{Lawson.2014}{Lawson}
\bibciteIMPL{Lawson.2014}{LAWSON}
\bibciteYEAR{Lawson.2014}{2014}
\bibcite{Liao.2009}{Liao 2009}
\bibciteEXPL{Liao.2009}{Liao}
\bibciteIMPL{Liao.2009}{LIAO}
\bibciteYEAR{Liao.2009}{2009}
\bibcite{Lieberman.2013}{Lieberman 2013}
\bibciteEXPL{Lieberman.2013}{Lieberman}
\bibciteIMPL{Lieberman.2013}{LIEBERMAN}
\bibciteYEAR{Lieberman.2013}{2013}
\bibcite{Malone.2016}{Malone et al. 2016}
\bibciteEXPL{Malone.2016}{Malone et al.}
\bibciteIMPL{Malone.2016}{MALONE et al.}
\bibciteYEAR{Malone.2016}{2016}
\bibcite{Mandal.2007}{Mandal 2007}
\bibciteEXPL{Mandal.2007}{Mandal}
\bibciteIMPL{Mandal.2007}{MANDAL}
\bibciteYEAR{Mandal.2007}{2007}
\bibcite{Marchi.2013}{Marchi e Albert 2013}
\bibciteEXPL{Marchi.2013}{Marchi e Albert}
\bibciteIMPL{Marchi.2013}{MARCHI; ALBERT}
\bibciteYEAR{Marchi.2013}{2013}
\bibcite{Markman.2016}{Markman e Duke 2016}
\bibciteEXPL{Markman.2016}{Markman e Duke}
\bibciteIMPL{Markman.2016}{MARKMAN; DUKE}
\bibciteYEAR{Markman.2016}{2016}
\bibcite{MIT.2017}{{Massachusetts Institute of Technology} 2017}
\bibciteEXPL{MIT.2017}{{Massachusetts Institute of Technology}}
\bibciteIMPL{MIT.2017}{{Massachusetts Institute of Technology}}
\bibciteYEAR{MIT.2017}{2017}
\bibcite{MediaWiki.2017}{{MediaWiki 1.29.1} 2017}
\bibciteEXPL{MediaWiki.2017}{{MediaWiki 1.29.1}}
\bibciteIMPL{MediaWiki.2017}{{MediaWiki 1.29.1}}
\bibciteYEAR{MediaWiki.2017}{2017}
\bibcite{Microsoft.2017}{Microsoft 2017}
\bibciteEXPL{Microsoft.2017}{Microsoft}
\bibciteIMPL{Microsoft.2017}{MICROSOFT}
\bibciteYEAR{Microsoft.2017}{2017}
\bibcite{Mikum.2017}{Mikum et al. 2017}
\bibciteEXPL{Mikum.2017}{Mikum et al.}
\bibciteIMPL{Mikum.2017}{MIKUM et al.}
\bibciteYEAR{Mikum.2017}{2017}
\bibcite{Mitnick.2017}{Mitnick 2017}
\bibciteEXPL{Mitnick.2017}{Mitnick}
\bibciteIMPL{Mitnick.2017}{MITNICK}
\bibciteYEAR{Mitnick.2017}{2017}
\bibcite{Monogan.2015}{Monogan 2015}
\bibciteEXPL{Monogan.2015}{Monogan}
\bibciteIMPL{Monogan.2015}{MONOGAN}
\bibciteYEAR{Monogan.2015}{2015}
\bibcite{Moore.2016}{Moore 2016}
\bibciteEXPL{Moore.2016}{Moore}
\bibciteIMPL{Moore.2016}{MOORE}
\bibciteYEAR{Moore.2016}{2016}
\bibcite{Derek.2008}{Muller et al. 2008}
\bibciteEXPL{Derek.2008}{Muller et al.}
\bibciteIMPL{Derek.2008}{MULLER et al.}
\bibciteYEAR{Derek.2008}{2008}
\bibcite{MySQL.2017}{{MySQL 5.7.19} 2017}
\bibciteEXPL{MySQL.2017}{{MySQL 5.7.19}}
\bibciteIMPL{MySQL.2017}{{MySQL 5.7.19}}
\bibciteYEAR{MySQL.2017}{2017}
\bibcite{Nash.1950}{Nash 1950}
\bibciteEXPL{Nash.1950}{Nash}
\bibciteIMPL{Nash.1950}{NASH}
\bibciteYEAR{Nash.1950}{1950}
\bibcite{Nash.1951}{Nash 1951}
\bibciteEXPL{Nash.1951}{Nash}
\bibciteIMPL{Nash.1951}{NASH}
\bibciteYEAR{Nash.1951}{1951}
\bibcite{Singapore.2017}{{National University of Singapore} 2017}
\bibciteEXPL{Singapore.2017}{{National University of Singapore}}
\bibciteIMPL{Singapore.2017}{{National University of Singapore}}
\bibciteYEAR{Singapore.2017}{2017}
\bibcite{Nett.2010}{Nett et al. 2010}
\bibciteEXPL{Nett.2010}{Nett et al.}
\bibciteIMPL{Nett.2010}{NETT et al.}
\bibciteYEAR{Nett.2010}{2010}
\bibcite{Northeastern.2017}{{Northeastern University} 2017}
\bibciteEXPL{Northeastern.2017}{{Northeastern University}}
\bibciteIMPL{Northeastern.2017}{{Northeastern University}}
\bibciteYEAR{Northeastern.2017}{2017}
\bibcite{Ohri.2014}{Ohri 2014}
\bibciteEXPL{Ohri.2014}{Ohri}
\bibciteIMPL{Ohri.2014}{OHRI}
\bibciteYEAR{Ohri.2014}{2014}
\bibcite{Oracle.2017}{{Oracle} 2017}
\bibciteEXPL{Oracle.2017}{{Oracle}}
\bibciteIMPL{Oracle.2017}{{Oracle}}
\bibciteYEAR{Oracle.2017}{2017}
\bibcite{Ortutay.2017}{Ortutay e Ortutay 2017}
\bibciteEXPL{Ortutay.2017}{Ortutay e Ortutay}
\bibciteIMPL{Ortutay.2017}{ORTUTAY; ORTUTAY}
\bibciteYEAR{Ortutay.2017}{2017}
\bibcite{Oxford.2017}{{Oxford University} 2017}
\bibciteEXPL{Oxford.2017}{{Oxford University}}
\bibciteIMPL{Oxford.2017}{{Oxford University}}
\bibciteYEAR{Oxford.2017}{2017}
\bibcite{Palangana.2015}{Palangana 2015}
\bibciteEXPL{Palangana.2015}{Palangana}
\bibciteIMPL{Palangana.2015}{PALANGANA}
\bibciteYEAR{Palangana.2015}{2015}
\bibcite{Paradis.2011}{Paradis 2011}
\bibciteEXPL{Paradis.2011}{Paradis}
\bibciteIMPL{Paradis.2011}{PARADIS}
\bibciteYEAR{Paradis.2011}{2011}
\bibcite{Pfaff.2016}{Pfaff 2016}
\bibciteEXPL{Pfaff.2016}{Pfaff}
\bibciteIMPL{Pfaff.2016}{PFAFF}
\bibciteYEAR{Pfaff.2016}{2016}
\bibcite{Pfeil.2006}{Pfeil et al. 2006}
\bibciteEXPL{Pfeil.2006}{Pfeil et al.}
\bibciteIMPL{Pfeil.2006}{PFEIL et al.}
\bibciteYEAR{Pfeil.2006}{2006}
\bibcite{PHP.2017}{{PHP 7.2.0} 2017}
\bibciteEXPL{PHP.2017}{{PHP 7.2.0}}
\bibciteIMPL{PHP.2017}{{PHP 7.2.0}}
\bibciteYEAR{PHP.2017}{2017}
\bibcite{Plant.2012}{Plant 2012}
\bibciteEXPL{Plant.2012}{Plant}
\bibciteIMPL{Plant.2012}{PLANT}
\bibciteYEAR{Plant.2012}{2012}
\bibcite{Powell.2008}{Powell 2008}
\bibciteEXPL{Powell.2008}{Powell}
\bibciteIMPL{Powell.2008}{POWELL}
\bibciteYEAR{Powell.2008}{2008}
\bibcite{Qs.2017}{QS 2017}
\bibciteEXPL{Qs.2017}{QS}
\bibciteIMPL{Qs.2017}{QS}
\bibciteYEAR{Qs.2017}{2017}
\bibcite{R.2017}{R 2017}
\bibciteEXPL{R.2017}{R}
\bibciteIMPL{R.2017}{R}
\bibciteYEAR{R.2017}{2017}
\bibcite{Rahurkar.2010}{Rahurkar et al. 2010}
\bibciteEXPL{Rahurkar.2010}{Rahurkar et al.}
\bibciteIMPL{Rahurkar.2010}{RAHURKAR et al.}
\bibciteYEAR{Rahurkar.2010}{2010}
\bibcite{RDocumentation.2017}{RDocumentation 2017}
\bibciteEXPL{RDocumentation.2017}{RDocumentation}
\bibciteIMPL{RDocumentation.2017}{RDOCUMENTATION}
\bibciteYEAR{RDocumentation.2017}{2017}
\bibcite{Resnick.2014}{Resnick 2014}
\bibciteEXPL{Resnick.2014}{Resnick}
\bibciteIMPL{Resnick.2014}{RESNICK}
\bibciteYEAR{Resnick.2014}{2014}
\bibcite{Resnick.2017}{Resnick 2017}
\bibciteEXPL{Resnick.2017}{Resnick}
\bibciteIMPL{Resnick.2017}{RESNICK}
\bibciteYEAR{Resnick.2017}{2017}
\bibcite{Rilling.2002}{Rilling et al. 2002}
\bibciteEXPL{Rilling.2002}{Rilling et al.}
\bibciteIMPL{Rilling.2002}{RILLING et al.}
\bibciteYEAR{Rilling.2002}{2002}
\bibcite{Samatova.2013}{Samatova et al. 2013}
\bibciteEXPL{Samatova.2013}{Samatova et al.}
\bibciteIMPL{Samatova.2013}{SAMATOVA et al.}
\bibciteYEAR{Samatova.2013}{2013}
\bibcite{Sanbonmatsu.2013}{Sanbonmatsu et al. 2013}
\bibciteEXPL{Sanbonmatsu.2013}{Sanbonmatsu et al.}
\bibciteIMPL{Sanbonmatsu.2013}{SANBONMATSU et al.}
\bibciteYEAR{Sanbonmatsu.2013}{2013}
\bibcite{Santos.2014}{Santos e Bocheco 2014}
\bibciteEXPL{Santos.2014}{Santos e Bocheco}
\bibciteIMPL{Santos.2014}{SANTOS; BOCHECO}
\bibciteYEAR{Santos.2014}{2014}
\bibcite{Shahbaba.2011}{Shahbaba 2011}
\bibciteEXPL{Shahbaba.2011}{Shahbaba}
\bibciteIMPL{Shahbaba.2011}{SHAHBABA}
\bibciteYEAR{Shahbaba.2011}{2011}
\bibcite{Shapiro.1965}{Shapiro e Wilk 1965}
\bibciteEXPL{Shapiro.1965}{Shapiro e Wilk}
\bibciteIMPL{Shapiro.1965}{SHAPIRO; WILK}
\bibciteYEAR{Shapiro.1965}{1965}
\bibcite{Siegel.2013}{Siegel 2013}
\bibciteEXPL{Siegel.2013}{Siegel}
\bibciteIMPL{Siegel.2013}{SIEGEL}
\bibciteYEAR{Siegel.2013}{2013}
\bibcite{Smith.2017}{Smith 2017}
\bibciteEXPL{Smith.2017}{Smith}
\bibciteIMPL{Smith.2017}{SMITH}
\bibciteYEAR{Smith.2017}{2017}
\bibcite{Stanford.2017}{{Stanford University} 2017}
\bibciteEXPL{Stanford.2017}{{Stanford University}}
\bibciteIMPL{Stanford.2017}{{Stanford University}}
\bibciteYEAR{Stanford.2017}{2017}
\bibcite{Stevens.2009}{Stevens 2009}
\bibciteEXPL{Stevens.2009}{Stevens}
\bibciteIMPL{Stevens.2009}{STEVENS}
\bibciteYEAR{Stevens.2009}{2009}
\bibcite{Surowiecki.2005}{Surowiecki 2005}
\bibciteEXPL{Surowiecki.2005}{Surowiecki}
\bibciteIMPL{Surowiecki.2005}{SUROWIECKI}
\bibciteYEAR{Surowiecki.2005}{2005}
\bibcite{Tattar.2016}{Tattar et al. 2016}
\bibciteEXPL{Tattar.2016}{Tattar et al.}
\bibciteIMPL{Tattar.2016}{TATTAR et al.}
\bibciteYEAR{Tattar.2016}{2016}
\bibcite{Munich.2017}{{Technical University of Munich} 2017}
\bibciteEXPL{Munich.2017}{{Technical University of Munich}}
\bibciteIMPL{Munich.2017}{{Technical University of Munich}}
\bibciteYEAR{Munich.2017}{2017}
\bibcite{ANU.2017}{{The Australian National University} 2017}
\bibciteEXPL{ANU.2017}{{The Australian National University}}
\bibciteIMPL{ANU.2017}{{The Australian National University}}
\bibciteYEAR{ANU.2017}{2017}
\bibcite{Hopkins.2017}{{The Johns Hopkins University} 2017}
\bibciteEXPL{Hopkins.2017}{{The Johns Hopkins University}}
\bibciteIMPL{Hopkins.2017}{{The Johns Hopkins University}}
\bibciteYEAR{Hopkins.2017}{2017}
\bibcite{Chicago.2017}{{The University of Chicago} 2015}
\bibciteEXPL{Chicago.2017}{{The University of Chicago}}
\bibciteIMPL{Chicago.2017}{{The University of Chicago}}
\bibciteYEAR{Chicago.2017}{2015}
\bibcite{Edinburgh.2017}{{The University of Edinburgh} 2017}
\bibciteEXPL{Edinburgh.2017}{{The University of Edinburgh}}
\bibciteIMPL{Edinburgh.2017}{{The University of Edinburgh}}
\bibciteYEAR{Edinburgh.2017}{2017}
\bibcite{Kong.2017}{{The University of Hong Kong} 2017}
\bibciteEXPL{Kong.2017}{{The University of Hong Kong}}
\bibciteIMPL{Kong.2017}{{The University of Hong Kong}}
\bibciteYEAR{Kong.2017}{2017}
\bibcite{Trivers.1971}{Trivers 1971}
\bibciteEXPL{Trivers.1971}{Trivers}
\bibciteIMPL{Trivers.1971}{TRIVERS}
\bibciteYEAR{Trivers.1971}{1971}
\bibcite{Trocky.2016}{Trocky e Buckley 2016}
\bibciteEXPL{Trocky.2016}{Trocky e Buckley}
\bibciteIMPL{Trocky.2016}{TROCKY; BUCKLEY}
\bibciteYEAR{Trocky.2016}{2016}
\bibcite{UNICAMP.2017}{{Universidade Estadual de Campinas} 2017}
\bibciteEXPL{UNICAMP.2017}{{Universidade Estadual de Campinas}}
\bibciteIMPL{UNICAMP.2017}{{Universidade Estadual de Campinas}}
\bibciteYEAR{UNICAMP.2017}{2017}
\bibcite{USP.2017}{{Universidade Federal de S\IeC {\~a}o Paulo} 2017}
\bibciteEXPL{USP.2017}{{Universidade Federal de S\IeC {\~a}o Paulo}}
\bibciteIMPL{USP.2017}{{Universidade Federal de S\IeC {\~a}o Paulo}}
\bibciteYEAR{USP.2017}{2017}
\bibcite{UCL.2017}{{University College London} 2017}
\bibciteEXPL{UCL.2017}{{University College London}}
\bibciteIMPL{UCL.2017}{{University College London}}
\bibciteYEAR{UCL.2017}{2017}
\bibcite{Oregon.2016}{{University of Oregon} 2016}
\bibciteEXPL{Oregon.2016}{{University of Oregon}}
\bibciteIMPL{Oregon.2016}{{University of Oregon}}
\bibciteYEAR{Oregon.2016}{2016}
\bibcite{Toronto.2017}{{University of Toronto} 2017}
\bibciteEXPL{Toronto.2017}{{University of Toronto}}
\bibciteIMPL{Toronto.2017}{{University of Toronto}}
\bibciteYEAR{Toronto.2017}{2017}
\bibcite{Zurich.2017}{{University of Zurich} 2017}
\bibciteEXPL{Zurich.2017}{{University of Zurich}}
\bibciteIMPL{Zurich.2017}{{University of Zurich}}
\bibciteYEAR{Zurich.2017}{2017}
\bibcite{Veer.2014}{Veer e Bailey 2014}
\bibciteEXPL{Veer.2014}{Veer e Bailey}
\bibciteIMPL{Veer.2014}{VEER; BAILEY}
\bibciteYEAR{Veer.2014}{2014}
\bibcite{Vinod.2009}{Vinod 2009}
\bibciteEXPL{Vinod.2009}{Vinod}
\bibciteIMPL{Vinod.2009}{VINOD}
\bibciteYEAR{Vinod.2009}{2009}
\bibcite{Vinod.2011}{Vinod 2011}
\bibciteEXPL{Vinod.2011}{Vinod}
\bibciteIMPL{Vinod.2011}{VINOD}
\bibciteYEAR{Vinod.2011}{2011}
\bibcite{Vygotsky.2014}{Vygotsky 2014}
\bibciteEXPL{Vygotsky.2014}{Vygotsky}
\bibciteIMPL{Vygotsky.2014}{VYGOTSKY}
\bibciteYEAR{Vygotsky.2014}{2014}
\bibcite{Well.2016}{Wells 2016}
\bibciteEXPL{Well.2016}{Wells}
\bibciteIMPL{Well.2016}{WELLS}
\bibciteYEAR{Well.2016}{2016}
\bibcite{Wikipedia.2017a}{Wikip\'edia 2017}
\bibciteEXPL{Wikipedia.2017a}{Wikip\'edia}
\bibciteIMPL{Wikipedia.2017a}{WIKIP\'EDIA}
\bibciteYEAR{Wikipedia.2017a}{2017a}
\bibcite{Nupedia.2017}{Wikip\'edia 2017}
\bibciteEXPL{Nupedia.2017}{Wikip\'edia}
\bibciteIMPL{Nupedia.2017}{WIKIP\'EDIA}
\bibciteYEAR{Nupedia.2017}{2017b}
\bibcite{Wilcox.2011}{Wilcox 2011}
\bibciteEXPL{Wilcox.2011}{Wilcox}
\bibciteIMPL{Wilcox.2011}{WILCOX}
\bibciteYEAR{Wilcox.2011}{2011}
\bibcite{Willekens.2014}{Willekens 2014}
\bibciteEXPL{Willekens.2014}{Willekens}
\bibciteIMPL{Willekens.2014}{WILLEKENS}
\bibciteYEAR{Willekens.2014}{2014}
\bibcite{Yale.2017}{{Yale University} 2017}
\bibciteEXPL{Yale.2017}{{Yale University}}
\bibciteIMPL{Yale.2017}{{Yale University}}
\bibciteYEAR{Yale.2017}{2017}
\bibcite{Zakharov.2017}{Zakharov et al. 2017}
\bibciteEXPL{Zakharov.2017}{Zakharov et al.}
\bibciteIMPL{Zakharov.2017}{ZAKHAROV et al.}
\bibciteYEAR{Zakharov.2017}{2017}
\bibcite{Zhao.2011}{Zhao et al. 2011}
\bibciteEXPL{Zhao.2011}{Zhao et al.}
\bibciteIMPL{Zhao.2011}{ZHAO et al.}
\bibciteYEAR{Zhao.2011}{2011}
\bibcite{Zhiqiang.2009}{Zhiqiang et al. 2009}
\bibciteEXPL{Zhiqiang.2009}{Zhiqiang et al.}
\bibciteIMPL{Zhiqiang.2009}{ZHIQIANG et al.}
\bibciteYEAR{Zhiqiang.2009}{2009}
\bibstyle{abntex2-alf}
\memsetcounter{lastsheet}{22}
\memsetcounter{lastpage}{22}
