Countryname;p2010;p2011;p2012;p2013;m2010;m2011;m2012;m2013
Afghanistan;28397812;29105480;29824536;30551674;5162440198;6344642495;7152304412;7288702809
Albania;2856673;2829337;2801681;2773620;2540673567;2471402948;2599863604;2773278168
Algeria;37062820;37762962;38481705;39208194;170461126575;191369117586;200586904406;201436605684
American Samoa;55636;55274;55128;55165;;;;
Andorra;77907;77865;78360;79218;;;;
Angola;19549124;20180490;20820525;21471618;19749472847;28786209253;33414773293;32780375986
Antigua and Barbuda;87233;88152;89069;89985;136600154;147868736;162045102;202580587
Argentina;40374224;40728738;41086927;41446246;52207540132;46265809101;43223271091;30533921358
Armenia;2963496;2964120;2969081;2976566;1865824194;1932472154;1799374401;2251610256
Aruba;101597;101932;102384;102911;708713690;689775980;768622300;653170670
Australia;22031800;22340000;22723900;23130900;42267779109;46714035204;49138172511;52837031644
Austria;8389771;8406187;8429991;8473786;22241612908;24769009817;27211429934;23316759301
Azerbaijan;9054332;9173082;9295784;9416598;6409059001;10273926427;11277345766;15175667852
Bahamas The;360498;366331;371960;377374;1044153229;1070217927;846941350;807408442
Bahrain;1251513;1292764;1317827;1332171;5299462793;4774195661;5454261329;5527718607
Bangladesh;151125475;152862431;154695368;156594962;11174826634;9174751649;12754226945;18087689732
Barbados;280396;281804;283221;284644;833540656;812597135;839722755;680957879
Belarus;9490000;9473000;9464000;9466000;5025438896;7863287455;8094991248;6655081872
Belgium;10920272;11047744;11128246;11195138;26779037381;29114293149;30768940133;26946180324
Belize;308595;316280;324060;331900;217999642;237114352;288924771;402752316
Benin;9509798;9779795;10050702;10323474;1200056092;887440323;712841291;694897254
Bermuda;65124;64564;64798;65024;;;;
Bhutan;716939;729429;741822;753947;1002139067;789643783;954678386;991306683
Bolivia;10156601;10324445;10496285;10671200;9730683155;11994673841;13924289462;14429068857
Bosnia and Herzegovina;3845929;3839322;3833916;3829307;4411161779;4247540641;4389987071;4984005032
Botswana;1969341;1986701;2003910;2021144;7885214847;8081886378;7627972598;7726052557
Brazil;195210154;196935134;198656019;200361925;288574603560;352010241721;373160978076;358816426347
Brunei Darussalam;400569;406512;412238;417784;1563161416;2583675749;3449167942;3575274093
Bulgaria;7395599;7348328;7305888;7265115;17223201500;17215734344;20507099766;19883353585
Burkina Faso;15540284;15995313;16460141;16934839;1068222788;956998718;1024520941;628473053
Burundi;9232753;9540362;9849569;10162532;332084673;295447545;308757023;329308253
Cabo Verde;487601;490556;494401;498897;382190168;338617844;375841715;475334071
Cambodia;14364931;14605862;14864646;15135169;3817077503;4061785443;4932648801;4997865520
Cameroon;20624343;21156272;21699631;22253959;3642642678;3198717824;3380703264;
Canada;34005274;34342780;34754312;35158304;57151120474;65819020599;68546344305;71937092647
Cayman Islands;55509;56601;57570;58435;;;;
Central African Republic;4349921;4436217;4525209;4616417;181175441;154510980;157902474;
Chad;11720781;12080037;12448175;12825314;632405277;951097173;1155659287;
Chile;17150760;17308449;17464814;17619708;27827446021;41943894923;41649256374;41093253504
China;1337705000;1344130000;1350695000;1357380000;2913711653594;3254674122432;3387512975177;3880368275099
Colombia;46444798;47078792;47704427;48321405;28076151760;31895551159;36997795909;43158796415
Comoros;683081;700216;717503;734917;146075847;156064597;195019558;174071480
Congo Dem Rep;62191161;63931512;65705093;67513677;1299650366;1267501775;1632551683;1678465605
Congo Rep;4111715;4225359;4337051;4447632;4446850231;5641136491;5549563323;
Costa Rica;4669685;4737680;4805295;4872166;4630019189;4758491539;6859854866;7333154703
Cote d'Ivoire;18976588;19389954;19839750;20316086;3624373055;4315950262;3928131118;4242680202
Croatia;4417781;4280622;4267558;4252700;14132504961;14483806529;14807134355;17766773694
Cuba;11281768;11276053;11270957;11265629;;;;
Curacao;149311;150612;152056;153500;;;;
Cyprus;1103685;1116513;1128994;1141166;1141718168;1187123277;1191085668;916262005
Czech Republic;10474410;10496088;10510785;10521468;42482656052;40283021631;44884691160;56217653239
Denmark;5547683;5570572;5591572;5613706;76510012566;84955231791;89697829949;88676585996
Djibouti;834036;846646;859652;872932;248997840;244112138;248630001;424961518
Dominica;71167;71401;71684;72003;76099711;81120952;94562316;87050887
Dominican Republic;10016797;10147598;10276621;10403761;3874458384;4114429388;3558641728;4700626509
Ecuador;15001072;15246481;15492264;15737878;2622493198;2957999566;2486036149;4345840372
Egypt Arab Rep;78075705;79392466;80721874;82056378;37028502252;18637544532;15672468061;16536237510
El Salvador;6218195;6256242;6297394;6340454;2895829462;2508333196;3192804738;2756944313
Equatorial Guinea;696167;715996;736296;757014;2346355093;3053840680;4396979380;
Eritrea;5741159;5932852;6130922;6333135;114149586;114795759;;
Estonia;1331475;1327439;1325016;1324612;2567137793;207115955;300659811;314406189
Ethiopia;87095281;89393063;91728849;94100756;;;;
Faeroe Islands;49581;49551;49506;49469;;;;
Fiji;860559;867921;874742;881065;720523037;833453746;921305928;941827050
Finland;5363352;5388272;5413971;5439407;9547420312;10276064354;11082345110;11272358255
France;65023142;65343588;65676758;66028467;165852027739;168490352254;184521827260;145161120116
French Polynesia;268065;270874;273814;276831;;;;
Gabon;1556222;1594034;1632572;1671711;1735882498;2157317436;2351562322;
Gambia The;1680640;1734966;1791225;1849285;201627503;223241962;236241444;210553619
Georgia;4452800;4483350;4490700;4476900;2263794188;2818191709;2872949040;2823383636
Germany;81776930;81797673;80425823;80621788;215977859080;234104163354;248856492402;198535181129
Ghana;24262901;24820706;25366462;25904598;5158150247;5913601209;5835098357;5587739324
Greece;11153454;11123213;11092771;11032328;6352402264;6743420207;7255024443;5763072026
Greenland;56905;56890;56810;56483;;;;
Grenada;104677;105074;105483;105897;119154929;120710961;119485008;150571024
Guam;159440;160858;162810;165124;;;;
Guatemala;14341576;14706578;15082831;15468203;5948552636;6174185938;6693770290;7269204490
Guinea;10876033;11161530;11451273;11745189;126266871;114039942;166776927;182588508
Guinea-Bissau;1586624;1624228;1663558;1704255;156432568;219999196;164589212;186251183
Guyana;786126;790882;795369;799613;782063523;801777706;864028135;783621045
Haiti;9896400;10032864;10173775;10317461;1336870706;1196707616;1286636465;1805763774
Honduras;7621204;7776669;7935846;8097688;2700862752;2783395440;2531827560;3008371882
Hong Kong SAR China;7024200;7071600;7154600;7187500;268743168500;285398502318;317362272184;311209660738
Hungary;10000023;9971727;9920362;9897247;44988178945;48831920688;44670620439;46508014070
Iceland;318041;319014;320716;323002;5788562363;8548044336;4191506847;4237652279
India;1205624648;1221156319;1236686732;1252139596;300480145804;298739485811;300425518088;298092483487
Indonesia;240676485;243801639;246864191;249865631;96210971536;110136605627;112797628044;99386827825
Iran Islamic Rep;74462314;75424285;76424443;77447168;;;;
Iraq;30962380;31760020;32578209;33417476;50622110875;61033126542;70327020092;77747259730
Ireland;4560155;4576794;4586897;4595281;2113853184;1694809705;1707531969;1635950589
Isle of Man;83992;84654;85284;85888;;;;
Israel;7623600;7765800;7910500;8059400;70907305713;74874115250;75907618835;81785519418
Italy;59277417;59379449;59539717;59831093;158478269235;169872401864;181670319828;145724517429
Jamaica;2690824;2699838;2707805;2715000;2501093861;2281910489;1996447969;1818363942
Japan;127450459;127817277;127561489;127338621;1096068589804;1295838776760;1268085526650;1266851419539
Jordan;6046000;6181000;6318000;6459000;13632982841;12094961146;8830598061;13826036064
Kazakhstan;16321581;16556600;16791425;17037508;28264707689;29215277000;28299368260;24691645608
Kenya;40909194;42027891;43178141;44353691;4320857457;4265145810;5711831327;6598881896
Kiribati;97743;99250;100786;102351;;;;
Korea Dem Rep;24500520;24631291;24763188;24895480;;;;
Korea Rep;49410366;49779440;50004441;50219669;292143480407;306934543258;327724416297;345694101316
Kosovo;1775680;1790957;1807106;1824000;846409246;741536735;1108094446;1102915208
Kuwait;2991580;3124705;3250496;3368572;24804544868;29681600241;33109778171;32410160396
Kyrgyz Republic;5447900;5514600;5607200;5719500;1720378195;1831422497;2066679073;2238390695
Lao PDR;6395713;6521314;6645827;6769727;1104519904;1178202761;1274038876;1064915567
Latvia;2097555;2059709;2034319;2013385;7605712549;6378031619;7524707971;7895272180
Lebanon;4341092;4382790;4424888;4467390;44475630274;47859469369;52530986924;47855927736
Lesotho;2008921;2029516;2051545;2074465;1070956474;919086078;1027908712;1055235476
Liberia;3957990;4079697;4190435;4294077;465899496;512830948;497221385;493099664
Libya;6040612;6103233;6154623;6201521;106144240867;110538568687;124647554387;119714243055
Liechtenstein;36120;36388;36656;36925;;;;
Lithuania;3097282;3028115;2987773;2956121;6598353023;8201665408;8529340692;8072526095
Luxembourg;506953;518347;530946;543202;848319028;1010735789;990807545;963141341
Macao SAR China;534626;546278;556783;566375;23726490182;34026184617;16600225451;16145878199
Macedonia FYR;2102216;2103890;2105575;2107158;2276767086;2667393351;2891478811;2747604658
Madagascar;21079532;21678934;22293914;22924851;1022970239;1134559983;1052810926;776146733
Malawi;15013694;15457531;15906483;16362567;325348522;217026455;244599529;428566515
Malaysia;28275835;28758968;29239927;29716965;106528115589;133571691894;139730782870;134853703846
Maldives;325694;331964;338442;345023;364318766;348650282;318266640;381885333
Mali;13985961;14416737;14853572;15301650;1344375978;1378583494;1341368318;1305710203
Malta;414508;416268;419455;423282;540153473;515098491;704900061;596933409
Marshall Islands;52428;52495;52555;52634;;;;
Mauritania;3609420;3702763;3796141;3889880;287851716;502324715;968635711;
Mauritius;1280924;1286051;1291167;1296303;2618620225;2775246242;3053007554;3490768018
Mexico;117886404;119361233;120847477;122332399;120583999941;149208131605;167075785815;180200037032
Micronesia Fed Sts;103619;103424;103395;103549;55763821;75062439;76796331;84343101
Moldova;3562045;3559986;3559519;3559000;1717685351;1965325537;2515016645;2820638989
Monaco;36845;37261;37579;37831;;;;
Mongolia;2712738;2754209;2796484;2839073;2287769227;2447812100;4126178226;2247858008
Montenegro;620078;620644;621081;621383;556155061;392694777;458665570;583975035
Morocco;31642360;32059424;32521143;33008150;23609251321;20611298055;17535001424;19257711886
Mozambique;23967265;24581367;25203395;25833752;2265087873;2591542032;2961916708;3353349558
Myanmar;51931231;52350763;52797319;53259018;6045321159;7361702606;7352900705;
Namibia;2178967;2217618;2259393;2303315;1695690507;1786689890;1745866243;1511161817
Nepal;26846016;27156367;27474377;27797457;3594889666;4500643168;5584734815;6700496257
Netherlands;16615394;16693074;16754962;16804224;46146854478;50411074277;54816126997;46309218934
New Caledonia;250000;254000;258000;262000;;;;
New Zealand;4367800;4405200;4433000;4470800;16722649840;17011949838;17582960818;16317765993
Nicaragua;5822209;5905146;5991733;6080478;1798980796;1892248902;1887214950;1992960852
Niger;15893746;16511462;17157042;17831270;760292731;673044180;1014505220;1166625534
Nigeria;159707780;164192925;168833776;173615345;35884925669;36263658533;47548404717;
Northern Mariana Islands;53860;53230;53305;53855;;;;
Norway;4889252;4953088;5018573;5084190;52797901977;49397097549;51856399865;58283144151
Oman;2802768;3024774;3314001;3632444;13025234533;14366194745;14401122686;15951037506
Pakistan;173149306;176166353;179160111;182142594;17255566250;17697928679;13688479842;7651260561
Palau;20470;20606;20754;20918;;;;
Panama;3678128;3740282;3802281;3864170;2714468988;2303728083;2466273040;2847991160
Papua New Guinea;6858945;7012977;7167010;7321262;3121182796;4352806377;4035177910;2850601825
Paraguay;6459721;6573097;6687361;6802295;4166638690;4982546521;4994947887;5872875328
Peru;29262830;29614887;29987800;30375603;44214810908;48913130103;64155414321;65766067911
Philippines;93444322;95053437;96706764;98393574;62326282640;75123093542;83788600632;83182371931
Poland;38183683;38534157;38535873;38530725;93472496388;97712443397;108902203765;106221492601
Portugal;10573100;10557560;10514844;10459806;20936752414;20801308752;22658232543;17589254770
Puerto Rico;3721208;3686580;3651545;3615086;;;;
Qatar;1749713;1910902;2050514;2168673;31181696694;16809492258;33185072571;42082172851
Romania;20246871;20147528;20076727;19963581;48047827695;48044370164;46711176521;48827640866
Russian Federation;142385523;142956460;143178000;143499861;479222291459;497410247573;537816373775;509692081493
Rwanda;10836732;11144315;11457801;11776522;812754517;1050038984;847796984;1070497572
Samoa;186029;187429;188889;190372;209444850;166792608;168670066;170853058
San Marino;30861;31048;31247;31448;449161541;341859677;384950975;539289275
Sao Tome and Principe;178228;183177;188098;192993;48170331;52305024;51629944;63824496
Saudi Arabia;27258387;27761728;28287855;28828870;459313156024;556570991484;673739617131;737796506890
Senegal;12950564;13330737;13726021;14133280;2047480435;1945652263;2081616878;2253099055
Serbia;7291436;7234099;7199077;7163976;13307506849;15583042927;14402950164;15431775105
Seychelles;89770;87441;88303;89173;255584666;279115104;308093542;425902444
Sierra Leone;5751976;5865491;5978727;6092075;408971189;439131439;477987080;532538106
Singapore;5076700;5183700;5312400;5399200;231259737737;243798278361;265910197870;277797712875
Sint Maarten (Dutch part);37850;38486;39088;39689;;;;
Slovak Republic;5391428;5398384;5407579;5414095;2155731815;2417987711;2519014816;2152916793
Slovenia;2048583;2052843;2057159;2060484;1070759591;986894541;951915204;922155566
Solomon Islands;526447;537997;549598;561231;265834936;412272194;498913805;520474145
Somalia;9636173;9907903;10195134;10495583;;;;
South Africa;50895698;51579599;52274945;52981991;43819537260;48748267722;50688078607;49708176471
South Sudan;9940929;10381110;10837527;11296173;;;;
Spain;46576897;46742697;46761264;46647421;31871818385;46704854403;50588476002;46335468959
Sri Lanka;20653000;20869000;20328000;20483000;7195358272;6739196757;7106460354;7500000920
St Kitts and Nevis;52352;52971;53584;54191;168859093;244261297;263485329;301952578
St Lucia;177397;179271;180870;182273;206256108;213433753;231967201;192222647
St Martin (French part);30235;30615;30959;31264;;;;
St Vincent and the Grenadines;109316;109357;109373;109373;112702052;89626362;111021926;135096712
Sudan;35652002;36430923;37195349;37964306;1036243575;192529863;192632629;192957046
Suriname;524960;529761;534541;539276;690815201;816878553;1008868445;775413077
Swaziland;1193148;1212159;1230985;1249514;756343903;600507642;740960099;762540984
Sweden;9378126;9449213;9519374;9592552;48246134947;50213905875;52245310988;65363362011
Switzerland;7824909;7912398;7996861;8081482;270479800683;330585901719;531302253382;536235292234
Syrian Arab Republic;21532647;21961676;22399254;22845550;20631905973;;;
Tajikistan;7627326;7814850;8008990;8207834;403106503;518942427;630690459;661311931
Tanzania;44973330;46354607;47783107;49253126;3904675773;3726159099;4052224356;4673729944
Thailand;66402316;66576332;66785001;67010502;172027929604;174891027448;181481264214;167230224743
Timor-Leste;1066409;1120392;1148958;1178252;406188347;461610913;883551412;686998209
Togo;6306014;6472304;6642928;6816982;714940238;774299059;441596650;507052047
Tonga;104098;104554;104941;105323;104527409;143294547;152403990;155520945
Trinidad and Tobago;1328095;1333082;1337439;1341151;9692265704;10500563638;9897184233;10674858420
Tunisia;10549100;10673800;10777500;10886500;9764263623;7785306752;8717830233;7550027746
Turkey;72137546;73058638;73997128;74932641;85959456531;87937258383;119182966095;131053848307
Turkmenistan;5041995;5106668;5172931;5240072;;;;
Turks and Caicos Islands;30993;31726;32427;33098;;;;
Tuvalu;9827;9844;9860;9876;;;;
Uganda;33987213;35148064;36345860;37578876;2706004330;2617417255;3168589371;3337539480
Ukraine;45870700;45706100;45593300;45489600;34571298904;31788750955;24552796497;20413622008
United Arab Emirates;8441537;8925096;9205651;9346129;32785288698;37269321629;47035150518;68202651336
United Kingdom;62766365;63258918;63695687;64097085;82364656565;94544038250;105194404564;104418669118
United States;309326295;311582564;313873685;316128839;488928295253;537267272428;574268090541;448508967142
Uruguay;3371982;3383486;3395253;3407062;7655536745;10301680017;13604619952;16280547525
Uzbekistan;28562400;29339400;29774500;30241100;;;;
Vanuatu;236299;241778;247262;252763;161382116;173789338;;
Venezuela RB;29043283;29500625;29954782;30405207;29665461757;27934662155;29468789445;20275218555
Vietnam;86932500;87840000;88772900;89708900;12466599340;13539120120;25573282262;25893489896
Virgin Islands (US);106267;105784;105275;104737;;;;
West Bank and Gaza;3811102;3927051;4046901;4169506;;;;
Yemen Rep;22763008;23304206;23852409;24407381;5938627911;4525489511;6150781026;5344296890
Zambia;13216985;13633796;14075099;14538640;2093751340;2324019792;3042223893;2683813722
Zimbabwe;13076978;13358738;13724317;14149648;731778238;660229985;575552821;474968788
