<svg xmlns="http://www.w3.org/2000/svg" width="289.033" height="240.776" viewBox="0 0 289.033 240.776">
  <g id="Group_760" data-name="Group 760" transform="translate(-22 -93)">
    <g id="group" transform="translate(22 115.525)">
      <path id="path" d="M163.812,346.566a44.328,44.328,0,0,1-17.936-4.153l-30.364-13.29c-7.311,3.909-13.062,5.863-17.059,5.863a7.145,7.145,0,0,1-3.314-.684c-1.121-.44-3.948-2.052-8.676-7.915-5.313-6.547-8.968-27.117-9.7-31.515L48.886,261.4H44.061c-1.121,0-3.948-.391-5.995-3.86-1.95-3.274-4.143-18.127-4.63-21.5a102.728,102.728,0,0,1-3.363-14.8,16.487,16.487,0,0,1,1.316-8.355,5.44,5.44,0,0,1-3.217-2.3c-.292-.44-2.632-4.5-1.365-8.062a6.208,6.208,0,0,1,4.045-3.762c4.533-1.564,10.82-1.857,13.842-1.857,8.529-15.1,24.418-22.818,25.1-23.111l.244-.1.292-.049A364.68,364.68,0,0,1,139,167.2c32.558,0,55.611,4.4,59.608,5.472,4.581,1.27,51.468,24.723,57.609,27.8l43.329,13,.341,1.075c.487,1.417,11.795,35.326,11.112,46.075-.634,10.7-9.017,28.632-9.358,29.365l-.049.147-.1.147c-9.65,14.707-31.242,27.8-64.189,38.942-26.124,8.795-51.907,13.876-62.971,16.026-1.755.342-3.119.635-4,.782A39.706,39.706,0,0,1,163.812,346.566Z" transform="translate(-24.24 -164.904)" fill="none"/>
      <g id="group-2" data-name="group" transform="translate(0 0)">
        <path id="path-2" data-name="path" d="M136.648,166.9c33.484,0,56.147,4.593,59.023,5.375,4.581,1.27,57.414,27.7,57.414,27.7l42.4,12.7s11.649,34.837,11.015,45.245-9.163,28.583-9.163,28.583c-23.882,36.5-118.094,52.329-129.743,54.87a29.006,29.006,0,0,1-6.092.635,41.708,41.708,0,0,1-17.01-3.958l-31.388-13.779c-9.309,5.081-14.378,6.108-16.961,6.108a3.887,3.887,0,0,1-2.339-.489s-2.486-.635-7.9-7.28c-5.41-6.694-9.358-31.075-9.358-31.075l-28.9-34.74H41.8c-.682,0-2.583-.244-4.143-2.785-1.852-3.127-4.386-20.863-4.386-20.863a108.283,108.283,0,0,1-3.314-14.609,15.273,15.273,0,0,1,2.632-9.967c-.244,0-.487.049-.731.049-3.168,0-4.094-1.612-4.094-1.612s-4.094-6.645,1.462-8.6c4.581-1.612,11.4-1.759,13.647-1.759h.78c8.091-15.44,24.759-23.355,24.759-23.355a364.317,364.317,0,0,1,68.234-6.4m0-4.4A368.829,368.829,0,0,0,67.585,169l-.536.1-.487.244c-.682.342-16.425,7.964-25.442,22.964-3.412.1-9.065.489-13.306,1.954a8.243,8.243,0,0,0-5.361,5.081c-1.608,4.4.975,9.039,1.511,9.967a7.515,7.515,0,0,0,2.339,2.3,18.182,18.182,0,0,0-.731,7.476,101.06,101.06,0,0,0,3.412,15.049c.975,6.987,2.924,18.811,4.923,22.182a9.4,9.4,0,0,0,7.9,4.935h3.753L72.41,293.494c.39,2.15,1.267,6.889,2.534,12.166,2.388,9.967,4.874,16.466,7.555,19.788,4.63,5.717,7.7,7.769,9.407,8.5a9.1,9.1,0,0,0,4.289.879c4.192,0,9.943-1.906,17.156-5.619l29.341,12.85a46.246,46.246,0,0,0,18.862,4.349,32.878,32.878,0,0,0,7.018-.733c.829-.2,2.242-.44,4-.782,11.064-2.15,36.993-7.231,63.214-16.124,33.435-11.287,55.367-24.674,65.31-39.821l.146-.244.146-.293c.341-.782,8.87-19.007,9.553-30.2.634-10.945-10.04-43.241-11.259-46.906l-.731-2.15-2.193-.635L254.694,195.92c-9.65-4.837-53.174-26.58-57.853-27.85-4.045-1.124-27.391-5.57-60.193-5.57Z" transform="translate(-21.932 -162.5)" fill="#fff"/>
      </g>
    </g>
    <text id="Rear_Bumper" data-name="Rear Bumper" transform="translate(221.143 327.168)" fill="#fff" font-size="14" font-family="SFUIDisplay-Semibold, SF UI Display" font-weight="600"><tspan x="0" y="0">Rear Bumper</tspan></text>
    <text id="Driver_Side" data-name="Driver Side" transform="translate(34.076 326.332)" fill="#fff" font-size="14" font-family="SFUIDisplay-Semibold, SF UI Display" font-weight="600"><tspan x="0" y="0">Driver Side</tspan></text>
    <g id="group-3" data-name="group" transform="translate(30.639 121.766)">
      <path id="path-3" data-name="path" d="M46.549,214.717s-3.8,5.033-3.217,10.456,3.217,14.121,3.217,14.121,2.388,17.1,4.24,20.13c1.8,3.029,4.25,2.543,4.25,2.543h5.314l28.014,33.711s4.538,23.247,9.8,29.7c5.215,6.45,6.916,7.339,6.916,7.339s3.509,2.834,18.667-5.424l30.364,13.29s8.432,3.811,22.322,3.225c11.5-.489,102.3-17.736,125.405-52.964,0,0,8.237-17.541,8.822-27.606s-10.674-43.73-10.674-43.73L259,207.242s-51.03-25.6-55.465-26.775S146.61,168.789,80.52,181.492c0,0-16.084,7.671-23.931,22.573,0,0-8.578-.2-13.939,1.661s-2,7.769-1.462,8.306S42.942,214.962,46.549,214.717Z" transform="translate(-39.655 -175.275)" fill="#fff"/>
    </g>
    <path id="path-4" data-name="path" d="M73,225.968l49.421,11.971s-3.217-26.433-11.551-36.694c-6.287-7.72-21.1.928-21.1.928S76.85,212.043,73,225.968Z" transform="translate(-26.11 -65.15)"/>
    <path id="path-5" data-name="path" d="M182.7,197.48s21.348,32.687,22.566,32.687,125.893-13.925,125.893-13.925l-56-26.042Z" transform="translate(-82.343 -61.141)"/>
    <path id="path-6" data-name="path" d="M236,324.8l1.852,20.033a2.727,2.727,0,0,0,1.9,2.394l17.985,6.01s32.948.049,45.084-1.221c8.724-.928-13.062-26.091-13.062-26.091l-31.827.1-19.349-3.762a2.178,2.178,0,0,0-2.583,2.15Z" transform="translate(-109.665 -128.659)"/>
    <path id="path-7" data-name="path" d="M548.033,286.7c-1.072,1.124-1.852,5.179-3.265,10.407-1.8,6.645-3.9,14.463-1.56,12.753,4.192-3.029,18.18-13.192,18.18-13.192s0-5.57-3.119-17.2C557.635,277.369,550.665,283.867,548.033,286.7Z" transform="translate(-266.611 -106.583)"/>
    <path id="path-8" data-name="path" d="M440.1,328.238l5.751,20.57,31.485-8.795L472.95,321.3Z" transform="translate(-214.289 -128.185)"/>
    <path id="path-9" data-name="path" d="M48.563,282.524s-.39-3.958,1.413-2.687c1.462,1.026,5.9,16.857,9.017,28.241l5.946,7.329H58.7a6.02,6.02,0,0,1-4.533-4.886C53.144,306.221,48.563,282.524,48.563,282.524Z" transform="translate(-13.564 -106.853)"/>
    <path id="path-10" data-name="path" d="M134.148,387.369s-5.313-24.284-3.46-28.192,3.509-5.326,9.26,3.274c5.751,8.648,13.549,29.609,14.768,33.762,1.218,4.1,3.266,20.668,11.5,23.062,3.314.977,4,.537,4,.537s-11.356,7.573-17.449,5.961c-7.116-1.906-11.112-11.042-12.185-13.339C139.656,410.48,134.148,387.369,134.148,387.369Z" transform="translate(-55.481 -145.98)"/>
    <path id="path-11" data-name="path" d="M52.4,246.287H44.557a1.646,1.646,0,0,1-1.657-1.661v-1.27a4.04,4.04,0,0,1,4.045-4.055h7.506a1.645,1.645,0,0,1,1.657,1.661l-2.047,3.665C53.476,245.75,53.33,246.287,52.4,246.287Z" transform="translate(-10.68 -86.251)"/>
    <ellipse id="ellipse" cx="6.082" cy="23.35" rx="6.082" ry="23.35" transform="matrix(0.98, -0.197, 0.197, 0.98, 78.188, 225.891)" fill="#fff"/>
    <ellipse id="ellipse-2" data-name="ellipse" cx="1.164" cy="11.236" rx="1.164" ry="11.236" transform="matrix(0.98, -0.197, 0.197, 0.98, 36.9, 180.707)" fill="#fff"/>
    <g id="group-4" data-name="group" transform="translate(253.542 93)">
      <path id="path-12" data-name="path" d="M499.973,149.576A21.849,21.849,0,0,1,497,138.485a22.022,22.022,0,0,1,41.087-11.091,21.849,21.849,0,0,1,2.973,11.091,22.022,22.022,0,0,1-41.087,11.091Zm2.1-20.912a19.822,19.822,0,0,0,0,19.74,19.56,19.56,0,0,0,7.116,7.134,19.688,19.688,0,0,0,19.691,0,19.56,19.56,0,0,0,7.116-7.134,19.822,19.822,0,0,0,0-19.74,19.56,19.56,0,0,0-7.116-7.134,19.59,19.59,0,0,0-26.807,7.134Zm5.41,8.551,2.924-2.932,6.775,6.6,10.479-10.261,2.924,2.932-13.4,13.534Z" transform="translate(-497 -116.4)" fill="#fff"/>
    </g>
    <line id="line" y1="64.544" transform="translate(261.097 247.594)" fill="none" stroke="#fff" stroke-miterlimit="10" stroke-width="1"/>
    <line id="line-2" data-name="line" y1="64.544" transform="translate(261.971 247.594)" fill="none" stroke="#333" stroke-miterlimit="10" stroke-width="1"/>
    <ellipse id="ellipse-3" data-name="ellipse" cx="2.534" cy="2.541" rx="2.534" ry="2.541" transform="translate(259.437 245.053)" fill="#fff" stroke="#333" stroke-width="1"/>
    <line id="line-3" data-name="line" y2="118.046" transform="translate(64.923 193.408)" fill="none" stroke="#fff" stroke-miterlimit="10" stroke-width="1"/>
    <line id="line-4" data-name="line" y2="118.046" transform="translate(64.049 193.408)" fill="none" stroke="#333" stroke-miterlimit="10" stroke-width="1"/>
    <ellipse id="ellipse-4" data-name="ellipse" cx="2.534" cy="2.541" rx="2.534" ry="2.541" transform="translate(61.515 190.867)" fill="#fff" stroke="#333" stroke-width="1"/>
    <rect id="rectangle" width="96.691" height="21.096" stroke-width="1" fill="none" stroke="#fff" stroke-miterlimit="10" transform="translate(310.051 333.276) rotate(180)"/>
    <rect id="rectangle-2" data-name="rectangle" width="85.098" height="21.096" transform="translate(112.42 332.54) rotate(180)" fill="none" stroke="#fff" stroke-miterlimit="10" stroke-width="1"/>
  </g>
</svg>
