<svg xmlns="http://www.w3.org/2000/svg" width="252" height="224" viewBox="0 0 252 224">
  <g id="Group_5507" data-name="Group 5507" transform="translate(-140.911 -172.089)">
    <g id="Group_444" data-name="Group 444" transform="translate(277.621 211.997)">
      <ellipse id="Ellipse_37" data-name="Ellipse 37" cx="57.645" cy="9.341" rx="57.645" ry="9.341" transform="translate(0 165.409)"/>
      <g id="Group_443" data-name="Group 443" transform="translate(4.649)">
        <g id="group" transform="translate(0)">
          <g id="group-2" data-name="group">
            <g id="group-3" data-name="group">
              <path id="path" d="M163.473,165.408c0,.431-.107.861-.107,1.185l-.427-.108a11.772,11.772,0,0,1-.64-1.184Z" transform="translate(-144.596 -82.075)" fill="#fff"/>
              <path id="path-2" data-name="path" d="M96.848,175.458c1.386.215,6.079,1.615,7.039,1.938l2.133,1.184-2.133-3.877s-.32-.538-.853-1.508a4.381,4.381,0,0,0-.533-.969l.427.108c0-.431.107-.754.107-1.185h-1.173c-.213-.431-.533-.969-.853-1.508-1.493-2.692-2.986-5.492-3.2-5.923-.32-.646-3.839-8.938-5.972-13.891l-.107-.215-.107-.215s-4.159-5.061-5.119-6.569a13.343,13.343,0,0,1-2.24-3.984,1.509,1.509,0,0,1,.427-.969,3.18,3.18,0,0,0,.746-1.831,3.408,3.408,0,0,1,.64-1.4,3.6,3.6,0,0,0,.533-1.723c.107-1.185.32-1.292.64-1.4a4.468,4.468,0,0,1,2.666,0v4.523a1.946,1.946,0,0,0,2.026,1.938h3.093c.107.215.107.323.213.538.32.861.427,1.077.213,1.508-.213.538-.747,2.261-.747,2.261l-.213.538,1.493,3.553,6.186,6.569,2.026,2.154,3.413,3.661,2.56,2.692,2.773,2.907L117,157.259l-.64-.861c-.213-.215-1.173-1.508-1.92-2.261-.427-.538-1.813-3.015-2.986-5.061-.533-.861-.96-1.615-1.386-2.369-.747-1.185-1.28-2.154-1.706-2.8-1.386-2.261-1.813-2.477-2.56-2.477H105.7a5.123,5.123,0,0,1-1.92-.861,17.287,17.287,0,0,1-3.626-2.8h3.733a1.342,1.342,0,0,0,.64-.108,1.968,1.968,0,0,0,1.386-1.831V122.8h.107c.213,0,.427.215.64.323a10.373,10.373,0,0,1,1.92,3.446h0a19.7,19.7,0,0,1,.853,3.123h0a9.48,9.48,0,0,1,.213,2.8,4.919,4.919,0,0,0,.96,3.661c.427.646.96,1.4,1.493,2.261a1.487,1.487,0,0,1,.32.431c.427.538.747,1.077.96,1.292a14.227,14.227,0,0,0,2.986,3.877,11.487,11.487,0,0,0,2.24,1.185l1.493.646.64-1.508c1.28-3.123,3.839-8.507,5.013-9.8a18.232,18.232,0,0,1,2.026-2.046h0a9.07,9.07,0,0,1,3.093-1.938c.533-.215,1.066-.323,1.6-.538,1.28-.431,2.453-.754,2.666-.861q4.479-.969,4.159-3.23a2.114,2.114,0,0,0-.64-1.292,2.417,2.417,0,0,0-1.787-.61c-.107,0-1.244-.353-1.351-.353a3.8,3.8,0,0,1-1.764-.653c-.64-.538-.791-1.678-.934-2.8l-.35-1.428-.91-3.819-1.066.108h-.96a.733.733,0,0,1-.747-.754v-.861a29.769,29.769,0,0,1,.533-3.015,10.671,10.671,0,0,1,.64-2.154c-.213-1.4-1.031-4.7-1.244-5.56a27.193,27.193,0,0,1,0-3.529c.612-4.733,3.327-8.267,9.939-10.528,4.98-1.584,11.969-1.364,17.088,4.021a11.95,11.95,0,0,1,3.064,4.511,29.676,29.676,0,0,1,1.072,5.065,24.081,24.081,0,0,1,0,2.775,32.858,32.858,0,0,1-2.026,9.569,25.034,25.034,0,0,0-1.706,3.392,21.889,21.889,0,0,0-.53,2.208,2.777,2.777,0,0,0,0,1.5l.53.864,1.28.431c4.693,1.615,17.49,7.322,19.943,13.676l.213.646c1.386,3.446,5.012,12.491,2.453,27.89-.213,1.615.32,7.215,1.067,12.491l.32,2.584c.427,3.338.96,6.353,1.066,7.538,0,.108.533,2.369,1.066,5.707.107.754.32,1.508.427,2.261,1.28,7.322,2.88,17.768,2.24,22.721-1.067,7.646-7.785,13.137-7.785,13.245L176.3,233.5l2.56.969a5.583,5.583,0,0,1,3.093,3.554c0,1.4-3.306,9.476-6.292,16.26-.32.538-2.666,4.092-5.759,5.169a22.194,22.194,0,0,1-9.6,1.292A6.348,6.348,0,0,1,157,259.558a4.861,4.861,0,0,1,.427-2.154A21.579,21.579,0,0,1,160.2,256a3.277,3.277,0,0,0,1.706-2.046c.427-1.184,1.28-4.2.853-5.815-.427-1.292-1.173-4.092-1.173-4.092l-.213-.969-.96-.215c-3.306-.646-14.4-2.907-16.424-2.692-.213,0-.64.108-.96.108a40.9,40.9,0,0,1-11.091,0c-5.546-.861-10.985-4.846-11.091-4.846l-3.413-2.477,2.88,13.137.213.323c1.92,2.584,4.479,7.107,4.479,8.83,0,2.907-.64,3.23-1.066,3.553-2.026.862-21.863,1.938-24.636,1.938a18.945,18.945,0,0,1-6.292-1.615,3.55,3.55,0,0,1-.213-.862,3.613,3.613,0,0,1,.96-2.477c.747-.431,4.159-1.4,10.025-2.8a3.5,3.5,0,0,0,2.133-1.615l1.28-5.815-.64-3.123c-4.159-9.045-12.158-26.813-13.011-29.505-.427-1.185-1.173-3.123-2.133-5.707-2.026-5.061-4.693-12.06-5.226-15.076-.853-4.846-.747-11.522,2.346-14.753Q91.249,174.65,96.848,175.458Zm28.369,13.593c2.134,1.429,7.5,7.283,11.518,6.005v-.431c.037-4.265-2.453-17.122-2.666-17.66-.32-1.4-2.453-8.4-2.773-9.153l-.96-2.907-1.92,2.477c0,.108-1.066,1.4-1.813,2.477-.107.215-.32.431-.427.646a8.017,8.017,0,0,1-.96,1.292h0c-.747.969-1.706,2.261-2.773,3.877a28.79,28.79,0,0,1-5.119,5.061c-.64.538-1.173.969-1.706,1.4C115.591,182.078,125.217,189.051,125.217,189.051Zm-10.452,36.7,1.6-4.092a4.312,4.312,0,0,1,.96-1.615,4.383,4.383,0,0,1,1.6-.754l1.462-.248-6.144-7.223-6.837-8.143Z" transform="translate(-84.263 -87.818)" fill="#fff"/>
            </g>
          </g>
          <g id="group-4" data-name="group" transform="translate(6.826 24.107)">
            <g id="group-5" data-name="group">
              <path id="path-3" data-name="path" d="M163.613,128.9Zm0,0Zm0,0Zm0,0Zm0,0Zm0,0Zm0,0Zm0,0Zm0,0Zm0,0Zm0,0Zm0,0Zm0,0Zm0,0Z" transform="translate(-152.735 -108.979)" fill="#fff"/>
              <path id="path-4" data-name="path" d="M161.86,110.4h11.625a.961.961,0,0,1,.96.969v23.152a.874.874,0,0,1-.96.861H161.86a.944.944,0,0,1-.96-.861V111.369A.96.96,0,0,1,161.86,110.4Z" transform="translate(-160.9 -110.4)" fill="#fff"/>
            </g>
          </g>
        </g>
        <rect id="Rectangle_196" data-name="Rectangle 196" width="11.49" height="18.369" transform="translate(7.765 25.861)"/>
        <g id="Ellipse_38" data-name="Ellipse 38" transform="translate(12.075 45.05)" fill="#fff" stroke="#000" stroke-width="1">
          <ellipse cx="1.423" cy="1.437" rx="1.423" ry="1.437" stroke="none"/>
          <ellipse cx="1.423" cy="1.437" rx="0.923" ry="0.937" fill="none"/>
        </g>
      </g>
    </g>
    <g id="Group_446" data-name="Group 446" transform="translate(145.824 181.149)">
      <path id="Path_845" data-name="Path 845" d="M123.016,101.739,0,124.175V0L123.016,23.381Z" transform="translate(123.016 124.175) rotate(180)" fill="#bcbec0" stroke="#fff" stroke-width="4"/>
      <path id="Path_846" data-name="Path 846" d="M90.206,155.1s1.721,4.758,2.653,7.351c2.512-1.2,4.91-2.45,7.365-3.847,3.866,6.753,11.739,20.344,11.8,19.689.2.342,1.213-19.86,1.213-19.86s17.75,6.411,26.611,9.716l.056-.171c-.226-.285-20.205-22.965-20.205-22.965l12.445-3.733-11.4-9.688,19.415-27.382L113.43,119.8V97.343l-11.6,16.355L88.992,87.2l-2.4,25.843-12.727-5.955L78.212,121.7l-23.112-1.6,14.731,10.485L55.1,130.509l13.517,9.317L49.4,145.9l.056.085c.564.171,27.176,3.932,27.176,3.932l-.452,7.038Z" transform="translate(-39.939 -69.119)" fill="#fff"/>
      <g id="Group_445" data-name="Group 445" transform="translate(8.84 39.935)">
        <path id="Path_847" data-name="Path 847" d="M47.2,216.948l7.168-1.111a6.751,6.751,0,0,1,3.443.256,5.483,5.483,0,0,1,2.37,1.881,9.548,9.548,0,0,1,1.383,3.22,17.481,17.481,0,0,1,.452,4.131,17.9,17.9,0,0,1-.452,4.16,9.865,9.865,0,0,1-1.383,3.277,6.043,6.043,0,0,1-2.37,2.023,6.658,6.658,0,0,1-3.443.427l-7.168-.769Zm3.02,15.187,2.991.2a6.433,6.433,0,0,0,2.907-.342,3.875,3.875,0,0,0,1.778-1.425,6.089,6.089,0,0,0,.875-2.279,18.637,18.637,0,0,0,0-5.784,5.519,5.519,0,0,0-.875-2.251,3.719,3.719,0,0,0-1.778-1.339,6.237,6.237,0,0,0-2.907-.2l-2.991.342Z" transform="translate(-47.2 -200.964)"/>
        <path id="Path_848" data-name="Path 848" d="M108.588,206.513l3.217-.513,6.66,24.846-3.245-.342-1.637-6.7-6.914-.256-1.637,5.87-3.132-.342Zm-1.044,14.019h5.277l-2.6-10.2h-.085Z" transform="translate(-86.464 -194.005)"/>
        <path id="Path_849" data-name="Path 849" d="M166.4,194.492l4.261-.655,4.769,21.712h.056l4.656-23.193,4.233-.655v31l-2.878-.313V199.051h-.056l-4.8,22.823-2.512-.256-4.8-21.4h-.056V221.1l-2.878-.313Z" transform="translate(-132.762 -183.779)"/>
        <path id="Path_850" data-name="Path 850" d="M242.388,185.813l3.217-.513,6.66,34.733-3.245-.342-1.637-9.289-6.914-.256-1.637,8.491-3.132-.342Zm-1.072,19.974h5.277L244,191.341h-.085Z" transform="translate(-182.506 -179.203)"/>
        <path id="Path_851" data-name="Path 851" d="M313.388,213.287l-1.947-.2-.452-4.7a11.562,11.562,0,0,1-2.427,4.131,3.5,3.5,0,0,1-2.794.883,5.4,5.4,0,0,1-3.471-1.938,14.143,14.143,0,0,1-2.6-4.388,29.182,29.182,0,0,1-1.637-6.126,47.594,47.594,0,0,1,0-14.617,29.562,29.562,0,0,1,1.637-6.211,15.33,15.33,0,0,1,2.6-4.53,5.862,5.862,0,0,1,3.471-2.137,4.358,4.358,0,0,1,2.681.4,5.91,5.91,0,0,1,2.258,2.194,14.269,14.269,0,0,1,1.637,4.046,30.256,30.256,0,0,1,.818,5.87l-2.963.228a17.275,17.275,0,0,0-.508-3.334,7.742,7.742,0,0,0-1.016-2.336,3.7,3.7,0,0,0-1.355-1.311,2.545,2.545,0,0,0-1.58-.285,3.545,3.545,0,0,0-2.4,1.51,10.793,10.793,0,0,0-1.637,3.391,25.581,25.581,0,0,0-.931,4.616,42.986,42.986,0,0,0,0,10.314,24.921,24.921,0,0,0,.931,4.559,10,10,0,0,0,1.637,3.305,3.382,3.382,0,0,0,2.4,1.4,2.855,2.855,0,0,0,2.06-.513,5.268,5.268,0,0,0,1.524-2.023,12.449,12.449,0,0,0,.931-3.391,35.749,35.749,0,0,0,.339-4.53h-4.6v-5.072l7.365-.228v21.028Z" transform="translate(-226.866 -170.69)"/>
        <path id="Path_852" data-name="Path 852" d="M365.5,165.838l12.473-1.937v6.7l-9.425,1.111v10.941l8.72-.427v6.3l-8.72.085v12.252l9.595.627v6.7L365.5,206.839Z" transform="translate(-275.677 -163.9)"/>
      </g>
    </g>
    <g id="group-6" data-name="group" transform="translate(140.911 172.089)">
      <path id="path-5" data-name="path" d="M480.624,134.695A12.138,12.138,0,0,1,479,128.578a12.2,12.2,0,0,1,5.989-10.535,11.77,11.77,0,0,1,6.042-1.644,11.583,11.583,0,0,1,6.042,1.644,11.915,11.915,0,0,1,4.365,4.419,12.137,12.137,0,0,1,1.624,6.116,12.2,12.2,0,0,1-5.989,10.535,11.77,11.77,0,0,1-6.042,1.644,11.583,11.583,0,0,1-6.042-1.644A12.327,12.327,0,0,1,480.624,134.695Zm1.145-11.532a10.9,10.9,0,0,0,3.886,14.819,10.663,10.663,0,0,0,10.754,0,10.9,10.9,0,0,0,0-18.753,10.662,10.662,0,0,0-10.754,0A10.735,10.735,0,0,0,481.768,123.163Zm2.955,4.715,1.6-1.617,3.7,3.637,5.723-5.658,1.6,1.617-7.32,7.463Z" transform="translate(-479 -116.4)" fill="#fff"/>
    </g>
  </g>
</svg>
