pipeline {
    agent any

    environment {
	
        PLATFORM_LOC='local' //local or lambdatest
        BROWSER='chromium' //chromium for local or pw-chromium for lambdatest
        BROWSER_MODE='headless' //it is better to use headless as we will run it on a non-GUI Linux server
        LT_USERNAME='<your LambdaTest username>'
        LT_API_KEY='<your LambdaTest access key>' //Refer here on how to get them https://www.lambdatest.com/support/docs/hyperexecute-how-to-get-my-username-and-access-key/
        JIRA_ENABLED='true' //true or false
        JIRA_URL='<your Jira URL with ending slash>' //You may leave it blank if false
        JIRA_USERNAME='<your Jira email address>' //You may leave it blank if false
        JIRA_TOKEN='<your Jira Token>' //You may leave it blank if false. Refer here on how to get them https://support.atlassian.com/atlassian-account/docs/manage-api-tokens-for-your-atlassian-account/
        JIRA_PROJ='<your Jira project code>' //You may leave it blank if false
    }

    stages {
        stage('Checkout') {
            steps {
                // Checkout the code from GitLab
		
                git 'https://gitlab.com/mfarisat/pw_faris.git'
		
            }
        }
        stage('Build') {
            steps {
                // Build the Maven project
                
                sh 'mvn clean package'
            }
        }
        stage('Test') {
            steps {
                // Run Maven tests
                sh 'mvn test'
            }
        }
    }
}