SHA_hates_MOR = {
	allowed = { original_tag = SHA }
	enable = {
		MOR = { owns_state = 373 }
	}
	abort_when_not_enabled = yes

	ai_strategy = { type = antagonize id = "MOR" value = 50 }
	ai_strategy = { type = contain id = "MOR" value = 100 }
	ai_strategy = { type = conquer id = "MOR" value = 50 }
}