
strategic_region={
	id=165
	name="STRATEGICREGION_165"
	provinces={
		261 274 280 282 283 284 314 325 344 346 354 359 380 592 994 1010 1018 1023 1038 1047 1070 1078 1087 1114 1120 1131 1162 1172 1187 1196 1202 1319 1367 1383 1395 1448 1469 1474 1522 1597 1625 1653 1884 1893 2030 2045 2067 2091 2992 2996 3003 3005 3008 3009 3013 3016 3017 3018 3031 3034 3045 3048 3050 3054 3055 3058 3059 3065 3068 3071 3073 3074 3078 3080 3087 3093 3094 3096 3099 3100 3119 3128 3131 4023 4028 4041 4050 4077 4085 4092 4121 4125 4134 4141 4152 4160 4165 4177 4189 4192 4207 4325 4431 4480 4501 4504 4532 4559 4628 4656 4896 4925 4937 5009 5048 5072 6999 7039 7044 7067 7095 7097 7101 7108 7128 7135 7137 7141 7152 7159 7168 7182 7192 7210 7240 7256 7279 7294 7434 7446 7502 7521 7549 7577 7606 7650 7665 7948 7965 7976 8023 8026 8095 9078 9090 9939 9963 9970 9978 9982 9938 9997 9999 10004 10006 10039 10050 10062 10080 10105 10121 10132 10144 10304 10335 10346 10377 10404 10413 10431 10459 10517 10616 10726 10763 10776 10819 10822 10841 10863 11865 11918 11926 11938 11941 11963 11972 11981 11983 11990 12014 12017 12023 12053 12077 12095 12141 12262 12274 12282 12310 12350 12378 12407 12436 12483 12705 12767 12789 12819 12841 12898 13140 13143 14025 14026 14027 14028 14029 14030 14033 14035 14121 14283 14286 14312 14388 14389 14390 14413 14414 14417 14593 14594 14595 14596 14597 14609 14703 14851 14852
	}
	weather={
		period={
			between={ 0.0 30.0 }
			temperature={ 18.0 20.0 }
			#temperature_day_night={ 8.0 -8.0 }
			no_phenomenon=0.920
			rain_light=0.050
			rain_heavy=0.030
			snow=0.000
			blizzard=0.000
			arctic_water=0.000
			mud=0.500
			sandstorm=0.000
			min_snow_level=0.000
		}
		period={
			between={ 0.1 27.1 }
			temperature={ 22.0 24.0 }
			#temperature_day_night={ 8.0 -8.0 }
			no_phenomenon=0.900
			rain_light=0.050
			rain_heavy=0.050
			snow=0.000
			blizzard=0.000
			arctic_water=0.000
			mud=0.500
			sandstorm=0.000
			min_snow_level=0.000
		}
		period={
			between={ 0.2 30.2 }
			temperature={ 26.0 30.0 }
			#temperature_day_night={ 8.0 -8.0 }
			no_phenomenon=0.820
			rain_light=0.050
			rain_heavy=0.130
			snow=0.000
			blizzard=0.000
			arctic_water=0.000
			mud=0.500
			sandstorm=0.000
			min_snow_level=0.000
		}
		period={
			between={ 0.3 29.3 }
			temperature={ 28.0 32.0 }
			#temperature_day_night={ 9.0 -9.0 }
			no_phenomenon=0.700
			rain_light=0.050
			rain_heavy=0.250
			snow=0.000
			blizzard=0.000
			arctic_water=0.000
			mud=0.500
			sandstorm=0.000
			min_snow_level=0.000
		}
		period={
			between={ 0.4 30.4 }
			temperature={ 28.0 32.0 }
			#temperature_day_night={ 9.0 -9.0 }
			no_phenomenon=0.600
			rain_light=0.200
			rain_heavy=0.400
			snow=0.000
			blizzard=0.000
			arctic_water=0.000
			mud=0.500
			sandstorm=0.000
			min_snow_level=0.000
		}
		period={
			between={ 0.5 29.5 }
			temperature={ 28.0 31.0 }
			#temperature_day_night={ 5.0 -5.0 }
			no_phenomenon=0.400
			rain_light=0.200
			rain_heavy=0.400
			snow=0.000
			blizzard=0.000
			arctic_water=0.000
			mud=0.500
			sandstorm=0.000
			min_snow_level=0.000
		}
		period={
			between={ 0.6 30.6 }
			temperature={ 28.0 30.0 }
			#temperature_day_night={ 5.0 -5.0 }
			no_phenomenon=0.200
			rain_light=0.300
			rain_heavy=0.500
			snow=0.000
			blizzard=0.000
			arctic_water=0.000
			mud=0.500
			sandstorm=0.000
			min_snow_level=0.000
		}
		period={
			between={ 0.7 30.7 }
			temperature={ 28.0 30.0 }
			#temperature_day_night={ 5.0 -5.0 }
			no_phenomenon=0.200
			rain_light=0.300
			rain_heavy=0.500
			snow=0.000
			blizzard=0.000
			arctic_water=0.000
			mud=0.500
			sandstorm=0.000
			min_snow_level=0.000
		}
		period={
			between={ 0.8 29.8 }
			temperature={ 26.0 30.0 }
			#temperature_day_night={ 5.0 -5.0 }
			no_phenomenon=0.300
			rain_light=0.200
			rain_heavy=0.500
			snow=0.000
			blizzard=0.000
			arctic_water=0.000
			mud=0.500
			sandstorm=0.000
			min_snow_level=0.000
		}
		period={
			between={ 0.9 30.9 }
			temperature={ 28.0 29.0 }
			#temperature_day_night={ 8.0 -8.0 }
			no_phenomenon=0.600
			rain_light=0.050
			rain_heavy=0.350
			snow=0.000
			blizzard=0.000
			arctic_water=0.000
			mud=0.500
			sandstorm=0.000
			min_snow_level=0.000
		}
		period={
			between={ 0.10 29.10 }
			temperature={ 24.0 26.0 }
			#temperature_day_night={ 8.0 -8.0 }
			no_phenomenon=0.900
			rain_light=0.050
			rain_heavy=0.050
			snow=0.000
			blizzard=0.000
			arctic_water=0.000
			mud=0.500
			sandstorm=0.000
			min_snow_level=0.000
		}
		period={
			between={ 0.11 30.11 }
			temperature={ 22.0 24.0 }
			#temperature_day_night={ 8.0 -8.0 }
			no_phenomenon=0.950
			rain_light=0.050
			rain_heavy=0.000
			snow=0.000
			blizzard=0.000
			arctic_water=0.000
			mud=0.500
			sandstorm=0.000
			min_snow_level=0.000
		}
	}
}
