leader_traits = {

	iron_lady_of_syria = {
		random = no
		political_power_factor = 0.15
		neutrality_drift = 0.10

		ai_will_do = {
			factor = 1
		}
	}

	syrian_savage = {
		random = no
		army_attack_factor = 0.1
		army_speed_factor = 0.1
		offensive_war_stability_factor = 0.5

		ai_will_do = {
			factor = 1
		}
	}

}