category =
{
	name = "Voices"
	soundeffects = {
		RAJ_infantry_idle
		RAJ_infantry_neutral_combat
		RAJ_infantry_positive_combat
		RAJ_infantry_move_out
		RAJ_infantry_retreat
		CHI_infantry_idle
		CHI_infantry_neutral_combat
		CHI_infantry_positive_combat
		CHI_infantry_move_out
		CHI_infantry_retreat
		GER_infantry_idle
		GER_infantry_neutral_combat
		GER_infantry_positive_combat
		GER_infantry_move_out
		GER_infantry_retreat
		USA_infantry_idle
		USA_infantry_neutral_combat
		USA_infantry_positive_combat
		USA_infantry_move_out
		USA_infantry_retreat
		SOV_infantry_idle
		SOV_infantry_neutral_combat
		SOV_infantry_positive_combat
		SOV_infantry_move_out
		SOV_infantry_retreat
		SPR_infantry_idle
		SPR_infantry_neutral_combat
		SPR_infantry_positive_combat
		SPR_infantry_move_out
		SPR_infantry_retreat
		ARM_infantry_idle
		ARM_infantry_neutral_combat
		ARM_infantry_positive_combat
		ARM_infantry_retreat
		ARM_infantry_move_out
		PER_infantry_idle
		PER_infantry_neutral_combat
		PER_infantry_positive_combat
		PER_infantry_retreat
		PER_infantry_move_out
		TUR_infantry_idle
		TUR_infantry_neutral_combat
		TUR_infantry_positive_combat
		TUR_infantry_move_out
		TUR_infantry_retreat
		FRA_infantry_idle
		FRA_infantry_neutral_combat
		FRA_infantry_positive_combat
		FRA_infantry_move_out
		FRA_infantry_retreat
		ITA_infantry_idle
		ITA_infantry_neutral_combat
		ITA_infantry_positive_combat
		ITA_infantry_move_out
		ITA_infantry_retreat
		ENG_infantry_idle
		ENG_infantry_neutral_combat
		ENG_infantry_positive_combat
		ENG_infantry_move_out
		ENG_infantry_retreat
		LEB_infantry_idle
		LEB_infantry_neutral_combat
       	LEB_infantry_positive_combat
		LEB_infantry_retreat
       	LEB_infantry_move_out
		HEZ_infantry_idle
		HEZ_infantry_neutral_combat
		HEZ_infantry_positive_combat
		HEZ_infantry_retreat
       	HEZ_infantry_move_out
		IRQ_infantry_idle
		IRQ_infantry_neutral_combat
		IRQ_infantry_positive_combat
		IRQ_infantry_retreat
		IRQ_infantry_move_out
	}
	compressor =
	{
		enabled = yes
		pregain = 0.0
		postgain = 2.0
		ratio = 10.0
		threshold = -10.0
		attacktime = 0.030
		releasetime = 1.2
	}
}
soundeffect =
{
	name = "RAJ_infantry_idle"
	sounds = {
		sound = ra_idle_001
		sound = ra_idle_002
		sound = ra_idle_003
		sound = ra_idle_004
		sound = ra_idle_005
		sound = ra_idle_006
		sound = ra_idle_007
		sound = ra_idle_008
	}
	max_audible = 1
	max_audible_behaviour = fail
	volume = 1.00
	volume_random_offset = { 0.0 -0.15 }
	playbackrate_random_offset = { 0.0 -0.15 }
}

soundeffect =
{
	name = "RAJ_infantry_neutral_combat"
	sounds = {
		sound = ra_neutral_001
		sound = ra_neutral_002
		sound = ra_neutral_003
		sound = ra_neutral_004
		sound = ra_neutral_005
		sound = ra_neutral_006
		sound = ra_neutral_007
		sound = ra_neutral_008
	}
	max_audible = 1
	max_audible_behaviour = fail
	volume = 1.00
	volume_random_offset = { 0.0 -0.15 }
	playbackrate_random_offset = { 0.0 -0.15}
}

soundeffect =
{
	name = "RAJ_infantry_positive_combat"
	sounds = {
		sound = ra_positive_001
		sound = ra_positive_002
		sound = ra_positive_003
		sound = ra_positive_004
		sound = ra_positive_005
		sound = ra_positive_006
		sound = ra_positive_007
		sound = ra_positive_008
	}
	max_audible = 1
	max_audible_behaviour = fail
	volume = 1.00
	volume_random_offset = { 0.0 -0.15 }
	playbackrate_random_offset = { 0.0 -0.15}
}

soundeffect =
{
	name = "RAJ_infantry_move_out"
	sounds = {
		sound = ra_move_001
		sound = ra_move_002
		sound = ra_move_003
		sound = ra_move_004
		sound = ra_move_005
		sound = ra_move_006
		sound = ra_move_007
		sound = ra_move_008
	}
	max_audible = 1
	max_audible_behaviour = fail
	volume = 1.00
	volume_random_offset = { 0.0 -0.15 }
	playbackrate_random_offset = { 0.0 -0.15 }
}

soundeffect =
{
	name = "RAJ_infantry_retreat"
	sounds = {
		sound = ra_retreat_001
		sound = ra_retreat_002
		sound = ra_retreat_003
		sound = ra_retreat_004
	}
	max_audible = 1
	max_audible_behaviour = fail
	volume = 1.00
	volume_random_offset = { 0.0 -0.15 }
	playbackrate_random_offset = { 0.0 -0.15}
}
# Iraq #
soundeffect =
{
	name = "IRQ_infantry_idle"
	sounds = {
		sound = ir_idle_001
		sound = ir_idle_002
		sound = ir_idle_003
		sound = ir_idle_004
		sound = ir_idle_005
		sound = ir_idle_006
		sound = ir_idle_007
		sound = ir_idle_008
	}
	max_audible = 1
	max_audible_behaviour = fail
	volume = 1.00
	volume_random_offset = { 0.0 -0.15 }
	playbackrate_random_offset = { 0.0 -0.15 }
}

soundeffect =
{
	name = "IRQ_infantry_neutral_combat"
	sounds = {
		sound = ir_neutral_001
		sound = ir_neutral_002
		sound = ir_neutral_003
		sound = ir_neutral_004
		sound = ir_neutral_005
		sound = ir_neutral_006
		sound = ir_neutral_007
		sound = ir_neutral_008
	}
	max_audible = 1
	max_audible_behaviour = fail
	volume = 1.00
	volume_random_offset = { 0.0 -0.15 }
	playbackrate_random_offset = { 0.0 -0.15}
}

soundeffect =
{
	name = "IRQ_infantry_positive_combat"
	sounds = {
		sound = ir_positive_001
		sound = ir_positive_002
		sound = ir_positive_003
		sound = ir_positive_004
		sound = ir_positive_005
		sound = ir_positive_006
		sound = ir_positive_007
		sound = ir_positive_008
	}
	max_audible = 1
	max_audible_behaviour = fail
	volume = 1.00
	volume_random_offset = { 0.0 -0.15 }
	playbackrate_random_offset = { 0.0 -0.15}
}

soundeffect =
{
	name = "IRQ_infantry_move_out"
	sounds = {
		sound = ir_move_001
		sound = ir_move_002
		sound = ir_move_003
		sound = ir_move_004
		sound = ir_move_005
		sound = ir_move_006
		sound = ir_move_007
		sound = ir_move_008
	}
	max_audible = 1
	max_audible_behaviour = fail
	volume = 1.00
	volume_random_offset = { 0.0 -0.15 }
	playbackrate_random_offset = { 0.0 -0.15 }
}

soundeffect =
{
	name = "IRQ_infantry_retreat"
	sounds = {
		sound = ir_retreat_001
		sound = ir_retreat_002
		sound = ir_retreat_003
		sound = ir_retreat_004
	}
	max_audible = 1
	max_audible_behaviour = fail
	volume = 1.00
	volume_random_offset = { 0.0 -0.15 }
	playbackrate_random_offset = { 0.0 -0.15}
}
# Iraq #
#
# China
soundeffect =
{
	name = "CHI_infantry_idle"
	sounds = {
		sound = ch_idle_001
		sound = ch_idle_002
		sound = ch_idle_003
		sound = ch_idle_004
		sound = ch_idle_005
		sound = ch_idle_006
		sound = ch_idle_007
		sound = ch_idle_008
	}
	max_audible = 1
	max_audible_behaviour = fail
	volume = 3.00
	volume_random_offset = { 0.0 -0.15 }
	playbackrate_random_offset = { 0.0 -0.15 }
}

soundeffect =
{
	name = "CHI_infantry_neutral_combat"
	sounds = {
		sound = ch_neutral_001
		sound = ch_neutral_002
		sound = ch_neutral_003
		sound = ch_neutral_004
		sound = ch_neutral_005
		sound = ch_neutral_006
		sound = ch_neutral_007
		sound = ch_neutral_008
	}
	max_audible = 1
	max_audible_behaviour = fail
	volume = 3.00
	volume_random_offset = { 0.0 -0.15 }
	playbackrate_random_offset = { 0.0 -0.15}
}

soundeffect =
{
	name = "CHI_infantry_positive_combat"
	sounds = {
		sound = ch_positive_001
		sound = ch_positive_002
		sound = ch_positive_003
		sound = ch_positive_004
		sound = ch_positive_005
		sound = ch_positive_006
		sound = ch_positive_007
		sound = ch_positive_008
	}
	max_audible = 1
	max_audible_behaviour = fail
	volume = 1.00
	volume_random_offset = { 0.0 -0.15 }
	playbackrate_random_offset = { 0.0 -0.15}
}

soundeffect =
{
	name = "CHI_infantry_move_out"
	sounds = {
		sound = ch_move_001
		sound = ch_move_002
		sound = ch_move_003
		sound = ch_move_004
		sound = ch_move_005
		sound = ch_move_006
		sound = ch_move_007
		sound = ch_move_008
	}
	max_audible = 1
	max_audible_behaviour = fail
	volume = 1.00
	volume_random_offset = { 0.0 -0.15 }
	playbackrate_random_offset = { 0.0 -0.15 }
}

soundeffect =
{
	name = "CHI_infantry_retreat"
	sounds = {
		sound = ch_retreat_001
		sound = ch_retreat_002
		sound = ch_retreat_003
		sound = ch_retreat_004
	}
	max_audible = 1
	max_audible_behaviour = fail
	volume = 1.00
	volume_random_offset = { 0.0 -0.15 }
	playbackrate_random_offset = { 0.0 -0.15}
}
# Germany
soundeffect =
{
	name = "GER_infantry_idle"
	sounds = {
		sound = ge_idle_001
		sound = ge_idle_002
		sound = ge_idle_003
		sound = ge_idle_004
		sound = ge_idle_005
		sound = ge_idle_006
		sound = ge_idle_007
		sound = ge_idle_008
	}
	max_audible = 1
	max_audible_behaviour = fail
	volume = 3.00
	volume_random_offset = { 0.0 -0.15 }
	playbackrate_random_offset = { 0.0 -0.15 }
}

soundeffect =
{
	name = "GER_infantry_neutral_combat"
	sounds = {
		sound = ge_neutral_001
		sound = ge_neutral_002
		sound = ge_neutral_003
		sound = ge_neutral_004
		sound = ge_neutral_005
		sound = ge_neutral_006
		sound = ge_neutral_007
		sound = ge_neutral_008
	}
	max_audible = 1
	max_audible_behaviour = fail
	volume = 3.00
	volume_random_offset = { 0.0 -0.15 }
	playbackrate_random_offset = { 0.0 -0.15}
}

soundeffect =
{
	name = "GER_infantry_positive_combat"
	sounds = {
		sound = ge_positive_001
		sound = ge_positive_002
		sound = ge_positive_003
		sound = ge_positive_004
		sound = ge_positive_005
		sound = ge_positive_006
		sound = ge_positive_007
		sound = ge_positive_008
	}
	max_audible = 1
	max_audible_behaviour = fail
	volume = 1.00
	volume_random_offset = { 0.0 -0.15 }
	playbackrate_random_offset = { 0.0 -0.15}
}

soundeffect =
{
	name = "GER_infantry_move_out"
	sounds = {
		sound = ge_move_001
		sound = ge_move_002
		sound = ge_move_003
		sound = ge_move_004
		sound = ge_move_005
		sound = ge_move_006
		sound = ge_move_007
		sound = ge_move_008
	}
	max_audible = 1
	max_audible_behaviour = fail
	volume = 1.00
	volume_random_offset = { 0.0 -0.15 }
	playbackrate_random_offset = { 0.0 -0.15 }
}

soundeffect =
{
	name = "GER_infantry_retreat"
	sounds = {
		sound = ge_retreat_001
		sound = ge_retreat_002
		sound = ge_retreat_003
		sound = ge_retreat_004
	}
	max_audible = 1
	max_audible_behaviour = fail
	volume = 1.00
	volume_random_offset = { 0.0 -0.15 }
	playbackrate_random_offset = { 0.0 -0.15}
}
###
# USA (United States)
soundeffect =
{
	name = "USA_infantry_idle"
	sounds = {
		sound = us_idle_001
		sound = us_idle_002
		sound = us_idle_003
		sound = us_idle_004
		sound = us_idle_005
		sound = us_idle_006
		sound = us_idle_007
	}
	max_audible = 1
	max_audible_behaviour = fail
	volume = 3.00
	volume_random_offset = { 0.0 -0.15 }
	playbackrate_random_offset = { 0.0 -0.15 }
}

soundeffect =
{
	name = "USA_infantry_neutral_combat"
	sounds = {
		sound = us_neutral_001
		sound = us_neutral_002
		sound = us_neutral_003
		sound = us_neutral_004
		sound = us_neutral_005
		sound = us_neutral_006
		sound = us_neutral_007
	}
	max_audible = 1
	max_audible_behaviour = fail
	volume = 3.00
	volume_random_offset = { 0.0 -0.15 }
	playbackrate_random_offset = { 0.0 -0.15}
}

soundeffect =
{
	name = "USA_infantry_positive_combat"
	sounds = {
		sound = us_positive_001
		sound = us_positive_002
		sound = us_positive_003
		sound = us_positive_004
		sound = us_positive_005
		sound = us_positive_006
		sound = us_positive_007
	}
	max_audible = 1
	max_audible_behaviour = fail
	volume = 1.00
	volume_random_offset = { 0.0 -0.15 }
	playbackrate_random_offset = { 0.0 -0.15}
}

soundeffect =
{
	name = "USA_infantry_move_out"
	sounds = {
		sound = us_move_001
		sound = us_move_002
		sound = us_move_003
		sound = us_move_004
		sound = us_move_005
		sound = us_move_006
		sound = us_move_007
		sound = us_move_008
	}
	max_audible = 1
	max_audible_behaviour = fail
	volume = 1.00
	volume_random_offset = { 0.0 -0.15 }
	playbackrate_random_offset = { 0.0 -0.15 }
}

soundeffect =
{
	name = "USA_infantry_retreat"
	sounds = {
		sound = us_retreat_001
		sound = us_retreat_002
		sound = us_retreat_003
		sound = us_retreat_004
	}
	max_audible = 1
	max_audible_behaviour = fail
	volume = 1.00
	volume_random_offset = { 0.0 -0.15 }
	playbackrate_random_offset = { 0.0 -0.15}
}
###
###
# ENG (United Kingdom)
soundeffect =
{
	name = "ENG_infantry_idle"
	sounds = {
		sound = en_idle_001
		sound = en_idle_002
		sound = en_idle_003
		sound = en_idle_004
		sound = en_idle_005
		sound = en_idle_006
		sound = en_idle_007
		sound = en_idle_008
	}
	max_audible = 1
	max_audible_behaviour = fail
	volume = 1.00
	volume_random_offset = { 0.0 -0.15 }
	playbackrate_random_offset = { 0.0 -0.15 }
}

soundeffect =
{
	name = "ENG_infantry_neutral_combat"
	sounds = {
		sound = en_neutral_001
		sound = en_neutral_002
		sound = en_neutral_003
		sound = en_neutral_004
		sound = en_neutral_005
		sound = en_neutral_006
		sound = en_neutral_007
		sound = en_neutral_008
		sound = en_neutral_009
	}
	max_audible = 1
	max_audible_behaviour = fail
	volume = 1.00
	volume_random_offset = { 0.0 -0.15 }
	playbackrate_random_offset = { 0.0 -0.15}
}

soundeffect =
{
	name = "ENG_infantry_positive_combat"
	sounds = {
		sound = en_positive_001
		sound = en_positive_002
		sound = en_positive_003
		sound = en_positive_004
		sound = en_positive_005
		sound = en_positive_006
		sound = en_positive_007
		sound = en_positive_008
		sound = en_positive_009
	}
	max_audible = 1
	max_audible_behaviour = fail
	volume = 1.00
	volume_random_offset = { 0.0 -0.15 }
	playbackrate_random_offset = { 0.0 -0.15}
}

soundeffect =
{
	name = "ENG_infantry_move_out"
	sounds = {
		sound = en_move_001
		sound = en_move_002
		sound = en_move_003
		sound = en_move_004
		sound = en_move_005
		sound = en_move_006
		sound = en_move_007
		sound = en_move_008
	}
	max_audible = 1
	max_audible_behaviour = fail
	volume = 1.00
	volume_random_offset = { 0.0 -0.15 }
	playbackrate_random_offset = { 0.0 -0.15 }
}

soundeffect =
{
	name = "ENG_infantry_retreat"
	sounds = {
		sound = en_retreat_001
		sound = en_retreat_002
		sound = en_retreat_003
		sound = en_retreat_004
	}
	max_audible = 1
	max_audible_behaviour = fail
	volume = 1.00
	volume_random_offset = { 0.0 -0.15 }
	playbackrate_random_offset = { 0.0 -0.15}
}
# TUR (Turkey)
soundeffect =
{
	name = "TUR_infantry_idle"
	sounds = {
		sound = tu_idle_001
		sound = tu_idle_002
		sound = tu_idle_003
		sound = tu_idle_004
		sound = tu_idle_005
		sound = tu_idle_006
		sound = tu_idle_007
		sound = tu_idle_008
	}
	max_audible = 1
	max_audible_behaviour = fail
	volume = 1.00
	volume_random_offset = { 0.0 -0.15 }
	playbackrate_random_offset = { 0.0 -0.15 }
}

soundeffect =
{
	name = "TUR_infantry_neutral_combat"
	sounds = {
		sound = tu_neutral_001
		sound = tu_neutral_002
		sound = tu_neutral_003
		sound = tu_neutral_004
		sound = tu_neutral_005
		sound = tu_neutral_006
		sound = tu_neutral_007
		sound = tu_neutral_008
	}
	max_audible = 1
	max_audible_behaviour = fail
	volume = 1.00
	volume_random_offset = { 0.0 -0.15 }
	playbackrate_random_offset = { 0.0 -0.15}
}

soundeffect =
{
	name = "TUR_infantry_positive_combat"
	sounds = {
		sound = tu_positive_001
		sound = tu_positive_002
		sound = tu_positive_003
		sound = tu_positive_004
		sound = tu_positive_005
		sound = tu_positive_006
	}
	max_audible = 1
	max_audible_behaviour = fail
	volume = 1.00
	volume_random_offset = { 0.0 -0.15 }
	playbackrate_random_offset = { 0.0 -0.15}
}

soundeffect =
{
	name = "TUR_infantry_move_out"
	sounds = {
		sound = tu_move_001
		sound = tu_move_002
		sound = tu_move_003
		sound = tu_move_004
		sound = tu_move_005
		sound = tu_move_006
		sound = tu_move_007
	}
	max_audible = 1
	max_audible_behaviour = fail
	volume = 1.00
	volume_random_offset = { 0.0 -0.15 }
	playbackrate_random_offset = { 0.0 -0.15 }
}

soundeffect =
{
	name = "TUR_infantry_retreat"
	sounds = {
		sound = tu_retreat_001
		sound = tu_retreat_002
		sound = tu_retreat_003
		sound = tu_retreat_004
	}
	max_audible = 1
	max_audible_behaviour = fail
	volume = 1.00
	volume_random_offset = { 0.0 -0.15 }
	playbackrate_random_offset = { 0.0 -0.15}
}
# ITA (Italy)
soundeffect =
{
	name = "ITA_infantry_idle"
	sounds = {
		sound = it_idle_001
		sound = it_idle_002
		sound = it_idle_003
		sound = it_idle_004
		sound = it_idle_005
		sound = it_idle_006
		sound = it_idle_007
		sound = it_idle_008
	}
	max_audible = 1
	max_audible_behaviour = fail
	volume = 1.00
	volume_random_offset = { 0.0 -0.15 }
	playbackrate_random_offset = { 0.0 -0.15 }
}
soundeffect =
{
	name = "ITA_infantry_neutral_combat"
	sounds = {
		sound = it_neutral_001
		sound = it_neutral_002
		sound = it_neutral_003
		sound = it_neutral_004
		sound = it_neutral_005
		sound = it_neutral_006
	}
	max_audible = 1
	max_audible_behaviour = fail
	volume = 1.00
	volume_random_offset = { 0.0 -0.15 }
	playbackrate_random_offset = { 0.0 -0.15}
}

soundeffect =
{
	name = "ITA_infantry_positive_combat"
	sounds = {
		sound = it_positive_001
		sound = it_positive_002
		sound = it_positive_003
		sound = it_positive_004
		sound = it_positive_005
		sound = it_positive_006
	}
	max_audible = 1
	max_audible_behaviour = fail
	volume = 1.00
	volume_random_offset = { 0.0 -0.15 }
	playbackrate_random_offset = { 0.0 -0.15}
}

soundeffect =
{
	name = "ITA_infantry_move_out"
	sounds = {
		sound = it_move_001
		sound = it_move_002
		sound = it_move_003
		sound = it_move_004
		sound = it_move_005
	}
	max_audible = 1
	max_audible_behaviour = fail
	volume = 1.00
	volume_random_offset = { 0.0 -0.15 }
	playbackrate_random_offset = { 0.0 -0.15 }
}

soundeffect =
{
	name = "ITA_infantry_retreat"
	sounds = {
		sound = it_retreat_001
		sound = it_retreat_002
		sound = it_retreat_003
	}
	max_audible = 1
	max_audible_behaviour = fail
	volume = 1.00
	volume_random_offset = { 0.0 -0.15 }
	playbackrate_random_offset = { 0.0 -0.15}
}
# FRA (France) #

soundeffect =
{
	name = "FRA_infantry_idle"
	sounds = {
		sound = fr_idle_001
		sound = fr_idle_002
		sound = fr_idle_003
		sound = fr_idle_004
		sound = fr_idle_005
		sound = fr_idle_006
		sound = fr_idle_007
		sound = fr_idle_008
		sound = fr_idle_009
	}
	max_audible = 1
	max_audible_behaviour = fail
	volume = 2.00
	volume_random_offset = { 0.0 -0.15 }
	playbackrate_random_offset = { 0.0 -0.15 }
}
#
soundeffect =
{
	name = "FRA_infantry_neutral_combat"
	sounds = {
		sound = fr_neutral_001
		sound = fr_neutral_002
		sound = fr_neutral_003
		sound = fr_neutral_004
		sound = fr_neutral_005
		sound = fr_neutral_006
	}
	max_audible = 1
	max_audible_behaviour = fail
	volume = 2.00
	volume_random_offset = { 0.0 -0.15 }
	playbackrate_random_offset = { 0.0 -0.15}
}
#
soundeffect =
{
	name = "FRA_infantry_positive_combat"
	sounds = {
		sound = fr_positive_001
		sound = fr_positive_002
		sound = fr_positive_003
		sound = fr_positive_004
		sound = fr_positive_005
		sound = fr_positive_006
	}
	max_audible = 1
	max_audible_behaviour = fail
	volume = 2.00
	volume_random_offset = { 0.0 -0.15 }
	playbackrate_random_offset = { 0.0 -0.15}
}
#
soundeffect =
{
	name = "FRA_infantry_move_out"
	sounds = {
		sound = fr_move_001
		sound = fr_move_002
		sound = fr_move_003
		sound = fr_move_004
		sound = fr_move_005
		sound = fr_move_006
	}
	max_audible = 1
	max_audible_behaviour = fail
	volume = 2.00
	volume_random_offset = { 0.0 -0.15 }
	playbackrate_random_offset = { 0.0 -0.15 }
}
#
soundeffect =
{
	name = "FRA_infantry_retreat"
	sounds = {
		sound = fr_retreat_001
		sound = fr_retreat_002
		sound = fr_retreat_003
		sound = fr_retreat_004
	}
	max_audible = 1
	max_audible_behaviour = fail
	volume = 2.00
	volume_random_offset = { 0.0 -0.15 }
	playbackrate_random_offset = { 0.0 -0.15 }
}
# SOV (Russia)
soundeffect =
{
	name = "SOV_infantry_idle"
	sounds = {
		sound = so_idle_001
		sound = so_idle_002
		sound = so_idle_003
		sound = so_idle_004
		sound = so_idle_005
		sound = so_idle_006
		sound = so_idle_007
		sound = so_idle_008
	}
	max_audible = 1
	max_audible_behaviour = fail
	volume = 5.00
	volume_random_offset = { 0.0 -0.15 }
	playbackrate_random_offset = { 0.0 -0.15 }
}

soundeffect =
{
	name = "SOV_infantry_neutral_combat"
	sounds = {
		sound = so_neutral_001
		sound = so_neutral_002
		sound = so_neutral_003
		sound = so_neutral_004
		sound = so_neutral_005
		sound = so_neutral_006
	}
	max_audible = 1
	max_audible_behaviour = fail
	volume = 5.00
	volume_random_offset = { 0.0 -0.15 }
	playbackrate_random_offset = { 0.0 -0.15}
}

soundeffect =
{
	name = "SOV_infantry_positive_combat"
	sounds = {
		sound = so_positive_001
		sound = so_positive_002
		sound = so_positive_003
		sound = so_positive_004
		sound = so_positive_005
		sound = so_positive_006
	}
	max_audible = 1
	max_audible_behaviour = fail
	volume = 5.00
	volume_random_offset = { 0.0 -0.15 }
	playbackrate_random_offset = { 0.0 -0.15}
}

soundeffect =
{
	name = "SOV_infantry_move_out"
	sounds = {
		sound = so_move_001
		sound = so_move_002
		sound = so_move_003
		sound = so_move_004
		sound = so_move_005
		sound = so_move_006
	}
	max_audible = 1
	max_audible_behaviour = fail
	volume = 5.00
	volume_random_offset = { 0.0 -0.15 }
	playbackrate_random_offset = { 0.0 -0.15 }
}
#
soundeffect =
{
	name = "SOV_infantry_retreat"
	sounds = {
		sound = so_retreat_001
		sound = so_retreat_002
		sound = so_retreat_003
		sound = so_retreat_004
	}
	max_audible = 1
	max_audible_behaviour = fail
	volume = 4.00
	volume_random_offset = { 0.0 -0.15 }
	playbackrate_random_offset = { 0.0 -0.15 }
}
# SPR (Spain) #

soundeffect =
{
	name = "SPR_infantry_idle"
	sounds = {
		sound = sp_idle_001
		sound = sp_idle_002
		sound = sp_idle_003
		sound = sp_idle_004
		sound = sp_idle_005
		sound = sp_idle_006
		sound = sp_idle_007
		sound = sp_idle_008
	}
	max_audible = 1
	max_audible_behaviour = fail
	volume = 2.00
	volume_random_offset = { 0.0 -0.15 }
	playbackrate_random_offset = { 0.0 -0.15 }
}

soundeffect =
{
	name = "SPR_infantry_neutral_combat"
	sounds = {
		sound = sp_neutral_001
		sound = sp_neutral_002
		sound = sp_neutral_003
		sound = sp_neutral_004
		sound = sp_neutral_005
		sound = sp_neutral_006
		sound = sp_neutral_007
	}
	max_audible = 1
	max_audible_behaviour = fail
	volume = 2.00
	volume_random_offset = { 0.0 -0.15 }
	playbackrate_random_offset = { 0.0 -0.15}
}

soundeffect =
{
	name = "SPR_infantry_positive_combat"
	sounds = {
		sound = sp_positive_001
		sound = sp_positive_002
		sound = sp_positive_003
		sound = sp_positive_004
		sound = sp_positive_005
		sound = sp_positive_006
		sound = sp_positive_007
	}
	max_audible = 1
	max_audible_behaviour = fail
	volume = 2.00
	volume_random_offset = { 0.0 -0.15 }
	playbackrate_random_offset = { 0.0 -0.15}
}

soundeffect =
{
	name = "SPR_infantry_move_out"
	sounds = {
		sound = sp_move_001
		sound = sp_move_002
		sound = sp_move_003
		sound = sp_move_004
		sound = sp_move_005
	}
	max_audible = 1
	max_audible_behaviour = fail
	volume = 2.00
	volume_random_offset = { 0.0 -0.15 }
	playbackrate_random_offset = { 0.0 -0.15 }
}
#
soundeffect =
{
	name = "SPR_infantry_retreat"
	sounds = {
		sound = sp_retreat_001
		sound = sp_retreat_002
		sound = sp_retreat_003
		sound = sp_retreat_004
	}
	max_audible = 1
	max_audible_behaviour = fail
	volume = 2.00
	volume_random_offset = { 0.0 -0.15 }
	playbackrate_random_offset = { 0.0 -0.15 }
}
# PER (Iran)

soundeffect =
{
	name = "PER_infantry_idle"
	sounds = {
		sound = pe_idle_001
		sound = pe_idle_002
		sound = pe_idle_003
		sound = pe_idle_004
		sound = pe_idle_005
		sound = pe_idle_006
		sound = pe_idle_007
		sound = pe_idle_008
	}
	max_audible = 1
	max_audible_behaviour = fail
	volume = 0.85
	volume_random_offset = { 0.0 -0.15 }
	playbackrate_random_offset = { 0.0 -0.15 }
}

soundeffect =
{
	name = "PER_infantry_neutral_combat"
	sounds = {
		sound = pe_neutral_001
		sound = pe_neutral_002
		sound = pe_neutral_003
		sound = pe_neutral_004
		sound = pe_neutral_005
		sound = pe_neutral_006
		sound = pe_neutral_007
		sound = pe_neutral_008
	}
	max_audible = 1
	max_audible_behaviour = fail
	volume = 0.85
	volume_random_offset = { 0.0 -0.15 }
	playbackrate_random_offset = { 0.0 -0.15}
}

soundeffect =
{
	name = "PER_infantry_positive_combat"
	sounds = {
		sound = pe_positive_001
		sound = pe_positive_002
		sound = pe_positive_003
		sound = pe_positive_004
		sound = pe_positive_005
		sound = pe_positive_006
		sound = pe_positive_007
		sound = pe_positive_008
		sound = pe_positive_009
	}
	max_audible = 1
	max_audible_behaviour = fail
	volume = 0.85
	volume_random_offset = { 0.0 -0.15 }
	playbackrate_random_offset = { 0.0 -0.15}
}

soundeffect =
{
	name = "PER_infantry_retreat"
	sounds = {
		sound = pe_retreat_001
		sound = pe_retreat_002
		sound = pe_retreat_003
		sound = pe_retreat_004
		sound = pe_retreat_005
		sound = pe_retreat_006
		sound = pe_retreat_007
	}
	max_audible = 1
	max_audible_behaviour = fail
	volume = 0.85
	volume_random_offset = { 0.0 -0.15 }
	playbackrate_random_offset = { 0.0 -0.15}
}

soundeffect =
{
	name = "PER_infantry_move_out"
	sounds = {
		sound = pe_move_001
		sound = pe_move_002
		sound = pe_move_003
		sound = pe_move_004
		sound = pe_move_005
		sound = pe_move_006
		sound = pe_move_007
		sound = pe_move_008
	}
	max_audible = 1
	max_audible_behaviour = fail
	volume = 0.85
	volume_random_offset = { 0.0 -0.15 }
	playbackrate_random_offset = { 0.0 -0.15 }
}

# ARM (Armenia)

soundeffect =
{
	name = "ARM_infantry_idle"
	sounds = {
		sound = ar_Idle_001
		sound = ar_Idle_002
		sound = ar_Idle_003
		sound = ar_Idle_004
		sound = ar_Idle_005
		sound = ar_Idle_006
		sound = ar_Idle_010
		sound = ar_Idle_011
		sound = ar_Idle_012
		sound = ar_Idle_016
		sound = ar_Idle_017
		sound = ar_Idle_018
		sound = ar_Idle_019
		sound = ar_Idle_020
		sound = ar_Idle_021
		sound = ar_Idle_022
		sound = ar_Idle_023
		sound = ar_Idle_024
		sound = ar_Idle_025
		sound = ar_Idle_026
		sound = ar_Idle_027
	}
	max_audible = 1
	max_audible_behaviour = fail
	volume = 0.45
	volume_random_offset = { 0.0 -0.15 }
	playbackrate_random_offset = { 0.0 -0.15 }
}
soundeffect =
{
	name = "ARM_infantry_neutral_combat"
	sounds = {
		sound = ar_Neutral_001
		sound = ar_Neutral_002
		sound = ar_Neutral_003
		sound = ar_Neutral_004
		sound = ar_Neutral_005
		sound = ar_Neutral_006
		sound = ar_Neutral_007
		sound = ar_Neutral_008
		sound = ar_Neutral_009
		sound = ar_Neutral_010
		sound = ar_Neutral_011
		sound = ar_Neutral_012
		sound = ar_Neutral_013
		sound = ar_Neutral_014
		sound = ar_Neutral_015
		sound = ar_Neutral_016
		sound = ar_Neutral_017
		sound = ar_Neutral_018
		sound = ar_Neutral_019
		sound = ar_Neutral_020
	}
	max_audible = 1
	max_audible_behaviour = fail
	volume = 0.45
	volume_random_offset = { 0.0 -0.15 }
	playbackrate_random_offset = { 0.0 -0.15}
}
soundeffect =
{
	name = "ARM_infantry_positive_combat"
	sounds = {
		sound = ar_Positive_001
		sound = ar_Positive_002
		sound = ar_Positive_003
		sound = ar_Positive_007
		sound = ar_Positive_008
		sound = ar_Positive_009
		sound = ar_Positive_010
		sound = ar_Positive_011
		sound = ar_Positive_012
		sound = ar_Positive_013
		sound = ar_Positive_014
		sound = ar_Positive_015
		sound = ar_Positive_016
		sound = ar_Positive_017
		sound = ar_Positive_018
		sound = ar_Positive_019
		sound = ar_Positive_020
		sound = ar_Positive_021
		sound = ar_Positive_022
		sound = ar_Positive_023
		sound = ar_Positive_024
	}
	max_audible = 1
	max_audible_behaviour = fail
	volume = 0.45
	volume_random_offset = { 0.0 -0.15 }
	playbackrate_random_offset = { 0.0 -0.15}
}
soundeffect =
{
	name = "ARM_infantry_retreat"
	sounds = {
		sound = ar_Retreat_001
		sound = ar_Retreat_002
		sound = ar_Retreat_003
		sound = ar_Retreat_004
		sound = ar_Retreat_005
		sound = ar_Retreat_006
		sound = ar_Retreat_007
		sound = ar_Retreat_008
		sound = ar_Retreat_009
		sound = ar_Retreat_010
		sound = ar_Retreat_011
		sound = ar_Retreat_012
		sound = ar_Retreat_013
		sound = ar_Retreat_014
		sound = ar_Retreat_015
		sound = ar_Retreat_016
		sound = ar_Retreat_017
		sound = ar_Retreat_018
	}
	max_audible = 1
	max_audible_behaviour = fail
	volume = 0.45
	volume_random_offset = { 0.0 -0.15 }
	playbackrate_random_offset = { 0.0 -0.15}
}
soundeffect =
{
	name = "ARM_infantry_move_out"
	sounds = {
		sound = ar_Positive_010
		sound = ar_Positive_011
		sound = ar_Positive_012

	}
	max_audible = 1
	max_audible_behaviour = fail
	volume = 0.45
	volume_random_offset = { 0.0 -0.15 }
	playbackrate_random_offset = { 0.0 -0.15}
}
# HEZ
soundeffect = {
	name = "HEZ_infantry_idle"
	sounds = {
		sound = lb_idle_001
		sound = lb_idle_002
		sound = lb_idle_003
		sound = lb_idle_004
		sound = lb_idle_005
		sound = lb_idle_006
		sound = lb_idle_007
	}
	max_audible = 1
	max_audible_behaviour = fail
	volume = 1.00
	volume_random_offset = { 0.0 -0.15 }
	playbackrate_random_offset = { 0.0 -0.15 }
}
soundeffect = {
	name = "HEZ_infantry_neutral_combat"
	sounds = {
		sound = lb_neutral_001
		sound = lb_neutral_002
		sound = lb_neutral_003
		sound = lb_neutral_004
		sound = lb_neutral_005
		sound = lb_neutral_006
		sound = lb_neutral_007
		sound = lb_neutral_008
		sound = lb_neutral_009
		sound = lb_neutral_010
		sound = hz_neutral_001
	}
	max_audible = 1
	max_audible_behaviour = fail
	volume = 1.00
	volume_random_offset = { 0.0 -0.15 }
	playbackrate_random_offset = { 0.0 -0.15}
}

soundeffect = {
	name = "HEZ_infantry_positive_combat"
	sounds = {
		sound = lb_positive_001
		sound = lb_positive_002
		sound = lb_positive_003
		sound = lb_positive_004
		sound = lb_positive_005
		sound = lb_positive_006
		sound = lb_positive_007
		sound = lb_positive_008
		sound = hz_positive_001
	}
	max_audible = 1
	max_audible_behaviour = fail
	volume = 1.00
	volume_random_offset = { 0.0 -0.15 }
	playbackrate_random_offset = { 0.0 -0.15}
}

soundeffect = {
	name = "HEZ_infantry_retreat"
	sounds = {
		sound = lb_retreat_001
		sound = lb_retreat_002
		sound = lb_retreat_003
		sound = lb_retreat_004
	}
	max_audible = 1
	max_audible_behaviour = fail
	volume = 5.00
	volume_random_offset = { 0.0 -0.15 }
	playbackrate_random_offset = { 0.0 -0.15}
}

soundeffect = {
	name = "HEZ_infantry_move_out"
	sounds = {
		sound = lb_move_001
		sound = lb_move_002
		sound = lb_move_003
		sound = lb_move_004
		sound = lb_move_005
		sound = lb_move_005
		sound = lb_move_006
		sound = lb_move_007
		sound = lb_move_008
		sound = lb_move_009
		sound = lb_move_010
		sound = lb_move_011
	}
	max_audible = 1
	max_audible_behaviour = fail
	volume = 5.00
	volume_random_offset = { 0.0 -0.15 }
	playbackrate_random_offset = { 0.0 -0.15 }
}

# LEB
soundeffect = {
	name = "LEB_infantry_idle"
	sounds = {
		sound = lb_idle_001
		sound = lb_idle_002
		sound = lb_idle_003
		sound = lb_idle_004
		sound = lb_idle_005
		sound = lb_idle_006
		sound = lb_idle_007
	}
	max_audible = 1
	max_audible_behaviour = fail
	volume = 1.00
	volume_random_offset = { 0.0 -0.15 }
	playbackrate_random_offset = { 0.0 -0.15 }
}

soundeffect = {
	name = "LEB_infantry_neutral_combat"
	sounds = {
		sound = lb_neutral_001
		sound = lb_neutral_002
		sound = lb_neutral_003
		sound = lb_neutral_004
		sound = lb_neutral_005
		sound = lb_neutral_006
		sound = lb_neutral_007
		sound = lb_neutral_008
	}
	max_audible = 1
	max_audible_behaviour = fail
	volume = 1.00
	volume_random_offset = { 0.0 -0.15 }
	playbackrate_random_offset = { 0.0 -0.15}
}

soundeffect = {
	name = "LEB_infantry_positive_combat"
	sounds = {
		sound = lb_positive_001
		sound = lb_positive_002
		sound = lb_positive_003
		sound = lb_positive_004
		sound = lb_positive_005
		sound = lb_positive_006
		sound = lb_positive_007
		sound = lb_positive_008
	}
	max_audible = 1
	max_audible_behaviour = fail
	volume = 5.00
	volume_random_offset = { 0.0 -0.15 }
	playbackrate_random_offset = { 0.0 -0.15}
}

soundeffect = {
	name = "LEB_infantry_retreat"
	sounds = {
		sound = lb_retreat_001
		sound = lb_retreat_002
		sound = lb_retreat_003
		sound = lb_retreat_004
	}
	max_audible = 1
	max_audible_behaviour = fail
	volume = 5.00
	volume_random_offset = { 0.0 -0.15 }
	playbackrate_random_offset = { 0.0 -0.15}
}

soundeffect = {
	name = "LEB_infantry_move_out"
	sounds = {
		sound = lb_move_001
		sound = lb_move_002
		sound = lb_move_003
		sound = lb_move_004
		sound = lb_move_005
		sound = lb_move_005
		sound = lb_move_006
		sound = lb_move_007
		sound = lb_move_008
		sound = lb_move_009
		sound = lb_move_010
		sound = lb_move_011
	}
	max_audible = 1
	max_audible_behaviour = fail
	volume = 5.00
	volume_random_offset = { 0.0 -0.15 }
	playbackrate_random_offset = { 0.0 -0.15 }
}
# AUDIO ASSETS
# ARM
sound =
{
	name = "ar_Idle_001"
	file = "arm/ar_Idle_001.wav"
}
sound =
{
	name = "ar_Idle_002"
	file = "arm/ar_Idle_002.wav"
}
sound =
{
	name = "ar_Idle_003"
	file = "arm/ar_Idle_003.wav"
}

sound =
{
	name = "ar_Idle_004"
	file = "arm/ar_Idle_004.wav"
}

sound =
{
	name = "ar_Idle_005"
	file = "arm/ar_Idle_005.wav"
}

sound =
{
	name = "ar_Idle_006"
	file = "arm/ar_Idle_006.wav"
}

sound =
{
	name = "ar_Idle_010"
	file = "arm/ar_Idle_010.wav"
}
sound =
{
	name = "ar_Idle_011"
	file = "arm/ar_Idle_011.wav"
}

sound =
{
	name = "ar_Idle_012"
	file = "arm/ar_Idle_012.wav"
}
sound =
{
	name = "ar_Idle_016"
	file = "arm/ar_Idle_016.wav"
}
sound =
{
	name = "ar_Idle_017"
	file = "arm/ar_Idle_017.wav"
}
sound =
{
	name = "ar_Idle_018"
	file = "arm/ar_Idle_018.wav"
}
sound =
{
	name = "ar_Idle_019"
	file = "arm/ar_Idle_019.wav"
}
sound =
{
	name = "ar_Idle_020"
	file = "arm/ar_Idle_020.wav"
}
sound =
{
	name = "ar_Idle_021"
	file = "arm/ar_Idle_021.wav"
}
sound =
{
	name = "ar_Idle_022"
	file = "arm/ar_Idle_022.wav"
}
sound =
{
	name = "ar_Idle_023"
	file = "arm/ar_Idle_023.wav"
}
sound =
{
	name = "ar_Idle_024"
	file = "arm/ar_Idle_024.wav"
}
sound =
{
	name = "ar_Idle_025"
	file = "arm/ar_Idle_025.wav"
}
sound =
{
	name = "ar_Idle_026"
	file = "arm/ar_Idle_026.wav"
}
sound =
{
	name = "ar_Idle_027"
	file = "arm/ar_Idle_027.wav"
}
sound =
{
	name = "ar_Neutral_001"
	file = "arm/ar_Neutral_001.wav"
}
sound =
{
	name = "ar_Neutral_002"
	file = "arm/ar_Neutral_002.wav"
}
sound =
{
	name = "ar_Neutral_003"
	file = "arm/ar_Neutral_003.wav"
}
sound =
{
	name = "ar_Neutral_004"
	file = "arm/ar_Neutral_004.wav"
}
sound =
{
	name = "ar_Neutral_005"
	file = "arm/ar_Neutral_005.wav"
}
sound =
{
	name = "ar_Neutral_006"
	file = "arm/ar_Neutral_006.wav"
}
sound =
{
	name = "ar_Neutral_007"
	file = "arm/ar_Neutral_007.wav"
}
sound =
{
	name = "ar_Neutral_008"
	file = "arm/ar_Neutral_008.wav"
}
sound =
{
	name = "ar_Neutral_009"
	file = "arm/ar_Neutral_009.wav"
}
sound =
{
	name = "ar_Neutral_010"
	file = "arm/ar_Neutral_010.wav"
}

sound =
{
	name = "ar_Neutral_011"
	file = "arm/ar_Neutral_011.wav"
}

sound =
{
	name = "ar_Neutral_012"
	file = "arm/ar_Neutral_012.wav"
}

sound =
{
	name = "ar_Neutral_013"
	file = "arm/ar_Neutral_013.wav"
}

sound =
{
	name = "ar_Neutral_014"
	file = "arm/ar_Neutral_014.wav"
}

sound =
{
	name = "ar_Neutral_015"
	file = "arm/ar_Neutral_015.wav"
}

sound =
{
	name = "ar_Neutral_016"
	file = "arm/ar_Neutral_016.wav"
}

sound =
{
	name = "ar_Neutral_017"
	file = "arm/ar_Neutral_017.wav"
}

sound =
{
	name = "ar_Neutral_018"
	file = "arm/ar_Neutral_018.wav"
}

sound =
{
	name = "ar_Neutral_019"
	file = "arm/ar_Neutral_019.wav"
}
sound =
{
	name = "ar_Neutral_020"
	file = "arm/ar_Neutral_020.wav"
}

sound =
{
	name = "ar_Positive_001"
	file = "arm/ar_Positive_001.wav"
}
sound =
{
	name = "ar_Positive_002"
	file = "arm/ar_Positive_002.wav"
}
sound =
{
	name = "ar_Positive_003"
	file = "arm/ar_Positive_003.wav"
}
sound =
{
	name = "ar_Positive_007"
	file = "arm/ar_Positive_007.wav"
}
sound =
{
	name = "ar_Positive_008"
	file = "arm/ar_Positive_008.wav"
}
sound =
{
	name = "ar_Positive_009"
	file = "arm/ar_Positive_009.wav"
}
sound =
{
	name = "ar_Positive_010"
	file = "arm/ar_Positive_010.wav"
}
sound =
{
	name = "ar_Positive_011"
	file = "arm/ar_Positive_011.wav"
}
sound =
{
	name = "ar_Positive_012"
	file = "arm/ar_Positive_012.wav"
}
sound =
{
	name = "ar_Positive_013"
	file = "arm/ar_Positive_013.wav"
}
sound =
{
	name = "ar_Positive_014"
	file = "arm/ar_Positive_014.wav"
}
sound =
{
	name = "ar_Positive_015"
	file = "arm/ar_Positive_015.wav"
}
sound =
{
	name = "ar_Positive_016"
	file = "arm/ar_Positive_016.wav"
}
sound =
{
	name = "ar_Positive_017"
	file = "arm/ar_Positive_017.wav"
}
sound =
{
	name = "ar_Positive_018"
	file = "arm/ar_Positive_018.wav"
}
sound =
{
	name = "ar_Positive_019"
	file = "arm/ar_Positive_019.wav"
}
sound =
{
	name = "ar_Positive_020"
	file = "arm/ar_Positive_020.wav"
}
sound =
{
	name = "ar_Positive_021"
	file = "arm/ar_Positive_021.wav"
}
sound =
{
	name = "ar_Positive_022"
	file = "arm/ar_Positive_022.wav"
}

sound =
{
	name = "ar_Positive_023"
	file = "arm/ar_Positive_023.wav"
}

sound =
{
	name = "ar_Positive_024"
	file = "arm/ar_Positive_024.wav"
}

sound =
{
	name = "ar_Retreat_001"
	file = "arm/ar_Retreat_001.wav"
}
sound =
{
	name = "ar_Retreat_002"
	file = "arm/ar_Retreat_002.wav"
}

sound =
{
	name = "ar_Retreat_003"
	file = "arm/ar_Retreat_003.wav"
}
sound =
{
	name = "ar_Retreat_004"
	file = "arm/ar_Retreat_004.wav"
}
sound =
{
	name = "ar_Retreat_005"
	file = "arm/ar_Retreat_005.wav"
}
sound =
{
	name = "ar_Retreat_006"
	file = "arm/ar_Retreat_006.wav"
}
sound =
{
	name = "ar_Retreat_007"
	file = "arm/ar_Retreat_007.wav"
}
sound =
{
	name = "ar_Retreat_008"
	file = "arm/ar_Retreat_008.wav"
}
sound =
{
	name = "ar_Retreat_009"
	file = "arm/ar_Retreat_009.wav"
}
sound =
{
	name = "ar_Retreat_010"
	file = "arm/ar_Retreat_010.wav"
}
sound =
{
	name = "ar_Retreat_011"
	file = "arm/ar_Retreat_011.wav"
}
sound =
{
	name = "ar_Retreat_012"
	file = "arm/ar_Retreat_012.wav"
}
sound =
{
	name = "ar_Retreat_013"
	file = "arm/ar_Retreat_013.wav"
}
sound =
{
	name = "ar_Retreat_014"
	file = "arm/ar_Retreat_014.wav"
}
sound =
{
	name = "ar_Retreat_015"
	file = "arm/ar_Retreat_015.wav"
}
sound =
{
	name = "ar_Retreat_016"
	file = "arm/ar_Retreat_016.wav"
}
sound =
{
	name = "ar_Retreat_017"
	file = "arm/ar_Retreat_017.wav"
}
sound =
{
	name = "ar_Retreat_018"
	file = "arm/ar_Retreat_018.wav"
}

# PER
sound =
{
	name = "pe_idle_001"
	file = "per/pe_idle_005.wav"
}
sound =
{
	name = "pe_idle_002"
	file = "per/pe_idle_002.wav"
}
sound =
{
	name = "pe_idle_003"
	file = "per/pe_idle_003.wav"
}
sound =
{
	name = "pe_idle_004"
	file = "per/pe_idle_004.wav"
}
sound =
{
	name = "pe_idle_005"
	file = "per/pe_idle_001.wav"
}
sound =
{
	name = "pe_idle_006"
	file = "per/pe_idle_006.wav"
}
sound =
{
	name = "pe_idle_007"
	file = "per/pe_idle_007.wav"
}
sound =
{
	name = "pe_idle_008"
	file = "per/pe_idle_007.wav"
}
sound =
{
	name = "pe_neutral_001"
	file = "per/pe_neutral_001.wav"
}
sound =
{
	name = "pe_neutral_002"
	file = "per/pe_neutral_002.wav"
}
sound =
{
	name = "pe_neutral_003"
	file = "per/pe_neutral_003.wav"
}
sound =
{
	name = "pe_neutral_004"
	file = "per/pe_neutral_004.wav"
}
sound =
{
	name = "pe_neutral_005"
	file = "per/pe_neutral_005.wav"
}
sound =
{
	name = "pe_neutral_006"
	file = "per/pe_neutral_006.wav"
}
sound =
{
	name = "pe_neutral_007"
	file = "per/pe_neutral_007.wav"
}
sound =
{
	name = "pe_neutral_008"
	file = "per/pe_neutral_008.wav"
}
sound =
{
	name = "pe_positive_001"
	file = "per/pe_positive_001.wav"
}
sound =
{
	name = "pe_positive_002"
	file = "per/pe_positive_002.wav"
}
sound =
{
	name = "pe_positive_003"
	file = "per/pe_positive_003.wav"
}
sound =
{
	name = "pe_positive_004"
	file = "per/pe_positive_004.wav"
}
sound =
{
	name = "pe_positive_005"
	file = "per/pe_positive_005.wav"
}
sound =
{
	name = "pe_positive_006"
	file = "per/pe_positive_006.wav"
}
sound =
{
	name = "pe_positive_007"
	file = "per/pe_positive_007.wav"
}
sound =
{
	name = "pe_positive_008"
	file = "per/pe_positive_008.wav"
}
sound =
{
	name = "pe_positive_009"
	file = "per/pe_positive_009.wav"
}
sound =
{
	name = "pe_retreat_001"
	file = "per/pe_retreat_001.wav"
}
sound =
{
	name = "pe_retreat_002"
	file = "per/pe_retreat_002.wav"
}
sound =
{
	name = "pe_retreat_003"
	file = "per/pe_retreat_003.wav"
}
sound =
{
	name = "pe_retreat_004"
	file = "per/pe_retreat_004.wav"
}
sound =
{
	name = "pe_retreat_005"
	file = "per/pe_retreat_005.wav"
}
sound =
{
	name = "pe_retreat_006"
	file = "per/pe_retreat_006.wav"
}
sound =
{
	name = "pe_retreat_007"
	file = "per/pe_retreat_007.wav"
}
sound =
{
	name = "pe_move_001"
	file = "per/pe_move_001.wav"
}
sound =
{
	name = "pe_move_002"
	file = "per/pe_move_002.wav"
}
sound =
{
	name = "pe_move_003"
	file = "per/pe_move_003.wav"
}
sound =
{
	name = "pe_move_004"
	file = "per/pe_move_005.wav"
}
sound =
{
	name = "pe_move_005"
	file = "per/pe_move_005.wav"
}
sound =
{
	name = "pe_move_006"
	file = "per/pe_move_006.wav"
}
sound =
{
	name = "pe_move_007"
	file = "per/pe_move_007.wav"
}
sound =
{
	name = "pe_move_008"
	file = "per/pe_move_008.wav"
}
# TUR

sound =
{
	name = "tu_idle_001"
	file = "tur/tu_idle_001.wav"
}
sound =
{
	name = "tu_idle_002"
	file = "tur/tu_idle_002.wav"
}
sound =
{
	name = "tu_idle_003"
	file = "tur/tu_idle_003.wav"
}
sound =
{
	name = "tu_idle_004"
	file = "tur/tu_idle_004.wav"
}
sound =
{
	name = "tu_idle_005"
	file = "tur/tu_idle_005.wav"
}
sound =
{
	name = "tu_idle_006"
	file = "tur/tu_idle_006.wav"
}
sound =
{
	name = "tu_idle_007"
	file = "tur/tu_idle_007.wav"
}
sound =
{
	name = "tu_idle_008"
	file = "tur/tu_idle_008.wav"
}
sound =
{
	name = "tu_move_001"
	file = "tur/tu_move_001.wav"
}
sound =
{
	name = "tu_move_002"
	file = "tur/tu_move_002.wav"
}
sound =
{
	name = "tu_move_003"
	file = "tur/tu_move_003.wav"
}
sound =
{
	name = "tu_move_004"
	file = "tur/tu_move_004.wav"
}
sound =
{
	name = "tu_move_005"
	file = "tur/tu_move_005.wav"
}
sound =
{
	name = "tu_move_006"
	file = "tur/tu_move_006.wav"
}
sound =
{
	name = "tu_move_007"
	file = "tur/tu_move_007.wav"
}
sound =
{
	name = "tu_neutral_001"
	file = "tur/tu_neutral_001.wav"
}
sound =
{
	name = "tu_neutral_002"
	file = "tur/tu_neutral_002.wav"
}
sound =
{
	name = "tu_neutral_003"
	file = "tur/tu_neutral_003.wav"
}
sound =
{
	name = "tu_neutral_004"
	file = "tur/tu_neutral_004.wav"
}
sound =
{
	name = "tu_neutral_005"
	file = "tur/tu_neutral_005.wav"
}
sound =
{
	name = "tu_neutral_006"
	file = "tur/tu_neutral_006.wav"
}
sound =
{
	name = "tu_neutral_007"
	file = "tur/tu_neutral_007.wav"
}
sound =
{
	name = "tu_neutral_008"
	file = "tur/tu_neutral_008.wav"
}
sound =
{
	name = "tu_positive_001"
	file = "tur/tu_positive_001.wav"
}
sound =
{
	name = "tu_positive_002"
	file = "tur/tu_positive_002.wav"
}
sound =
{
	name = "tu_positive_003"
	file = "tur/tu_positive_003.wav"
}
sound =
{
	name = "tu_positive_004"
	file = "tur/tu_positive_004.wav"
}
sound =
{
	name = "tu_positive_005"
	file = "tur/tu_positive_005.wav"
}
sound =
{
	name = "tu_positive_006"
	file = "tur/tu_positive_006.wav"
}
sound =
{
	name = "tu_retreat_001"
	file = "tur/tu_retreat_001.wav"
}
sound =
{
	name = "tu_retreat_002"
	file = "tur/tu_retreat_002.wav"
}
sound =
{
	name = "tu_retreat_003"
	file = "tur/tu_retreat_003.wav"
}

sound =
{
	name = "tu_retreat_004"
	file = "tur/tu_retreat_004.wav"
}
# SPR
sound =
{
	name = "so_idle_001"
	file = "sov/so_idle_001.wav"
}
sound =
{
	name = "so_idle_002"
	file = "sov/so_idle_002.wav"
}
sound =
{
	name = "so_idle_003"
	file = "sov/so_idle_003.wav"
}
sound =
{
	name = "so_idle_004"
	file = "sov/so_idle_004.wav"
}
sound =
{
	name = "so_idle_005"
	file = "sov/so_idle_005.wav"
}
sound =
{
	name = "so_idle_006"
	file = "sov/so_idle_006.wav"
}
sound =
{
	name = "so_idle_007"
	file = "sov/so_idle_007.wav"
}
sound =
{
	name = "so_idle_008"
	file = "sov/so_idle_008.wav"
}
sound =
{
	name = "so_move_001"
	file = "sov/so_move_001.wav"
}
sound =
{
	name = "so_move_002"
	file = "sov/so_move_002.wav"
}
sound =
{
	name = "so_move_003"
	file = "sov/so_move_003.wav"
}
sound =
{
	name = "so_move_004"
	file = "sov/so_move_004.wav"
}
#
sound =
{
	name = "so_move_005"
	file = "sov/so_move_005.wav"
}
#
sound =
{
	name = "so_move_006"
	file = "sov/so_move_006.wav"
}
# # #
sound =
{
	name = "so_neutral_001"
	file = "sov/so_neutral_001.wav"
}
#
sound =
{
	name = "so_neutral_002"
	file = "sov/so_neutral_002.wav"
}
#
sound =
{
	name = "so_neutral_003"
	file = "sov/so_neutral_003.wav"
}
#
sound =
{
	name = "so_neutral_004"
	file = "sov/so_neutral_004.wav"
}
#
sound =
{
	name = "so_neutral_005"
	file = "sov/so_neutral_005.wav"
}
#
sound =
{
	name = "so_neutral_006"
	file = "sov/so_neutral_006.wav"
}
#
sound =
{
	name = "so_positive_001"
	file = "sov/so_positive_001.wav"
}
#
sound =
{
	name = "so_positive_002"
	file = "sov/so_positive_002.wav"
}
#
sound =
{
	name = "so_positive_003"
	file = "sov/so_positive_003.wav"
}
#
sound =
{
	name = "so_positive_004"
	file = "sov/so_positive_004.wav"
}
#
sound =
{
	name = "so_positive_005"
	file = "sov/so_positive_005.wav"
}
#
sound =
{
	name = "so_positive_006"
	file = "sov/so_positive_006.wav"
}
#
sound =
{
	name = "so_retreat_001"
	file = "sov/so_retreat_001.wav"
}
#
sound =
{
	name = "so_retreat_002"
	file = "sov/so_retreat_002.wav"
}
#
sound =
{
	name = "so_retreat_003"
	file = "sov/so_retreat_003.wav"
}
#
sound =
{
	name = "so_retreat_004"
	file = "sov/so_retreat_004.wav"
}
#
sound =
{
	name = "sp_idle_001"
	file = "spr/sp_idle_001.wav"
}
sound =
{
	name = "sp_idle_002"
	file = "spr/sp_idle_002.wav"
}
sound =
{
	name = "sp_idle_003"
	file = "spr/sp_idle_003.wav"
}
sound =
{
	name = "sp_idle_004"
	file = "spr/sp_idle_004.wav"
}
sound =
{
	name = "sp_idle_005"
	file = "spr/sp_idle_005.wav"
}
sound =
{
	name = "sp_idle_006"
	file = "spr/sp_idle_006.wav"
}
sound =
{
	name = "sp_idle_007"
	file = "spr/sp_idle_007.wav"
}
sound =
{
	name = "sp_idle_008"
	file = "spr/sp_idle_008.wav"
}
sound =
{
	name = "sp_move_001"
	file = "spr/sp_move_001.wav"
}
sound =
{
	name = "sp_move_002"
	file = "spr/sp_move_002.wav"
}
sound =
{
	name = "sp_move_003"
	file = "spr/sp_move_003.wav"
}
sound =
{
	name = "sp_move_004"
	file = "spr/sp_move_004.wav"
}
#
sound =
{
	name = "sp_move_005"
	file = "spr/sp_move_005.wav"
}
# # #
sound =
{
	name = "sp_neutral_001"
	file = "spr/sp_neutral_001.wav"
}
#
sound =
{
	name = "sp_neutral_002"
	file = "spr/sp_neutral_002.wav"
}
#
sound =
{
	name = "sp_neutral_003"
	file = "spr/sp_neutral_003.wav"
}
#
sound =
{
	name = "sp_neutral_004"
	file = "spr/sp_neutral_004.wav"
}
#
sound =
{
	name = "sp_neutral_005"
	file = "spr/sp_neutral_005.wav"
}
#
sound =
{
	name = "sp_neutral_006"
	file = "spr/sp_neutral_006.wav"
}
#
sound =
{
	name = "sp_neutral_007"
	file = "spr/sp_neutral_007.wav"
}
#
sound =
{
	name = "sp_positive_001"
	file = "spr/sp_positive_001.wav"
}
#
sound =
{
	name = "sp_positive_002"
	file = "spr/sp_positive_002.wav"
}
#
sound =
{
	name = "sp_positive_003"
	file = "spr/sp_positive_003.wav"
}
#
sound =
{
	name = "sp_positive_004"
	file = "spr/sp_positive_004.wav"
}
#
sound =
{
	name = "sp_positive_005"
	file = "spr/sp_positive_005.wav"
}
#
sound =
{
	name = "sp_positive_006"
	file = "spr/sp_positive_006.wav"
}
#
sound =
{
	name = "sp_positive_007"
	file = "spr/sp_positive_007.wav"
}
#
sound =
{
	name = "sp_retreat_001"
	file = "spr/sp_retreat_001.wav"
}
#
sound =
{
	name = "sp_retreat_002"
	file = "spr/sp_retreat_002.wav"
}
#
sound =
{
	name = "sp_retreat_003"
	file = "spr/sp_retreat_003.wav"
}
#
sound =
{
	name = "sp_retreat_004"
	file = "spr/sp_retreat_004.wav"
}
# FRA
sound =
{
	name = "fr_idle_001"
	file = "fra/fr_idle_001.wav"
}
sound =
{
	name = "fr_idle_002"
	file = "fra/fr_idle_002.wav"
}
sound =
{
	name = "fr_idle_003"
	file = "fra/fr_idle_003.wav"
}
sound =
{
	name = "fr_idle_004"
	file = "fra/fr_idle_004.wav"
}
sound =
{
	name = "fr_idle_005"
	file = "fra/fr_idle_005.wav"
}
sound =
{
	name = "fr_idle_006"
	file = "fra/fr_idle_006.wav"
}
sound =
{
	name = "fr_idle_007"
	file = "fra/fr_idle_007.wav"
}
sound =
{
	name = "fr_idle_008"
	file = "fra/fr_idle_008.wav"
}
sound =
{
	name = "fr_idle_009"
	file = "fra/fr_idle_009.wav"
}
# FRANCE MOVING VOICE LINES
sound =
{
	name = "fr_move_001"
	file = "fra/fr_move_001.wav"
}
sound =
{
	name = "fr_move_002"
	file = "fra/fr_move_002.wav"
}
sound =
{
	name = "fr_move_003"
	file = "fra/fr_move_003.wav"
}
sound =
{
	name = "fr_move_004"
	file = "fra/fr_move_004.wav"
}
sound =
{
	name = "fr_move_005"
	file = "fra/fr_move_005.wav"
}
sound =
{
	name = "fr_move_006"
	file = "fra/fr_move_006.wav"
}
# FRANCE NEUTRAL ATTACKING VOICE LINES
sound =
{
	name = "fr_neutral_001"
	file = "fra/fr_neutral_001.wav"
}
sound =
{
	name = "fr_neutral_002"
	file = "fra/fr_neutral_002.wav"
}
sound =
{
	name = "fr_neutral_003"
	file = "fra/fr_neutral_003.wav"
}
sound =
{
	name = "fr_neutral_004"
	file = "fra/fr_neutral_004.wav"
}
sound =
{
	name = "fr_neutral_005"
	file = "fra/fr_neutral_005.wav"
}
sound =
{
	name = "fr_neutral_006"
	file = "fra/fr_neutral_006.wav"
}
# FRANCE ATTACKING POSITIVE VOICE LINES
sound =
{
	name = "fr_positive_001"
	file = "fra/fr_positive_001.wav"
}
sound =
{
	name = "fr_positive_002"
	file = "fra/fr_positive_002.wav"
}
sound =
{
	name = "fr_positive_003"
	file = "fra/fr_positive_003.wav"
}
sound =
{
	name = "fr_positive_004"
	file = "fra/fr_positive_004.wav"
}
sound =
{
	name = "fr_positive_005"
	file = "fra/fr_positive_005.wav"
}
sound =
{
	name = "fr_positive_006"
	file = "fra/fr_positive_006.wav"
}
# FRANCE RETREATING VOICE LINES
sound =
{
	name = "fr_retreat_001"
	file = "fra/fr_retreat_001.wav"
}
sound =
{
	name = "fr_retreat_002"
	file = "fra/fr_retreat_002.wav"
}
sound =
{
	name = "fr_retreat_003"
	file = "fra/fr_retreat_003.wav"
}
sound =
{
	name = "fr_retreat_004"
	file = "fra/fr_retreat_004.wav"
}
# ITALY
sound =
{
	name = "it_idle_001"
	file = "ita/it_idle_001.wav"
}
sound =
{
	name = "it_idle_002"
	file = "ita/it_idle_002.wav"
}
sound =
{
	name = "it_idle_003"
	file = "ita/it_idle_003.wav"
}
sound =
{
	name = "it_idle_004"
	file = "ita/it_idle_004.wav"
}
sound =
{
	name = "it_idle_005"
	file = "ita/it_idle_005.wav"
}
sound =
{
	name = "it_idle_006"
	file = "ita/it_idle_006.wav"
}
sound =
{
	name = "it_idle_007"
	file = "ita/it_idle_007.wav"
}
sound =
{
	name = "it_idle_008"
	file = "ita/it_idle_008.wav"
}
# ITALIAN MOVING VOICE LINES
sound =
{
	name = "it_move_001"
	file = "ita/it_move_001.wav"
}
sound =
{
	name = "it_move_002"
	file = "ita/it_move_002.wav"
}
sound =
{
	name = "it_move_003"
	file = "ita/it_move_003.wav"
}
sound =
{
	name = "it_move_004"
	file = "ita/it_move_004.wav"
}
sound =
{
	name = "it_move_005"
	file = "ita/it_move_005.wav"
}
# ITALIAN ATTACKING VOICELINES
sound =
{
	name = "it_neutral_001"
	file = "ita/it_neutral_001.wav"
}
sound =
{
	name = "it_neutral_002"
	file = "ita/it_neutral_002.wav"
}
sound =
{
	name = "it_neutral_003"
	file = "ita/it_neutral_003.wav"
}
sound =
{
	name = "it_neutral_004"
	file = "ita/it_neutral_004.wav"
}
sound =
{
	name = "it_neutral_005"
	file = "ita/it_neutral_005.wav"
}
sound =
{
	name = "it_neutral_006"
	file = "ita/it_neutral_006.wav"
}
# ITALIAN ATTACKING VOICE LINES POSITIVE
sound =
{
	name = "it_positive_001"
	file = "ita/it_positive_001.wav"
}
sound =
{
	name = "it_positive_002"
	file = "ita/it_positive_002.wav"
}
sound =
{
	name = "it_positive_003"
	file = "ita/it_positive_003.wav"
}
sound =
{
	name = "it_positive_004"
	file = "ita/it_positive_004.wav"
}
sound =
{
	name = "it_positive_005"
	file = "ita/it_positive_005.wav"
}
sound =
{
	name = "it_positive_006"
	file = "ita/it_positive_006.wav"
}
#
sound =
{
	name = "it_retreat_001"
	file = "ita/it_retreat_001.wav"
}
sound =
{
	name = "it_retreat_002"
	file = "ita/it_retreat_002.wav"
}
sound =
{
	name = "it_retreat_003"
	file = "ita/it_retreat_003.wav"
}
# BRITISH VOICELINES
sound =
{
	name = "en_idle_001"
	file = "eng/en_idle_001.wav"
}
sound =
{
	name = "en_idle_002"
	file = "eng/en_idle_002.wav"
}
sound =
{
	name = "en_idle_003"
	file = "eng/en_idle_003.wav"
}
sound =
{
	name = "en_idle_004"
	file = "eng/en_idle_004.wav"
}
sound =
{
	name = "en_idle_005"
	file = "eng/en_idle_005.wav"
}
sound =
{
	name = "en_idle_006"
	file = "eng/en_idle_006.wav"
}
sound =
{
	name = "en_idle_007"
	file = "eng/en_idle_007.wav"
}
sound =
{
	name = "en_idle_008"
	file = "eng/en_idle_008.wav"
}
# BRITISH MOVING VOICE LINES
sound =
{
	name = "en_move_001"
	file = "eng/en_move_001.wav"
}
sound =
{
	name = "en_move_002"
	file = "eng/en_move_002.wav"
}
sound =
{
	name = "en_move_003"
	file = "eng/en_move_003.wav"
}
sound =
{
	name = "en_move_004"
	file = "eng/en_move_004.wav"
}
sound =
{
	name = "en_move_005"
	file = "eng/en_move_005.wav"
}
sound =
{
	name = "en_move_006"
	file = "eng/en_move_006.wav"
}
sound =
{
	name = "en_move_007"
	file = "eng/en_move_007.wav"
}
sound =
{
	name = "en_move_008"
	file = "eng/en_move_008.wav"
}
# ITALIAN ATTACKING VOICELINES
sound =
{
	name = "en_neutral_001"
	file = "eng/en_neutral_001.wav"
}
sound =
{
	name = "en_neutral_002"
	file = "eng/en_neutral_002.wav"
}
sound =
{
	name = "en_neutral_003"
	file = "eng/en_neutral_003.wav"
}
sound =
{
	name = "en_neutral_004"
	file = "eng/en_neutral_004.wav"
}
sound =
{
	name = "en_neutral_005"
	file = "eng/en_neutral_005.wav"
}
sound =
{
	name = "en_neutral_006"
	file = "eng/en_neutral_006.wav"
}
sound =
{
	name = "en_neutral_007"
	file = "eng/en_neutral_007.wav"
}
sound =
{
	name = "en_neutral_008"
	file = "eng/en_neutral_008.wav"
}
sound =
{
	name = "en_neutral_009"
	file = "eng/en_neutral_009.wav"
}
# BRITISH ATTACKING VOICE LINES POSITIVE
sound =
{
	name = "en_positive_001"
	file = "eng/en_positive_001.wav"
}
sound =
{
	name = "en_positive_002"
	file = "eng/en_positive_002.wav"
}
sound =
{
	name = "en_positive_003"
	file = "eng/en_positive_003.wav"
}
sound =
{
	name = "en_positive_004"
	file = "eng/en_positive_004.wav"
}
sound =
{
	name = "en_positive_005"
	file = "eng/en_positive_005.wav"
}
sound =
{
	name = "en_positive_006"
	file = "eng/en_positive_006.wav"
}
sound =
{
	name = "en_positive_007"
	file = "eng/en_positive_007.wav"
}
sound =
{
	name = "en_positive_008"
	file = "eng/en_positive_008.wav"
}
sound =
{
	name = "en_positive_009"
	file = "eng/en_positive_009.wav"
}
#
sound =
{
	name = "en_retreat_001"
	file = "eng/en_retreat_001.wav"
}
sound =
{
	name = "en_retreat_002"
	file = "eng/en_retreat_002.wav"
}
sound =
{
	name = "en_retreat_003"
	file = "eng/en_retreat_003.wav"
}
sound =
{
	name = "en_retreat_004"
	file = "eng/en_retreat_004.wav"
}
# USA VOICELINES
sound =
{
	name = "us_idle_001"
	file = "usa/us_idle_001.wav"
}
sound =
{
	name = "us_idle_002"
	file = "usa/us_idle_002.wav"
}
sound =
{
	name = "us_idle_003"
	file = "usa/us_idle_003.wav"
}
sound =
{
	name = "us_idle_004"
	file = "usa/us_idle_004.wav"
}
sound =
{
	name = "us_idle_005"
	file = "usa/us_idle_005.wav"
}
sound =
{
	name = "us_idle_006"
	file = "usa/us_idle_006.wav"
}
sound =
{
	name = "us_idle_007"
	file = "usa/us_idle_007.wav"
}
# USA MOVING VOICELINES
sound =
{
	name = "us_move_001"
	file = "usa/us_move_001.wav"
}
sound =
{
	name = "us_move_002"
	file = "usa/us_move_002.wav"
}
sound =
{
	name = "us_move_003"
	file = "usa/us_move_003.wav"
}
sound =
{
	name = "us_move_004"
	file = "usa/us_move_004.wav"
}
sound =
{
	name = "us_move_005"
	file = "usa/us_move_005.wav"
}
sound =
{
	name = "us_move_006"
	file = "usa/us_move_006.wav"
}
sound =
{
	name = "us_move_007"
	file = "usa/us_move_007.wav"
}
sound =
{
	name = "us_move_008"
	file = "usa/us_move_008.wav"
}
# USA ATTACKING VOICELINES (NEUTRAL)
sound =
{
	name = "us_neutral_001"
	file = "usa/us_neutral_001.wav"
}
sound =
{
	name = "us_neutral_002"
	file = "usa/us_neutral_002.wav"
}
sound =
{
	name = "us_neutral_003"
	file = "usa/us_neutral_003.wav"
}
sound =
{
	name = "us_neutral_004"
	file = "usa/us_neutral_004.wav"
}
sound =
{
	name = "us_neutral_005"
	file = "usa/us_neutral_005.wav"
}
sound =
{
	name = "us_neutral_006"
	file = "usa/us_neutral_006.wav"
}
sound =
{
	name = "us_neutral_007"
	file = "usa/us_neutral_007.wav"
}
# USA ATTACKING VOICELINES (POSITIVE)
sound =
{
	name = "us_positive_001"
	file = "usa/us_positive_001.wav"
}
sound =
{
	name = "us_positive_002"
	file = "usa/us_positive_002.wav"
}
sound =
{
	name = "us_positive_003"
	file = "usa/us_positive_003.wav"
}
sound =
{
	name = "us_positive_004"
	file = "usa/us_positive_004.wav"
}
sound =
{
	name = "us_positive_005"
	file = "usa/us_positive_005.wav"
}
sound =
{
	name = "us_positive_006"
	file = "usa/us_positive_006.wav"
}
sound =
{
	name = "us_positive_007"
	file = "usa/us_positive_007.wav"
}
# USA RETREATING VOICELINES
sound =
{
	name = "us_retreat_001"
	file = "usa/us_retreat_001.wav"
}
sound =
{
	name = "us_retreat_002"
	file = "usa/us_retreat_002.wav"
}
sound =
{
	name = "us_retreat_003"
	file = "usa/us_retreat_003.wav"
}
sound =
{
	name = "us_retreat_004"
	file = "usa/us_retreat_004.wav"
}
###
###
###
sound =
{
	name = "ge_idle_001"
	file = "ger/ge_idle_001.wav"
}
sound =
{
	name = "ge_idle_002"
	file = "ger/ge_idle_002.wav"
}
sound =
{
	name = "ge_idle_003"
	file = "ger/ge_idle_003.wav"
}
sound =
{
	name = "ge_idle_004"
	file = "ger/ge_idle_004.wav"
}
sound =
{
	name = "ge_idle_005"
	file = "ger/ge_idle_005.wav"
}
sound =
{
	name = "ge_idle_006"
	file = "ger/ge_idle_006.wav"
}
sound =
{
	name = "ge_idle_007"
	file = "ger/ge_idle_007.wav"
}
sound =
{
	name = "ge_idle_008"
	file = "ger/ge_idle_008.wav"
}
# GERMAN MOVING VOICELINES
sound =
{
	name = "ge_move_001"
	file = "ger/ge_move_001.wav"
}
sound =
{
	name = "ge_move_002"
	file = "ger/ge_move_002.wav"
}
sound =
{
	name = "ge_move_003"
	file = "ger/ge_move_003.wav"
}
sound =
{
	name = "ge_move_004"
	file = "ger/ge_move_004.wav"
}
sound =
{
	name = "ge_move_005"
	file = "ger/ge_move_005.wav"
}
sound =
{
	name = "ge_move_006"
	file = "ger/ge_move_006.wav"
}
sound =
{
	name = "ge_move_007"
	file = "ger/ge_move_007.wav"
}
sound =
{
	name = "ge_move_008"
	file = "ger/ge_move_008.wav"
}
# GERMAN ATTACKING VOICELINES (NEUTRAL)
sound =
{
	name = "ge_neutral_001"
	file = "ger/ge_neutral_001.wav"
}
sound =
{
	name = "ge_neutral_002"
	file = "ger/ge_neutral_002.wav"
}
sound =
{
	name = "ge_neutral_003"
	file = "ger/ge_neutral_003.wav"
}
sound =
{
	name = "ge_neutral_004"
	file = "ger/ge_neutral_004.wav"
}
sound =
{
	name = "ge_neutral_005"
	file = "ger/ge_neutral_005.wav"
}
sound =
{
	name = "ge_neutral_006"
	file = "ger/ge_neutral_006.wav"
}
sound =
{
	name = "ge_neutral_007"
	file = "ger/ge_neutral_007.wav"
}
sound =
{
	name = "ge_neutral_008"
	file = "ger/ge_neutral_008.wav"
}
# GERMAN ATTACKING VOICELINES (POSITIVE)
sound =
{
	name = "ge_positive_001"
	file = "ger/ge_positive_001.wav"
}
sound =
{
	name = "ge_positive_002"
	file = "ger/ge_positive_002.wav"
}
sound =
{
	name = "ge_positive_003"
	file = "ger/ge_positive_003.wav"
}
sound =
{
	name = "ge_positive_004"
	file = "ger/ge_positive_004.wav"
}
sound =
{
	name = "ge_positive_005"
	file = "ger/ge_positive_005.wav"
}
sound =
{
	name = "ge_positive_006"
	file = "ger/ge_positive_006.wav"
}
sound =
{
	name = "ge_positive_007"
	file = "ger/ge_positive_007.wav"
}
sound =
{
	name = "ge_positive_008"
	file = "ger/ge_positive_008.wav"
}
# GERMAN RETREATING VOICELINES
sound =
{
	name = "ge_retreat_001"
	file = "ger/ge_retreat_001.wav"
}
sound =
{
	name = "ge_retreat_002"
	file = "ger/ge_retreat_002.wav"
}
sound =
{
	name = "ge_retreat_003"
	file = "ger/ge_retreat_003.wav"
}
sound =
{
	name = "ge_retreat_004"
	file = "ger/ge_retreat_004.wav"
}
# # # Chinese voicelines
sound =
{
	name = "ch_idle_001"
	file = "chi/ch_idle_001.wav"
}
sound =
{
	name = "ch_idle_002"
	file = "chi/ch_idle_002.wav"
}
sound =
{
	name = "ch_idle_003"
	file = "chi/ch_idle_003.wav"
}
sound =
{
	name = "ch_idle_004"
	file = "chi/ch_idle_004.wav"
}
sound =
{
	name = "ch_idle_005"
	file = "chi/ch_idle_005.wav"
}
sound =
{
	name = "ch_idle_006"
	file = "chi/ch_idle_006.wav"
}
sound =
{
	name = "ch_idle_007"
	file = "chi/ch_idle_007.wav"
}
sound =
{
	name = "ch_idle_008"
	file = "chi/ch_idle_008.wav"
}
# # #
sound =
{
	name = "ch_move_001"
	file = "chi/ch_move_001.wav"
}
sound =
{
	name = "ch_move_002"
	file = "chi/ch_move_002.wav"
}
sound =
{
	name = "ch_move_003"
	file = "chi/ch_move_003.wav"
}
sound =
{
	name = "ch_move_004"
	file = "chi/ch_move_004.wav"
}
sound =
{
	name = "ch_move_005"
	file = "chi/ch_move_005.wav"
}
sound =
{
	name = "ch_move_006"
	file = "chi/ch_move_006.wav"
}
sound =
{
	name = "ch_move_007"
	file = "chi/ch_move_007.wav"
}
sound =
{
	name = "ch_move_008"
	file = "chi/ch_move_008.wav"
}
# # #
sound =
{
	name = "ch_neutral_001"
	file = "chi/ch_neutral_001.wav"
}
sound =
{
	name = "ch_neutral_002"
	file = "chi/ch_neutral_002.wav"
}
sound =
{
	name = "ch_neutral_003"
	file = "chi/ch_neutral_003.wav"
}
sound =
{
	name = "ch_neutral_004"
	file = "chi/ch_neutral_004.wav"
}
sound =
{
	name = "ch_neutral_005"
	file = "chi/ch_neutral_005.wav"
}
sound =
{
	name = "ch_neutral_006"
	file = "chi/ch_neutral_006.wav"
}
sound =
{
	name = "ch_neutral_007"
	file = "chi/ch_neutral_007.wav"
}
sound =
{
	name = "ch_neutral_008"
	file = "chi/ch_neutral_008.wav"
}
# # #
sound =
{
	name = "ch_positive_001"
	file = "chi/ch_positive_001.wav"
}
sound =
{
	name = "ch_positive_002"
	file = "chi/ch_positive_002.wav"
}
sound =
{
	name = "ch_positive_003"
	file = "chi/ch_positive_003.wav"
}
sound =
{
	name = "ch_positive_004"
	file = "chi/ch_positive_004.wav"
}
sound =
{
	name = "ch_positive_005"
	file = "chi/ch_positive_005.wav"
}
sound =
{
	name = "ch_positive_006"
	file = "chi/ch_positive_006.wav"
}
sound =
{
	name = "ch_positive_007"
	file = "chi/ch_positive_007.wav"
}
sound =
{
	name = "ch_positive_008"
	file = "chi/ch_positive_008.wav"
}
# # #
sound =
{
	name = "ch_retreat_001"
	file = "chi/ch_retreat_001.wav"
}
sound =
{
	name = "ch_retreat_002"
	file = "chi/ch_retreat_002.wav"
}
sound =
{
	name = "ch_retreat_003"
	file = "chi/ch_retreat_003.wav"
}
sound =
{
	name = "ch_retreat_004"
	file = "chi/ch_retreat_004.wav"
}
#Lebanese/Hezbollah
sound =
{
        name = "hz_neutral_001"
        file = "leb/hz_neutral_001.wav"
}
sound =
{
        name = "hz_positive_001"
        file = "leb/hz_positive_001.wav"
}

sound =
{
	name = "lb_idle_001"
	file = "leb/lb_idle_001.wav"
}
sound =
{
        name = "lb_idle_002"
        file = "leb/lb_idle_002.wav"
}
sound =
{
        name = "lb_idle_003"
        file = "leb/lb_idle_003.wav"
}
sound =
{
        name = "lb_idle_004"
        file = "leb/lb_idle_004.wav"
}
sound =
{
        name = "lb_idle_005"
        file = "leb/lb_idle_005.wav"
}

sound =
{
        name = "lb_idle_006"
        file = "leb/lb_idle_006.wav"
}

sound =
{
        name = "lb_idle_007"
        file = "leb/lb_idle_007.wav"
}

sound =
{
        name = "lb_idle_008"
        file = "leb/lb_idle_008.wav"
}

sound =
{
        name = "lb_move_001"
        file = "leb/lb_move_001.wav"
}

sound =
{
        name = "lb_move_002"
        file = "leb/lb_move_002.wav"
}

sound =
{
        name = "lb_move_003"
        file = "leb/lb_move_003.wav"
}

sound =
{
        name = "lb_move_004"
        file = "leb/lb_move_004.wav"
}

sound =
{
        name = "lb_move_005"
        file = "leb/lb_move_005.wav"
}

sound =
{
        name = "lb_move_006"
        file = "leb/lb_move_006.wav"
}

sound =
{
        name = "lb_move_007"
        file = "leb/lb_move_007.wav"
}

sound =
{
        name = "lb_move_008"
        file = "leb/lb_move_008.wav"
}

sound =
{
        name = "lb_move_009"
        file = "leb/lb_move_009.wav"
}

sound =
{
        name = "lb_move_010"
        file = "leb/lb_move_010.wav"
}

sound =
{
        name = "lb_move_011"
        file = "leb/lb_move_011.wav"
}

sound =
{
        name = "lb_neutral_001"
        file = "leb/lb_neutral_001.wav"
}

sound =
{
        name = "lb_neutral_002"
        file = "leb/lb_neutral_002.wav"
}

sound =
{
        name = "lb_neutral_003"
        file = "leb/lb_neutral_003.wav"
}

sound =
{
        name = "lb_neutral_004"
        file = "leb/lb_neutral_004.wav"
}

sound =
{
        name = "lb_neutral_005"
        file = "leb/lb_neutral_005.wav"
}

sound =
{
        name = "lb_neutral_006"
        file = "leb/lb_neutral_006.wav"
}

sound =
{
        name = "lb_neutral_007"
        file = "leb/lb_neutral_007.wav"
}

sound =
{
        name = "lb_neutral_008"
        file = "leb/lb_neutral_008.wav"
}

sound =
{
        name = "lb_neutral_009"
        file = "leb/lb_neutral_009.wav"
}

sound =
{
        name = "lb_neutral_010"
        file = "leb/lb_neutral_010.wav"
}

sound =
{
        name = "lb_positive_001"
        file = "leb/lb_positive_001.wav"
}

sound =
{
        name = "lb_positive_002"
        file = "leb/lb_positive_002.wav"
}

sound =
{
        name = "lb_positive_003"
        file = "leb/lb_positive_003.wav"
}

sound =
{
        name = "lb_positive_004"
        file = "leb/lb_positive_004.wav"
}

sound =
{
        name = "lb_positive_005"
        file = "leb/lb_positive_005.wav"
}

sound =
{
        name = "lb_positive_006"
        file = "leb/lb_positive_006.wav"
}

sound =
{
        name = "lb_positive_007"
        file = "leb/lb_positive_007.wav"
}

sound =
{
        name = "lb_positive_008"
        file = "leb/lb_positive_008.wav"
}

sound =
{
        name = "lb_retreat_001"
        file = "leb/lb_retreat_001.wav"
}

sound =
{
        name = "lb_retreat_002"
        file = "leb/lb_retreat_002.wav"
}

sound =
{
        name = "lb_retreat_003"
        file = "leb/lb_retreat_003.wav"
}

sound =
{
        name = "lb_retreat_004"
        file = "leb/lb_retreat_004.wav"
}
# Indian voicelines
sound =
{
	name = "ir_idle_001"
	file = "irq/ir_idle_001.wav"
}
sound =
{
	name = "ir_idle_002"
	file = "irq/ir_idle_002.wav"
}
sound =
{
	name = "ir_idle_003"
	file = "irq/ir_idle_003.wav"
}
sound =
{
	name = "ir_idle_004"
	file = "irq/ir_idle_004.wav"
}
sound =
{
	name = "ir_idle_005"
	file = "irq/ir_idle_005.wav"
}
sound =
{
	name = "ir_idle_006"
	file = "irq/ir_idle_006.wav"
}
sound =
{
	name = "ir_idle_007"
	file = "irq/ir_idle_007.wav"
}
sound =
{
	name = "ir_idle_008"
	file = "irq/ir_idle_008.wav"
}
# # #
sound =
{
	name = "ir_move_001"
	file = "irq/ir_move_001.wav"
}
sound =
{
	name = "ir_move_002"
	file = "irq/ir_move_002.wav"
}
sound =
{
	name = "ir_move_003"
	file = "irq/ir_move_003.wav"
}
sound =
{
	name = "ir_move_004"
	file = "irq/ir_move_004.wav"
}
sound =
{
	name = "ir_move_005"
	file = "irq/ir_move_005.wav"
}
sound =
{
	name = "ir_move_006"
	file = "irq/ir_move_006.wav"
}
sound =
{
	name = "ir_move_007"
	file = "irq/ir_move_007.wav"
}
sound =
{
	name = "ir_move_008"
	file = "irq/ir_move_008.wav"
}
# # #
sound =
{
	name = "ir_neutral_001"
	file = "irq/ir_neutral_001.wav"
}
sound =
{
	name = "ir_neutral_002"
	file = "irq/ir_neutral_002.wav"
}
sound =
{
	name = "ir_neutral_003"
	file = "irq/ir_neutral_003.wav"
}
sound =
{
	name = "ir_neutral_004"
	file = "irq/ir_neutral_004.wav"
}
sound =
{
	name = "ir_neutral_005"
	file = "irq/ir_neutral_005.wav"
}
sound =
{
	name = "ir_neutral_006"
	file = "irq/ir_neutral_006.wav"
}
sound =
{
	name = "ir_neutral_007"
	file = "irq/ir_neutral_007.wav"
}
sound =
{
	name = "ir_neutral_008"
	file = "irq/ir_neutral_008.wav"
}
# # #
sound =
{
	name = "ir_positive_001"
	file = "irq/ir_positive_001.wav"
}
sound =
{
	name = "ir_positive_002"
	file = "irq/ir_positive_002.wav"
}
sound =
{
	name = "ir_positive_003"
	file = "irq/ir_positive_003.wav"
}
sound =
{
	name = "ir_positive_004"
	file = "irq/ir_positive_004.wav"
}
sound =
{
	name = "ir_positive_005"
	file = "irq/ir_positive_005.wav"
}
sound =
{
	name = "ir_positive_006"
	file = "irq/ir_positive_006.wav"
}
sound =
{
	name = "ir_positive_007"
	file = "irq/ir_positive_007.wav"
}
sound =
{
	name = "ir_positive_008"
	file = "irq/ir_positive_008.wav"
}
# # #
sound =
{
	name = "ir_retreat_001"
	file = "irq/ir_retreat_001.wav"
}
sound =
{
	name = "ir_retreat_002"
	file = "irq/ir_retreat_002.wav"
}
sound =
{
	name = "ir_retreat_003"
	file = "irq/ir_retreat_003.wav"
}
sound =
{
	name = "ir_retreat_004"
	file = "irq/ir_retreat_004.wav"
}
#
# Indian voicelines
sound =
{
	name = "ra_idle_001"
	file = "raj/ra_idle_001.wav"
}
sound =
{
	name = "ra_idle_002"
	file = "raj/ra_idle_002.wav"
}
sound =
{
	name = "ra_idle_003"
	file = "raj/ra_idle_003.wav"
}
sound =
{
	name = "ra_idle_004"
	file = "raj/ra_idle_004.wav"
}
sound =
{
	name = "ra_idle_005"
	file = "raj/ra_idle_005.wav"
}
sound =
{
	name = "ra_idle_006"
	file = "raj/ra_idle_006.wav"
}
sound =
{
	name = "ra_idle_007"
	file = "raj/ra_idle_007.wav"
}
sound =
{
	name = "ra_idle_008"
	file = "raj/ra_idle_008.wav"
}
# # #
sound =
{
	name = "ra_move_001"
	file = "raj/ra_move_001.wav"
}
sound =
{
	name = "ra_move_002"
	file = "raj/ra_move_002.wav"
}
sound =
{
	name = "ra_move_003"
	file = "raj/ra_move_003.wav"
}
sound =
{
	name = "ra_move_004"
	file = "raj/ra_move_004.wav"
}
sound =
{
	name = "ra_move_005"
	file = "raj/ra_move_005.wav"
}
sound =
{
	name = "ra_move_006"
	file = "raj/ra_move_006.wav"
}
sound =
{
	name = "ra_move_007"
	file = "raj/ra_move_007.wav"
}
sound =
{
	name = "ra_move_008"
	file = "raj/ra_move_008.wav"
}
# # #
sound =
{
	name = "ra_neutral_001"
	file = "raj/ra_neutral_001.wav"
}
sound =
{
	name = "ra_neutral_002"
	file = "raj/ra_neutral_002.wav"
}
sound =
{
	name = "ra_neutral_003"
	file = "raj/ra_neutral_003.wav"
}
sound =
{
	name = "ra_neutral_004"
	file = "raj/ra_neutral_004.wav"
}
sound =
{
	name = "ra_neutral_005"
	file = "raj/ra_neutral_005.wav"
}
sound =
{
	name = "ra_neutral_006"
	file = "raj/ra_neutral_006.wav"
}
sound =
{
	name = "ra_neutral_007"
	file = "raj/ra_neutral_007.wav"
}
sound =
{
	name = "ra_neutral_008"
	file = "raj/ra_neutral_008.wav"
}
# # #
sound =
{
	name = "ra_positive_001"
	file = "raj/ra_positive_001.wav"
}
sound =
{
	name = "ra_positive_002"
	file = "raj/ra_positive_002.wav"
}
sound =
{
	name = "ra_positive_003"
	file = "raj/ra_positive_003.wav"
}
sound =
{
	name = "ra_positive_004"
	file = "raj/ra_positive_004.wav"
}
sound =
{
	name = "ra_positive_005"
	file = "raj/ra_positive_005.wav"
}
sound =
{
	name = "ra_positive_006"
	file = "raj/ra_positive_006.wav"
}
sound =
{
	name = "ra_positive_007"
	file = "raj/ra_positive_007.wav"
}
sound =
{
	name = "ra_positive_008"
	file = "raj/ra_positive_008.wav"
}
# # #
sound =
{
	name = "ra_retreat_001"
	file = "raj/ra_retreat_001.wav"
}
sound =
{
	name = "ra_retreat_002"
	file = "raj/ra_retreat_002.wav"
}
sound =
{
	name = "ra_retreat_003"
	file = "raj/ra_retreat_003.wav"
}
sound =
{
	name = "ra_retreat_004"
	file = "raj/ra_retreat_004.wav"
}