﻿division_template = {
	name = "Infantry Brigade"

	regiments = {
		Mot_Inf_Bat = { x = 0 y = 0 }
		Mot_Inf_Bat = { x = 0 y = 1 }
		Mot_Inf_Bat = { x = 1 y = 0 }
		Mot_Inf_Bat = { x = 1 y = 1 }
		Arty_Bat = { x = 1 y = 2 }
		Mech_Inf_Bat = { x = 2 y = 0 }
		L_arm_Bat = { x = 2 y = 1 }
	}
	support = {
		L_Engi_Comp = { x = 0 y = 0 }
	}
}

units = {
	
	#Irish Defence Forces
	#https://en.wikipedia.org/wiki/Irish_Army
	
	#1st Brigade
	division = {	
		name = "1st Brigade"
		location = 7394
		division_template = "Infantry Brigade"
		start_experience_factor = 0.75
		start_equipment_factor = 0.01
	}
	#1st Brigade
	division = {	
		name = "2nd Brigade"
		location = 11293
		division_template = "Infantry Brigade"
		start_experience_factor = 0.75
		start_equipment_factor = 0.01
	}
}

instant_effect = {
	
	add_equipment_to_stockpile = {
		type = infantry_weapons1 #Steyr AUG
		amount = 1800
		producer = AUS
	}
	add_equipment_to_stockpile = {
		type = command_control_equipment
		amount = 228
		producer = GER
	}
	add_equipment_to_stockpile = {
		type = APC_2		#Piranha
		amount = 80
		producer = SWI
	}
	add_equipment_to_stockpile = {
		type = Rec_tank_1		#Scorpion
		amount = 14
		producer = ENG
	}
	add_equipment_to_stockpile = {
		type = util_vehicle_4		#RG-32
		#version_name = "RG-32 Scout"
		amount = 27
		producer = SAF
	}
	add_equipment_to_stockpile = {
		type = util_vehicle_0		#Swedish trucks
		amount = 250
		producer = SWE
	}
	add_equipment_to_stockpile = {
		type = util_vehicle_0		#German trucks
		amount = 250
		producer = GER
	}
	add_equipment_to_stockpile = {
		type = artillery_1		#L119
		amount = 24
		producer = ENG
	}
	add_equipment_to_stockpile = {
		type = Anti_tank_2
		amount = 102
		producer = USA
	}
	add_equipment_to_stockpile = {
		type = Heavy_Anti_tank_2 #Javelin
		amount = 70
		producer = USA
	}
	add_equipment_to_stockpile = {
		type = Anti_Air_1
		amount = 84
		producer = SWE
	}
	
}



