state = {
	id = 48
	name = "STATE_48"
	manpower = 3313985

	state_category = state_04

	resources = {
		oil = 22
		steel = 35
	}

	history = {
		owner = HOL
		victory_points = { 11456 3 } #Nijmegen
		victory_points = { 6286 3 } #Zwolle
		victory_points = { 9363 2 } #Arnheim	
		victory_points = { 9403 1 } #Enschede
		add_core_of = HOL
		buildings = {
			infrastructure = 3
			internet_station = 2
			arms_factory = 1
			synthetic_refinery = 2
			offices = 2
		}
		add_dynamic_modifier = { modifier = renewable_capacity_factor_dyn_mod }
		set_variable = { state_renewable_capacity_factor_modifier_var = 0.35 }
	}

	provinces = {
		6241 6286 8622 9363 9403 11456 14630 14946
	}
}
