### Environmental Imperialism
EU_environmental_imperialism_category = {
	EU_POTEF_environmental_imperialism_decision = {
		cost = 100
		target_trigger = {
			FROM = {
				NOT = { has_country_flag = EU_POTEF_environmental_imperialism_target }
				NOT = { has_idea = USoE_environmental_sanctions }
				OR = {
					has_idea = regional_power
					has_idea = large_power
					has_idea = great_power
					has_idea = superpower
				}
				synthetic_refinery < num_owned_states
				OR = {
					AND = {
						ROOT = {
							has_country_flag = environmental_imperialism_europe
						}
						capital_scope = {
							is_on_continent = europe
						}
					}
					AND = {
						ROOT = {
							has_country_flag = environmental_imperialism_north_america
						}
						capital_scope = {
							is_on_continent = north_america
						}
					}
					AND = {
						ROOT = {
							has_country_flag = environmental_imperialism_south_america
						}
						capital_scope = {
							is_on_continent = south_america
						}
					}
					AND = {
						ROOT = {
							has_country_flag = environmental_imperialism_africa
						}
						capital_scope = {
							is_on_continent = africa
						}
					}
					AND = {
						ROOT = {
							has_country_flag = environmental_imperialism_asia
						}
						capital_scope = {
							is_on_continent = asia
						}
					}
					AND = {
						ROOT = {
							has_country_flag = environmental_imperialism_middle_east
						}
						capital_scope = {
							is_on_continent = middle_east
						}
					}
					AND = {
						ROOT = {
							has_country_flag = environmental_imperialism_pacific
						}
						capital_scope = {
							is_on_continent = pacific
						}
					}
					AND = {
						ROOT = {
							has_country_flag = environmental_imperialism_oceania
						}
						capital_scope = {
							is_on_continent = australia
						}
					}
				}
			}
		}
		available = {
			has_country_flag = environmental_imperialism
		}

		visible = {
			has_country_flag = environmental_imperialism
			has_idea = EU_president
			FROM = {
				NOT = { has_country_flag = EU_POTEF_environmental_imperialism_target }
			}
			FROM = {
				NOT = { has_idea = USoE_environmental_sanctions }
			}
			FROM = {
				NOT = { has_country_flag = fossil_energy_pact }
			}
			FROM = {
				NOT = { has_country_flag = break_environmental_sanctions }
			}
		}

		complete_effect = {
			FROM = {
				activate_mission = EU_POTEF_environmental_imperialism_mission
				set_country_flag = EU_POTEF_environmental_imperialism_target
				custom_effect_tooltip = "If they don't complete the mission they get:"
				show_ideas_tooltip = USoE_environmental_sanctions
			}
		}
		ai_will_do = {
			factor = 1
		}
	}

	EU_POTEF_environmental_imperialism_mission = {
		allowed = {
			always = yes
		}
		available = {
			#synthetic_refinery > num_owned_states
			set_temp_variable = { a = num_owned_states }
			subtract_from_temp_variable = { a = 1 }
			synthetic_refinery > a
		}
		activation = {
			always = no
		}

		days_mission_timeout = 30
		is_good = no
		selectable_mission = yes

		fire_only_once = yes

		complete_effect = {
			set_temp_variable = { party_index = 17 }
			set_temp_variable = { party_popularity_increase = 0.05 }
			set_temp_variable = { temp_outlook_increase = 0.05 }
			add_relative_party_popularity = yes
			#custom_effect_tooltip = tooltip_EU_USoE_environmental_puppet
			#set_country_flag = EU_USoE_environmental_puppet
			every_country = {
				limit = {
					has_idea = EU_president
				}
				country_event = {
					id = USoEevent.5
				}
			}
			clr_country_flag = EU_POTEF_environmental_imperialism_target
		}
		timeout_effect = {
			add_ideas = USoE_environmental_sanctions
			#show_ideas_tooltip = USoE_environmental_sanctions
			clr_country_flag = EU_POTEF_environmental_imperialism_target
			every_country = {
				limit = {
					has_idea = EU_president
				}
				country_event = {
					id = USoEevent.6
				}
			}
		}
		ai_will_do = {
			factor = 1
		}
	}

	#Green Energy Reconstruction
	EU_POTEF_environmental_imperialism_restructure_industry_decision = {
		cost = 100
		available = {
			has_country_flag = EU_POTEF_environmental_imperialism_target
		}

		visible = {
			has_country_flag = EU_POTEF_environmental_imperialism_target
			any_owned_state = {
				synthetic_refinery < 2
				industrial_complex > 0
			}
		}
		complete_effect = {
			set_temp_variable = { temp1 = 0 }
			every_owned_state = {
				limit = {
					synthetic_refinery < 2
					industrial_complex > 0
				}
				remove_building = {
					type = industrial_complex
					level = 1
				}
				add_building_construction = {
					type = synthetic_refinery
					level = 1
					instant_build = yes
				}
				add_to_temp_variable = { temp1 = 1 }
			}
			subtract_from_variable = { treasury = temp1 }
			custom_effect_tooltip = tooltip_green_energy_reconstruction
			for_loop_effect = {
				end = temp1
				if = {
					limit = {
						check_variable = { party_pop_array^17 < 0.50 }
					}
					set_temp_variable = { party_index = 17 }
					set_temp_variable = { party_popularity_increase = 0.05 }
					set_temp_variable = { temp_outlook_increase = 0.05 }
					add_relative_party_popularity = yes
				}
			}
		}
		ai_will_do = {
			factor = 1
		}
	}

	EU_POTEF_break_environmental_sanctions_decision = {
		target_trigger = {
			FROM = {
				has_idea = EU_president
			}
		}
		cost = 100
		available = {
			has_idea = USoE_environmental_sanctions
		}

		visible = {
			has_idea = USoE_environmental_sanctions
		}
		complete_effect = {
			remove_ideas = USoE_environmental_sanctions
			set_country_flag = break_environmental_sanctions
			FROM = {
				add_opinion_modifier = {
					target = ROOT
					modifier = betrayed_our_cause
				}
				reverse_add_opinion_modifier = {
					target = ROOT
					modifier = betrayed_our_cause
				}
			}
			FROM = {
				create_wargoal = {
					type = topple_government
					target = ROOT
				}
			}
			FROM = {
				country_event = {
					id = USoEevent.7
				}
			}
			if = {
				limit = {
					NOT = { has_global_flag = fossil_energy_pact }
					NOT = {	is_in_faction = yes }
				}
				create_faction = Fossil_Energy_Pact_faction
				set_global_flag = fossil_energy_pact
				set_country_flag = fossil_energy_pact
			}
			else_if = {
				limit = {
					has_global_flag = fossil_energy_pact
					NOT = {	is_in_faction = yes }
				}
				random_country = {
					limit = {
						has_country_flag = fossil_energy_pact
						is_faction_leader = yes
					}
					THIS = { add_to_faction = ROOT }
				}
				set_country_flag = fossil_energy_pact
			}
		}
		ai_will_do = {
			factor = 0
			modifier = {
				add = 1
				strength_ratio = {
					tag = FROM
					ratio > 0.7
				}
			}
			modifier = {
				add = 1
				any_country = {
					if = {
						limit = {
							has_country_flag = fossil_energy_pact
							is_faction_leader = yes
						}
						strength_ratio = {
							tag = FROM
							ratio > 0.5
						}
					}
				}
				strength_ratio = {
					tag = FROM
					ratio > 0.1
				}
			}
			modifier = {
				add = 1
				any_country = {
					if = {
						limit = {
							has_country_flag = fossil_energy_pact
							is_faction_leader = yes
						}
						strength_ratio = {
							tag = FROM
							ratio > 0.7
						}
					}
				}
			}
			modifier = {
				add = 1
				ic_ratio = {
					tag = FROM
					ratio > 0.6
				}
			}
		}
	}
}

#######################
### POTEF elections ###
#######################

EU_office_category = {

	EU_POTEF_call_election = {
		available = {
			NOT = {
				any_of = {
					array = global.EU_member
					value = v
					var:v = {
						has_idea = EU_president
					}
				}
				has_global_flag = ongoing_potef_election
			}
		}

		visible = { has_global_flag = european_federation }

		complete_effect = {
			activate_mission = EU_POTEF_election_campaign
			election_POTEF_in_member_state = yes
			set_global_flag = ongoing_potef_election
		}
	}

	EU_POTEF_election_campaign = {
		allowed = { always = no }
		available = { tag = EUU }
		activation = { always = no }

		visible = { has_global_flag = european_federation }

		days_mission_timeout = 90 # 90 # for testing 14

		selectable_mission = yes

		fire_only_once = yes

		timeout_effect = {
			log = "[GetDateText]: [Root.GetName]: mission EU_POTEF_election_campaign"
			POTEF_election = yes
			set_POTEF_elect = yes
		}
	}

	EU_POTEF_term = {
		allowed = { always = no }
		available = { tag = EUU }
		activation = { always = no }

		visible = {
			has_global_flag = european_federation
			has_idea = EU_president
		}

		days_mission_timeout = POTEF_time_to_camp

		selectable_mission = yes

		fire_only_once = yes

		timeout_effect = {
			log = "[GetDateText]: [Root.GetName]: mission EU_POTEF_term"
			activate_mission = EU_POTEF_election_campaign
		}
	}


	EU_POTEF_nominee = {

		available = {
			custom_trigger_tooltip = {
				tooltip = tooltip_EU_POTEF_nominee_trigger
				any_of = {
					array = ruling_party
					value = v
					index = i
					if = {
						limit = {
							is_in_array = { ruling_party = v }
						}
						set_temp_variable = { temp_idx = v }
					}
				}
				OR = {
					all_of_scopes = {
						array = global.EU_member
						if = {
							limit = {
								is_in_array = { ruling_party = temp_idx }
								NOT = { tag = ROOT }
							}
							is_top3_influencer = yes
						}
					}
					### AI cheat
					AND = {
						all_of_scopes = {
							array = global.EU_member
							if = {
								limit = {
									is_in_array = { ruling_party = temp_idx }
								}
								is_ai = yes
							}
						}
						any_of_scopes = {
							array = global.EU_member
							if = {
								limit = {
									is_in_array = { ruling_party = temp_idx }
								}
								check_variable = { THIS.var_EUpopRatio > 0.05 }
							}
						}
						check_variable = { THIS.var_EUpopRatio > 0.05 }
					}
					### AI cheat
					AND = {
						all_of_scopes = {
							array = global.EU_member
							if = {
								limit = {
									is_in_array = { ruling_party = temp_idx }
								}
								is_ai = yes
								check_variable = { THIS.var_EUpopRatio < 0.05 }
							}
						}
					}
				}
			}
			custom_trigger_tooltip = {
				tooltip = tooltip_EU_POTEF_nominee_trigger_2
				all_country = {
					if = {
						limit = {
							has_idea = EU_member
							is_in_array = { ruling_party = temp_idx }
						}
						meta_trigger = {
							text = {
								NOT = { has_country_flag = POTEF_nominee_[subideology] }
							}
							subideology = "[?temp_idx|0]"
						}
					}
				}
			}
		}

		visible = {
			has_global_flag = european_federation
			has_idea = EU_member
			any_country = {
				has_active_mission = EU_POTEF_election_campaign
			}
			NOT = {
				OR = {
					has_country_flag = POTEF_nominee_0
					has_country_flag = POTEF_nominee_1
					has_country_flag = POTEF_nominee_2
					has_country_flag = POTEF_nominee_3
					has_country_flag = POTEF_nominee_4
					has_country_flag = POTEF_nominee_5
					has_country_flag = POTEF_nominee_6
					has_country_flag = POTEF_nominee_7
					has_country_flag = POTEF_nominee_8
					has_country_flag = POTEF_nominee_9
					has_country_flag = POTEF_nominee_10
					has_country_flag = POTEF_nominee_11
					has_country_flag = POTEF_nominee_12
					has_country_flag = POTEF_nominee_13
					has_country_flag = POTEF_nominee_14
					has_country_flag = POTEF_nominee_15
					has_country_flag = POTEF_nominee_16
					has_country_flag = POTEF_nominee_17
					has_country_flag = POTEF_nominee_18
					has_country_flag = POTEF_nominee_19
					has_country_flag = POTEF_nominee_20
					has_country_flag = POTEF_nominee_21
					has_country_flag = POTEF_nominee_22
					has_country_flag = POTEF_nominee_23
				}
			}
		}

		complete_effect = {
			log = "[GetDateText]: [Root.GetName]: decision EU_POTEF_nominee"
			for_each_loop = {
				array = ruling_party
				value = v
				index = i
				if = {
					limit = {
						is_in_array = { ruling_party = v }
					}
					set_variable = { var_gov_index = v }
				}
			}
			meta_effect = {
				text = {
					set_country_flag = POTEF_nominee_[subideology]
					set_variable = { global.var_POTEF_nominee_[subideology] = THIS }
				}
				subideology = "[?var_gov_index|0]"
			}
			every_country = {
				limit = {
					has_idea = EU_member
				}
				news_event = {
					id = EU_POTEF_news.1
				}
			}
		}

		ai_will_do = {
			factor = 1
		}
	}

	EU_POTEF_show_election_polls = {

		available = {

		}

		visible = {
			has_global_flag = european_federation
			NOT = { has_country_flag = POTEF_polls }
		}

		complete_effect = {
			log = "[GetDateText]: [Root.GetName]: decision EU_POTEF_show_election_polls"
			set_country_flag = POTEF_polls
		}
	}

	EU_POTEF_hide_election_polls = {

		available = {

		}

		visible = {
			has_global_flag = european_federation
			has_country_flag = POTEF_polls
		}

		complete_effect = {
			log = "[GetDateText]: [Root.GetName]: decision EU_POTEF_show_election_polls"
			clr_country_flag = POTEF_polls
		}
	}

	EU_POTEF_campaign_in_member_state = {
		allowed = {
			is_EU_potential = yes
		}
		target_root_trigger = {
			has_idea = EU_member
			OR = {
				has_country_flag = POTEF_nominee_0
				has_country_flag = POTEF_nominee_1
				has_country_flag = POTEF_nominee_2
				has_country_flag = POTEF_nominee_3
				has_country_flag = POTEF_nominee_4
				has_country_flag = POTEF_nominee_5
				has_country_flag = POTEF_nominee_6
				has_country_flag = POTEF_nominee_7
				has_country_flag = POTEF_nominee_8
				has_country_flag = POTEF_nominee_9
				has_country_flag = POTEF_nominee_10
				has_country_flag = POTEF_nominee_11
				has_country_flag = POTEF_nominee_12
				has_country_flag = POTEF_nominee_13
				has_country_flag = POTEF_nominee_14
				has_country_flag = POTEF_nominee_15
				has_country_flag = POTEF_nominee_16
				has_country_flag = POTEF_nominee_17
				has_country_flag = POTEF_nominee_18
				has_country_flag = POTEF_nominee_19
				has_country_flag = POTEF_nominee_20
				has_country_flag = POTEF_nominee_21
				has_country_flag = POTEF_nominee_22
				has_country_flag = POTEF_nominee_23
			}
		}
		target_trigger = {
			FROM = {
				has_idea = EU_member
			}
		}
		target_array = global.EU_member
		cost = 200
		days_remove = 30

		fixed_random_seed = no

		visible = {
			any_country = {
				has_active_mission = EU_POTEF_election_campaign
			}
		}
		complete_effect = {
			custom_effect_tooltip = tooltip_EU_POTEF_campaign_in_member_state_effect
			hidden_effect = {
				log = "[GetDateText]: [Root.GetName]: decision EU_POTEF_campaign_in_member_state"
				for_each_loop = {
					array = ruling_party
					value = v
					index = i
					if = {
						limit = {
							is_in_array = { ruling_party = v }
						}
						set_variable = { var_gov_index = v }
					}
				}
				random_list = {
					3 = {
						modifier = {
							add = 1
							FROM = {
								is_in_array = { ruling_party = var_gov_index }
							}
						}
						modifier = {
							add = 1
							FROM = {
								influence_higher_5 = yes
							}
						}
						modifier = {
							add = 1
							FROM = {
								influence_higher_10 = yes
							}
						}
						modifier = {
							add = 1
							FROM = {
								influence_higher_20 = yes
							}
						}
						modifier = {
							add = -1
							check_variable = { FROM.eurosceptic > 0.10 }
						}
						modifier = {
							add = -1
							check_variable = { FROM.eurosceptic > 0.20 }
						}
						if = {
							limit = { has_government = democratic }
							FROM = {
								add_popularity = {
									ideology = democratic
									popularity = 0.05
								}
							}
						}
						else_if = {
							limit = { has_government = communism }
							FROM = {
								add_popularity = {
									ideology = communism
									popularity = 0.05
								}
							}
						}
						else_if = {
							limit = { has_government = fascism }
							FROM = {
								add_popularity = {
									ideology = fascism
									popularity = 0.05
								}
							}
						}
						else_if = {
							limit = { has_government = neutrality }
							FROM = {
								add_popularity = {
									ideology = neutrality
									popularity = 0.05
								}
							}
						}
						else_if = {
							limit = { has_government = nationalist }
							FROM = {
								add_popularity = {
									ideology = nationalist
									popularity = 0.05
								}
							}
						}
						add_to_variable = { FROM.party_pop_array^var_gov_index = 0.05 }
						recalculate_party = yes
						every_country = {
							limit = {
								has_idea = EU_member
							}
							news_event = {
								id = EU_POTEF_news.5
							}
						}
					}
					1 = {
						modifier = {
							factor = 0
							FROM = {
								is_in_array = { ruling_party = var_gov_index }
							}
							check_variable = { FROM.eurosceptic < 0.10 }
							FROM = {
								influence_higher_20 = yes
							}
						}
						modifier = {
							add = 5
							FROM = {
								OR = {
									has_country_flag = POTEF_nominee_0
									has_country_flag = POTEF_nominee_1
									has_country_flag = POTEF_nominee_2
									has_country_flag = POTEF_nominee_3
									has_country_flag = POTEF_nominee_4
									has_country_flag = POTEF_nominee_5
									has_country_flag = POTEF_nominee_6
									has_country_flag = POTEF_nominee_7
									has_country_flag = POTEF_nominee_8
									has_country_flag = POTEF_nominee_9
									has_country_flag = POTEF_nominee_10
									has_country_flag = POTEF_nominee_11
									has_country_flag = POTEF_nominee_12
									has_country_flag = POTEF_nominee_13
									has_country_flag = POTEF_nominee_14
									has_country_flag = POTEF_nominee_15
									has_country_flag = POTEF_nominee_16
									has_country_flag = POTEF_nominee_17
									has_country_flag = POTEF_nominee_18
									has_country_flag = POTEF_nominee_19
									has_country_flag = POTEF_nominee_20
									has_country_flag = POTEF_nominee_21
									has_country_flag = POTEF_nominee_22
									has_country_flag = POTEF_nominee_23
								}
							}
						}
						every_country = {
							limit = {
								has_idea = EU_member
							}
							news_event = {
								id = EU_POTEF_news.6
							}
						}
					}
				}
			}
		}
		ai_will_do = {
			factor = 1

		}
	}
}


###########################
###########################
### EU_defense_category ###
###########################
###########################


EU_defense_category = {

	EU_POTEF_call_all_major_non_EU_ally = {

		available = {
			has_defensive_war = yes
		}

		visible = {
			has_global_flag = EDU
			is_faction_leader = yes
		}

		complete_effect = {
			every_country = {
				limit = {
					has_idea = EDU_major_non_EU_ally
				}

				FROM = {
					add_to_faction = PREV
				}
				add_ai_strategy = {
					type = alliance
					id = FROM
					value = 200
				}
			}
		}
	}

	EU_POTEF_call_major_non_EU_ally = {
		allowed = { is_EU_potential = yes }
		target_root_trigger = {
			has_idea = EU_member
			has_global_flag = EDU
			is_faction_leader = yes
		}
		target_trigger = {
			FROM = {
				has_idea = EDU_major_non_EU_ally
			}
		}
		target_array = global.non_EU_EDU_ally
		cost = 100
		available = {
			is_faction_leader = yes
			FROM = {
				influence_higher_5 = yes
			}
		}
		visible = {
			has_idea = EU_member
			has_global_flag = EDU
		}
		complete_effect = {
			ROOT = {
				add_to_faction = FROM
			}
			add_ai_strategy = {
				type = alliance
				id = ROOT
				value = 200
			}
		}

		ai_will_do = {
			factor = 1
		}
	}
}
