##Written by Bird
SAU_area_priority = {
	allowed = { original_tag = SAU }
	enable = { always = yes }
	abort_when_not_enabled = yes

	ai_strategy = { type = area_priority id = europe value = -50 }
	ai_strategy = { type = area_priority id = north_america value = -25 }
	ai_strategy = { type = area_priority id = caribbean value = -50 }
	ai_strategy = { type = area_priority id = south_america value = -50 }
	ai_strategy = { type = area_priority id = asia value = -25 }
	ai_strategy = { type = area_priority id = pacific value = -50 }
	ai_strategy = { type = area_priority id = oceania value = -50 }
	ai_strategy = { type = area_priority id = middle_east value = 200 }
	ai_strategy = { type = area_priority id = africa value = 50 }
}

SAU_rival_iran = {
	allowed = { original_tag = SAU }
	enable = {
		country_exists = PER
		NOT = { is_in_faction_with = PER }
	}
	abort_when_not_enabled = yes

	ai_strategy = { type = befriend id = "PER" value = -100 }
	ai_strategy = { type = conquer id = "PER" value = 50 }
	ai_strategy = { type = invade id = "PER" value = 50 }
	ai_strategy = { type = protect id = "PER" value = -100 }
	ai_strategy = { type = antagonize id = "PER" value = 200 }
	ai_strategy = { type = alliance id = "PER" value = -200 }
	ai_strategy = { type = support id = "PER" value = -200 }
	ai_strategy = { type = contain id = "PER" value = 200 }
	ai_strategy = { type = consider_weak id = "PER" value = 200 }
	ai_strategy = { type = befriend id = "HEZ" value = -100 }
	ai_strategy = { type = conquer id = "HEZ" value = 25 }
	ai_strategy = { type = invade id = "HEZ" value = 25 }
	ai_strategy = { type = protect id = "HEZ" value = -100 }
	ai_strategy = { type = antagonize id = "HEZ" value = 100 }
	ai_strategy = { type = alliance id = "HEZ" value = -200 }
	ai_strategy = { type = support id = "HEZ" value = -100 }
	ai_strategy = { type = contain id = "HEZ" value = 100 }
}

SAU_support_HOR = {
	allowed = { original_tag = SAU }
	enable = { country_exists = HOR }
	abort_when_not_enabled = yes

	ai_strategy = { type = befriend id = "HOR" value = 50 }
	ai_strategy = { type = protect id = "HOR" value = 50 }
	ai_strategy = { type = influence id = "HOR" value = 50 }
	ai_strategy = { type = support id = "HOR" value = 50 }
}

SAU_support_YEM = {
	allowed = { original_tag = SAU }
	enable = { YEM = { has_war_with = HOU } }
	abort_when_not_enabled = yes

	ai_strategy = { type = befriend id = "YEM" value = 20 }
	ai_strategy = { type = protect id = "YEM" value = 20 }
	ai_strategy = { type = influence id = "YEM" value = 20 }
	ai_strategy = { type = support id = "YEM" value = 20 }
	ai_strategy = { type = send_volunteers_desire id = "YEM" value = 200 }
	ai_strategy = { type = befriend id = "HOU" value = -100 }
	ai_strategy = { type = conquer id = "HOU" value = 50 }
	ai_strategy = { type = invade id = "HOU" value = 50 }
	ai_strategy = { type = protect id = "HOU" value = -100 }
	ai_strategy = { type = antagonize id = "HOU" value = 100 }
	ai_strategy = { type = alliance id = "HOU" value = -200 }
	ai_strategy = { type = support id = "HOU" value = -100 }
	ai_strategy = { type = contain id = "HOU" value = 100 }
}

SAU_support_ARA = {
	allowed = { original_tag = SAU }
	enable = { ARA = { has_war_with = PER } }
	abort_when_not_enabled = yes

	ai_strategy = { type = send_volunteers_desire id = "ARA" value = 200 }
	ai_strategy = { type = befriend id = "PER" value = -100 }
	ai_strategy = { type = conquer id = "PER" value = 50 }
	ai_strategy = { type = invade id = "PER" value = 50 }
	ai_strategy = { type = protect id = "PER" value = -100 }
	ai_strategy = { type = antagonize id = "PER" value = 100 }
	ai_strategy = { type = alliance id = "PER" value = -200 }
	ai_strategy = { type = support id = "PER" value = -100 }
	ai_strategy = { type = contain id = "PER" value = 100 }
}


SAU_like_OMA = {
	allowed = { original_tag = SAU }
	enable = {
		country_exists = OMA
		has_opinion_modifier = Gulf_Cooperation_Council_Relations
	}
	abort_when_not_enabled = yes

	ai_strategy = { type = befriend id = "OMA" value = 20 }
	ai_strategy = { type = alliance id = "OMA" value = 20 }
}

SAU_dislike_SYR = {
	allowed = { original_tag = SAU }
	enable = {
		NOT = { is_in_faction_with = SYR }
	}
	abort_when_not_enabled = yes

	ai_strategy = { type = befriend id = "SYR" value = -100 }
	ai_strategy = { type = conquer id = "SYR" value = 25 }
	ai_strategy = { type = invade id = "SYR" value = 25 }
	ai_strategy = { type = protect id = "SYR" value = -100 }
	ai_strategy = { type = antagonize id = "SYR" value = 100 }
	ai_strategy = { type = alliance id = "SYR" value = -200 }
	ai_strategy = { type = ignore id = "SYR" value = -100 }
	ai_strategy = { type = support id = "SYR" value = -100 }
	ai_strategy = { type = contain id = "SYR" value = 100 }
}

SAU_block_volunteers_to_jihadists = {
	allowed = { original_tag = SAU }
	enable = {
		always = yes
	}
	abort_when_not_enabled = yes

	ai_strategy = { type = send_volunteers_desire id = "AQY" value = -200 }
	ai_strategy = { type = send_volunteers_desire id = "SHB" value = -200 }
	ai_strategy = { type = send_volunteers_desire id = "TAL" value = -200 }
	ai_strategy = { type = send_volunteers_desire id = "ISI" value = -200 }
	ai_strategy = { type = send_volunteers_desire id = "TTP" value = -200 }
}

SAU_block_pointless_volunteers = {
	allowed = { original_tag = SAU }
	enable = {
		threat < 0.5
	}
	abort = {
		threat > 0.5
	}

	ai_strategy = { type = send_volunteers_desire id = "ROJ" value = -200 }
	ai_strategy = { type = send_volunteers_desire id = "TUA" value = -100 }
	ai_strategy = { type = send_volunteers_desire id = "GNC" value = -200 }
}
