defined_text = {
	name = GetLedgerTitle
	text = {
		trigger = { check_variable = { ledger_open = 2 } }
		localization_key = "LEDGER_TITLE_LAND"
	}
	text = {
		trigger = { check_variable = { ledger_open = 3 } }
		localization_key = "LEDGER_TITLE_NAVY_AIR"
	}
	text = {
		trigger = { check_variable = { ledger_open = 4 } }
		localization_key = "LEDGER_TITLE_INDUSTRY"
	}
	text = {
		trigger = { check_variable = { ledger_open = 5 } }
		localization_key = "LEDGER_TITLE_TERRITORY"
	}
	text = {
		trigger = { check_variable = { ledger_open = 6 } }
		localization_key = "LEDGER_TITLE_ECONOMY"
	}
	text = {
		trigger = { check_variable = { ledger_open = 7 } }
		localization_key = "LEDGER_TITLE_FACTIONS"
	}
	text = {
		localization_key = "LEDGER_TITLE"
	}

}

defined_text = {
	name = LedgerGetVariableToSort
	text = {
		trigger = { check_variable = { sort_var = 1 } }
		localization_key = "stability"
	}
	text = {
		trigger = { check_variable = { sort_var = 2 } }
		localization_key = "has_war_support"
	}
	text = {
		trigger = { check_variable = { sort_var = 3 } }
		localization_key = "has_political_power"
	}
	text = {
		trigger = { check_variable = { sort_var = 4 } }
		localization_key = "num_of_factories"
	}
	text = {
		trigger = { check_variable = { sort_var = 5 } }
		localization_key = "max_manpower_k"
	}
	text = {
		trigger = { check_variable = { sort_var = 6 } }
		localization_key = "amount_research_slots"
	}
	text = {
		trigger = { check_variable = { sort_var = 7 } }
		localization_key = "num_battalions"
	}
	text = {
		trigger = { check_variable = { sort_var = 8 } }
		localization_key = "num_divisions"
	}
	text = {
		trigger = { check_variable = { sort_var = 9 } }
		localization_key = "manpower_k"
	}
	text = {
		trigger = { check_variable = { sort_var = 10 } }
		localization_key = "army_experience"
	}
	text = {
		trigger = { check_variable = { sort_var = 11 } }
		localization_key = "command_power"
	}
	text = {
		trigger = { check_variable = { sort_var = 12 } }
		localization_key = "casualties_k"
	}
	text = {
		trigger = { check_variable = { sort_var = 13 } }
		localization_key = "land_doctrine_level"
	}
	text = {
		trigger = { check_variable = { sort_var = 14 } }
		localization_key = "num_ships"
	}
	text = {
		trigger = { check_variable = { sort_var = 15 } }
		localization_key = "num_deployed_planes"
	}
	text = {
		trigger = { check_variable = { sort_var = 16 } }
		localization_key = "navy_experience"
	}
	text = {
		trigger = { check_variable = { sort_var = 17 } }
		localization_key = "air_experience"
	}
	text = {
		trigger = { check_variable = { sort_var = 18 } }
		localization_key = "num_of_nukes"
	}
	text = {
		trigger = { check_variable = { sort_var = 19 } }
		localization_key = "nuclear_reactors"
	}
	text = {
		trigger = { check_variable = { sort_var = 20 } }
		localization_key = "rocket_sites"
	}
	text = {
		trigger = { check_variable = { sort_var = 21 } }
		localization_key = "faction_leader"
	}
	text = {
		trigger = { check_variable = { sort_var = 22 } }
		localization_key = "num_of_civilian_factories"
	}
	text = {
		trigger = { check_variable = { sort_var = 23 } }
		localization_key = "modifier@consumer_goods_factor"
	}
	text = {
		trigger = { check_variable = { sort_var = 24 } }
		localization_key = "num_of_military_factories"
	}
	text = {
		trigger = { check_variable = { sort_var = 25 } }
		localization_key = "num_of_naval_factories"
	}
	text = {
		trigger = { check_variable = { sort_var = 26 } }
		localization_key = "fuel_k"
	}
	text = {
		trigger = { check_variable = { sort_var = 27 } }
		localization_key = "num_owned_states"
	}
	text = {
		trigger = { check_variable = { sort_var = 28 } }
		localization_key = "num_of_controlled_states"
	}
	text = {
		trigger = { check_variable = { sort_var = 29 } }
		localization_key = "num_owned_controlled_states"
	}
	text = {
		trigger = { check_variable = { sort_var = 30 } }
		localization_key = "num_occupied_states"
	}
	text = {
		trigger = { check_variable = { sort_var = 31 } }
		localization_key = "num_core_states"
	}
	text = {
		trigger = { check_variable = { sort_var = 32 } }
		localization_key = "num_controlled_states_including_subjects"
	}
	text = {
		trigger = { check_variable = { sort_var = 33 } }
		localization_key = "gdp_total"
	}
	text = {
		trigger = { check_variable = { sort_var = 34 } }
		localization_key = "gdp_per_capita"
	}
	text = {
		trigger = { check_variable = { sort_var = 35 } }
		localization_key = "debt"
	}
	text = {
		trigger = { check_variable = { sort_var = 36 } }
		localization_key = "treasury"
	}
	text = {
		trigger = { check_variable = { sort_var = 37 } }
		localization_key = "display_income"
	}
	text = {
		trigger = { check_variable = { sort_var = 38 } }
		localization_key = "display_expense"
	}
	text = {
		trigger = { check_variable = { sort_var = 39 } }
		localization_key = "office_park_total"
	}
	text = {
		trigger = { check_variable = { sort_var = 40 } }
		localization_key = "faction_members^num"
	}
	text = {
		trigger = { check_variable = { sort_var = 41 } }
		localization_key = "faction_battalions"
	}
	text = {
		trigger = { check_variable = { sort_var = 42 } }
		localization_key = "faction_ships"
	}
	text = {
		trigger = { check_variable = { sort_var = 43 } }
		localization_key = "faction_air"
	}
	text = {
		trigger = { check_variable = { sort_var = 44 } }
		localization_key = "faction_industry"
	}
	text = {
		trigger = { check_variable = { sort_var = 45 } }
		localization_key = "faction_controlled_states"
	}
	text = {
		trigger = { check_variable = { sort_var = 46 } }
		localization_key = "current_party_ideology_group"
	}
}

defined_text = {
	name = LedgerGetQSCompare
	text = {
		trigger = { check_variable = { ledger_qs_compare = 1 } }
		localization_key = "less_than_or_equals"
	}
	text = {
		localization_key = "greater_than_or_equals"
	}
}

defined_text = {
	name = NextButton
	text = { trigger = { check_variable = { ledger_open = 2 } }
		localization_key = "GFX_air_navy_page"
	}
	text = { trigger = { check_variable = { ledger_open = 3 } }
		localization_key = "GFX_industry_page"
	}
	text = { trigger = { check_variable = { ledger_open = 4 } }
		localization_key = "GFX_territory_page"
	}
	text = { trigger = { check_variable = { ledger_open = 5 } }
		localization_key = "GFX_economy_page"
	}
	text = { trigger = { check_variable = { ledger_open = 6 } }
		localization_key = "GFX_faction_page"
	}
	text = { trigger = { check_variable = { ledger_open = 7 } }
		localization_key = "GFX_button_148x34_right"
	}
	text = {
		localization_key = "GFX_army_page"
	}
}

defined_text = {
	name = PreviousButton
	text = { trigger = { check_variable = { ledger_open = 2 } }
		localization_key = "GFX_button_148x34_left"
	}
	text = { trigger = { check_variable = { ledger_open = 3 } }
		localization_key = "GFX_army_page"
	}
	text = { trigger = { check_variable = { ledger_open = 4 } }
		localization_key = "GFX_air_navy_page"
	}
	text = { trigger = { check_variable = { ledger_open = 5 } }
		localization_key = "GFX_industry_page"
	}
	text = { trigger = { check_variable = { ledger_open = 6 } }
		localization_key = "GFX_territory_page"
	}
	text = { trigger = { check_variable = { ledger_open = 7 } }
		localization_key = "GFX_economy_page"
	}
	text = {
		localization_key = "GFX_faction_page"
	}
}
