#Written by Hiddengearz, Bird
##Improvements in Unit Technologies
technologies = {

	@1945 = 2
	@1965 = 4
	@1985 = 6
	@1995 = 6
	@2005 = 8
	@2015 = 10
	@2035 = 12
	#@2015 = 14
	#@2025 = 16
	#@2035 = 18
	#@1944 = 16
	#@1945 = 18
	#@1946 = 20

	#Y Axis
	@row1 = -2
	@row2 = 0
	@row3 = 2
	@row4 = 4
	@row5 = 6
	@row6 = 8
	@row7 = 10

	#1945
	early_helicopter = {
		on_research_complete = { log = "[GetDateText]: [Root.GetName]: add tech early_helicopter" }

		research_speed_factor = 0.01

		path = {
			leads_to_tech = transport_helicopter1
			research_cost_coeff = 1
		}
		path = {
			leads_to_tech = attack_helicopter1
			research_cost_coeff = 1
		}
		path = {
			leads_to_tech = nsb_attack_helicopter_tech_1
			research_cost_coeff = 1
		}

		research_cost = 1 #random
		start_year = 1945 #
		folder = {
			name = air_techs_folder
			position = { x = @row3 y = @1945 }
		}

		categories = {
			CAT_heli
		}

		ai_will_do = {
			factor = 1
			modifier = {
				factor = 2
				check_variable = { gdp_per_capita > 19.999 }
			}
			modifier = {
				factor = 0
				check_variable = { gdp_per_capita < 20 }
			}
		}
	}

	#1965
	nsb_attack_helicopter_tech_1 = {
		on_research_complete = {
			log = "[GetDateText]: [Root.GetName]: add tech nsb_attack_helicopter_tech_1"
			give_ai_helicopter_template_0 = yes
		}
		allow_branch = {
			has_dlc = "No Step Back"
		}
		enable_equipments = {
			attack_helicopter_hull_0
		}
		enable_subunits = {
			attack_helo_bat
			attack_helo_comp
		}
		enable_equipment_modules = {
			helicopter_turbine_engine_gen1
			helicopter_piston_engine_gen1
			helicopter_gun_pod_gen1
			helicopter_aa_missile_gen1
			helicopter_light_nose_gun_gen1
			helicopter_medium_nose_gun_gen1
			helicopter_heavy_nose_gun_gen1
			helicopter_armor_gen1
			sensors_and_avionics_gen_1
		}
		path = {
			leads_to_tech = nsb_attack_helicopter_tech_2
			research_cost_coeff = 1
		}
		research_cost = 1.7
		start_year = 1965
		folder = {
			name = air_techs_folder
			position = { x = @row5 y = @1965 }
		}
		categories = {
			CAT_heli
			CAT_atk_heli
		}
		ai_will_do = {
			factor = 1
			modifier = {
				factor = 2
				check_variable = { gdp_per_capita > 19.999 }
			}
			modifier = {
				factor = 0
				AND = {
					NOT = {
						original_tag = CHI
						original_tag = SOV
					}
					check_variable = { gdp_per_capita < 20 }
				}
			}
		}
	}

	#1985
	nsb_attack_helicopter_tech_2 = {
		on_research_complete = {
			log = "[GetDateText]: [Root.GetName]: add tech nsb_attack_helicopter_tech_2"
			give_ai_helicopter_template_1 = yes
		}
		enable_equipments = {
			attack_helicopter_hull_1
		}
		enable_equipment_modules = {
			helicopter_turbine_engine_gen2
			helicopter_piston_engine_gen2
			helicopter_gun_pod_gen2
			sensors_and_avionics_gen_2
		}
		path = {
			leads_to_tech = nsb_attack_helicopter_tech_3
			research_cost_coeff = 1
		}
		research_cost = 1.7
		start_year = 1985
		folder = {
			name = air_techs_folder
			position = { x = @row5 y = @1985 }
		}
		categories = {
			CAT_heli
			CAT_atk_heli
		}
		ai_will_do = {
			factor = 1
			modifier = {
				factor = 2
				check_variable = { gdp_per_capita > 19.999 }
			}
			modifier = {
				factor = 0
				AND = {
					NOT = {
						original_tag = CHI
						original_tag = SOV
					}
					check_variable = { gdp_per_capita < 20 }
				}
			}
		}
	}

	#2005
	nsb_attack_helicopter_tech_3 = {
		on_research_complete = {
			log = "[GetDateText]: [Root.GetName]: add tech nsb_attack_helicopter_tech_3"
			give_ai_helicopter_template_2 = yes
		}
		enable_equipments = {
			attack_helicopter_hull_2
		}
		enable_equipment_modules = {
			helicopter_turbine_engine_gen3
			helicopter_piston_engine_gen3
			helicopter_gun_pod_gen3
			helicopter_aa_missile_gen2
			helicopter_light_nose_gun_gen2
			helicopter_medium_nose_gun_gen2
			helicopter_heavy_nose_gun_gen2
			helicopter_armor_gen2
			helicopter_drones_gen1
			sensors_and_avionics_gen_3
		}
		path = {
			leads_to_tech = nsb_attack_helicopter_tech_4
			research_cost_coeff = 1
		}
		research_cost = 1.7
		start_year = 2005
		folder = {
			name = air_techs_folder
			position = { x = @row5 y = @2005 }
		}
		categories = {
			CAT_heli
			CAT_atk_heli
		}
		ai_will_do = {
			factor = 1
			modifier = {
				factor = 2
				check_variable = { gdp_per_capita > 19.999 }
			}
			modifier = {
				factor = 0
				AND = {
					NOT = {
						original_tag = CHI
						original_tag = SOV
					}
					check_variable = { gdp_per_capita < 20 }
				}
			}
			modifier = {
				factor = 0
				date < 2003.1.1
			}
		}
	}

	#2015
	nsb_attack_helicopter_tech_4 = {
		on_research_complete = {
			log = "[GetDateText]: [Root.GetName]: add tech nsb_attack_helicopter_tech_4"
			give_ai_helicopter_template_3 = yes
		}
		enable_equipments = {
			attack_helicopter_hull_3
		}
		enable_equipment_modules = {
			helicopter_turbine_engine_gen4
			helicopter_piston_engine_gen4
			helicopter_gun_pod_gen4
			helicopter_aa_missile_gen2
			helicopter_drones_gen2
			sensors_and_avionics_gen_4
			active_defence_system_gen1
		}
		path = {
			leads_to_tech = nsb_attack_helicopter_tech_5
			research_cost_coeff = 1
		}
		research_cost = 1.7
		start_year = 2015
		folder = {
			name = air_techs_folder
			position = { x = @row5 y = @2015 }
		}
		categories = {
			CAT_heli
			CAT_atk_heli
		}
		ai_will_do = {
			factor = 1
			modifier = {
				factor = 2
				check_variable = { gdp_per_capita > 19.999 }
			}
			modifier = {
				factor = 0
				AND = {
					NOT = {
						original_tag = CHI
						original_tag = SOV
					}
					check_variable = { gdp_per_capita < 20 }
				}
			}
		}
	}

	#2035
	nsb_attack_helicopter_tech_5 = {
		on_research_complete = {
			log = "[GetDateText]: [Root.GetName]: add tech nsb_attack_helicopter_tech_5"
			give_ai_helicopter_template_4 = yes
		}
		enable_equipments = {
			attack_helicopter_hull_4
		}
		enable_equipment_modules = {
			helicopter_turbine_engine_gen5
			helicopter_piston_engine_gen5
			helicopter_gun_pod_gen5
			helicopter_aa_missile_gen3
			helicopter_light_nose_gun_gen3
			helicopter_medium_nose_gun_gen3
			helicopter_heavy_nose_gun_gen3
			helicopter_armor_gen3
			helicopter_drones_gen3
			sensors_and_avionics_gen_5
			active_defence_system_gen2
			stealth_modification_gen3
		}
		research_cost = 1.7
		start_year = 2035
		folder = {
			name = air_techs_folder
			position = { x = @row5 y = @2035 }
		}
		categories = {
			CAT_heli
			CAT_atk_heli
		}
		ai_will_do = {
			factor = 1
			modifier = {
				factor = 2
				check_variable = { gdp_per_capita > 19.999 }
			}
			modifier = {
				factor = 0
				AND = {
					NOT = {
						original_tag = CHI
						original_tag = SOV
					}
					check_variable = { gdp_per_capita < 20 }
				}
			}
		}
	}
#non-nsb attack helicopters
	#1965
	attack_helicopter1 = {
		on_research_complete = { log = "[GetDateText]: [Root.GetName]: add tech attack_helicopter1" }

		allow_branch = {
			NOT = { has_dlc = "No Step Back" }
		}

		enable_equipments = {
			attack_helicopter1 #not created
		}
		enable_subunits = {
			attack_helo_bat
			attack_helo_comp
		}

		path = {
			leads_to_tech = attack_helicopter2
			research_cost_coeff = 1
		}

		research_cost = 1.7
		start_year = 1965

		folder = {
			name = air_techs_folder
			position = { x = @row1 y = @1965 }
		}

		categories = {
			CAT_heli
			CAT_atk_heli
		}



		ai_will_do = {
			factor = 1
			modifier = {
				factor = 2
				check_variable = { gdp_per_capita > 19.999 }
			}
			modifier = {
				factor = 0
				AND = {
					NOT = {
						original_tag = CHI
						original_tag = SOV
					}
					check_variable = { gdp_per_capita < 20 }
				}
			}
		}

	}

	#1985
	attack_helicopter2 = {
		on_research_complete = { log = "[GetDateText]: [Root.GetName]: add tech attack_helicopter2" }

		enable_equipments = { attack_helicopter2 }

		path = {
			leads_to_tech = attack_helicopter3
			research_cost_coeff = 1
		}

		research_cost = 2
		start_year = 1985

		folder = {
			name = air_techs_folder
			position = { x = @row1 y = @1995 }
		}

		categories = {
			CAT_heli
			CAT_atk_heli
		}

		ai_will_do = {
			factor = 1
			modifier = {
				factor = 2
				check_variable = { gdp_per_capita > 19.999 }
			}
			modifier = {
				factor = 0
				AND = {
					NOT = {
						original_tag = CHI
						original_tag = SOV
					}
					check_variable = { gdp_per_capita < 20 }
				}
			}
		}
	}

	#2005
	attack_helicopter3 = {
		on_research_complete = { log = "[GetDateText]: [Root.GetName]: add tech attack_helicopter3" }

		enable_equipments = {
			attack_helicopter3 #not created
		}

		path = {
			leads_to_tech = attack_helicopter4
			research_cost_coeff = 1
		}

		research_cost = 2.1
		start_year = 2005

		folder = {
			name = air_techs_folder
			position = { x = @row1 y = @2005 }
		}

		categories = {
			CAT_heli
			CAT_atk_heli
		}



		ai_will_do = {
			factor = 1
			modifier = {
				factor = 2
				check_variable = { gdp_per_capita > 19.999 }
			}
			modifier = {
				factor = 0
				check_variable = { gdp_per_capita < 20 }
			}
			modifier = {
				factor = 0
				date < 2003.1.1
			}
		}
	}

	#2015
	attack_helicopter4 = {
		on_research_complete = { log = "[GetDateText]: [Root.GetName]: add tech attack_helicopter4" }

		enable_equipments = {
			attack_helicopter4 #not created
		}

		path = {
			leads_to_tech = attack_helicopter5
			research_cost_coeff = 1
		}

		research_cost = 2.2
		start_year = 2015

		folder = {
			name = air_techs_folder
			position = { x = @row1 y = @2015 }
		}

		categories = {
			CAT_heli
			CAT_atk_heli
		}

		ai_will_do = {
			factor = 1
			modifier = {
				factor = 0.5
				date < 2015.01.01
			}
			modifier = {
				factor = 0.2
				date < 2010.01.01
			}
			modifier = {
				factor = 2
				check_variable = { gdp_per_capita > 19.999 }
			}
			modifier = {
				factor = 0
				AND = {
					NOT = {
						original_tag = CHI
						original_tag = SOV
					}
					check_variable = { gdp_per_capita < 20 }
				}
			}
		}
	}

	#2035
	attack_helicopter5 = {
		on_research_complete = { log = "[GetDateText]: [Root.GetName]: add tech attack_helicopter5" }

		enable_equipments = {
			attack_helicopter5
		}

		research_cost = 2.4
		start_year = 2035

		folder = {
			name = air_techs_folder
			position = { x = @row1 y = @2035 }
		}

		categories = {
			CAT_heli
			CAT_atk_heli
		}


		ai_will_do = {
			factor = 1
			modifier = {
				factor = 0.5
				date < 2035.01.01
			}
			modifier = {
				factor = 0.2
				date < 2030.01.01
			}
			# modifier = {
			# 	factor = 2
			# 	check_variable = { gdp_per_capita > 19.999 }
			# }
			modifier = {
				factor = 0
				AND = {
					NOT = {
						original_tag = CHI
						original_tag = SOV
					}
					check_variable = { gdp_per_capita < 20 }
				}
			}
		}
	}
#transport helicopters
	transport_helicopter1 = {
		on_research_complete = { log = "[GetDateText]: [Root.GetName]: add tech transport_helicopter1" }

		enable_equipments = {
			transport_helicopter1 #not created
		}
		enable_subunits = {
			L_Air_assault_Bat
			Arm_Air_assault_Bat
			helicopter_combat_service_support
		}

		path = {
			leads_to_tech = transport_helicopter2
			research_cost_coeff = 1
		}

		research_cost = 2
		start_year = 1965

		folder = {
			name = air_techs_folder
			position = { x = @row3 y = @1965 }
		}

		categories = {
			CAT_heli
			CAT_trans_heli
		}

		ai_will_do = {
			factor = 1
			modifier = {
				factor = 2
				check_variable = { gdp_per_capita > 19.999 }
			}
			modifier = {
				factor = 0
				AND = {
					NOT = {
						original_tag = CHI
						original_tag = SOV
					}
					check_variable = { gdp_per_capita < 20 }
				}
			}
		}
	}

	transport_helicopter2 = {
		on_research_complete = { log = "[GetDateText]: [Root.GetName]: add tech transport_helicopter2" }

		enable_equipments = {
			transport_helicopter2 #not created
		}

		path = {
			leads_to_tech = transport_helicopter3
			research_cost_coeff = 1
		}

		research_cost = 2
		start_year = 1985

		folder = {
			name = air_techs_folder
			position = { x = @row3 y = @1995 }
		}

		categories = {
			CAT_heli
			CAT_trans_heli
		}

		ai_will_do = {
			factor = 1
			modifier = {
				factor = 2
				check_variable = { gdp_per_capita > 29.999 }
			}
			modifier = {
				factor = 0
				AND = {
					NOT = {
						original_tag = CHI
						original_tag = SOV
					}
					check_variable = { gdp_per_capita < 20 }
				}
			}
		}
	}

	transport_helicopter3 = {
		on_research_complete = { log = "[GetDateText]: [Root.GetName]: add tech transport_helicopter3" }

		enable_equipments = {
			transport_helicopter3 #not created
		}

		path = {
			leads_to_tech = transport_helicopter4
			research_cost_coeff = 1
		}

		research_cost = 2
		start_year = 2005

		folder = {
			name = air_techs_folder
			position = { x = @row3 y = @2005 }
		}

		categories = {
			CAT_heli
			CAT_trans_heli
		}

		ai_will_do = {
			factor = 1
			modifier = {
				factor = 0.5
				date < 2005.01.01
			}
			modifier = {
				factor = 0.2
				date < 2002.01.01
			}
			modifier = {
				factor = 2
				check_variable = { gdp_per_capita > 39.999 }
			}
			modifier = {
				factor = 0
				AND = {
					NOT = {
						original_tag = CHI
						original_tag = SOV
					}
					check_variable = { gdp_per_capita < 20 }
				}
			}
			modifier = {
				factor = 0
				date < 2003.1.1
			}
		}
	}

	transport_helicopter4 = {
		on_research_complete = { log = "[GetDateText]: [Root.GetName]: add tech transport_helicopter4" }

		enable_equipments = {
			transport_helicopter4 #not created
		}

		path = {
			leads_to_tech = transport_helicopter5
			research_cost_coeff = 1
		}

		research_cost = 2
		start_year = 2015

		folder = {
			name = air_techs_folder
			position = { x = @row3 y = @2015 }
		}

		categories = {
			CAT_heli
			CAT_trans_heli
		}


	 ai_will_do = {
		factor = 1
		modifier = {
			factor = 0.5
			date < 2015.01.01
		}
		modifier = {
			factor = 0.2
			date < 2010.01.01
		}
		modifier = {
			factor = 2
			check_variable = { gdp_per_capita > 49.999 }
		}
		modifier = {
			factor = 0
			AND = {
				NOT = {
					original_tag = CHI
					original_tag = SOV
				}
				check_variable = { gdp_per_capita < 20 }
			}
		}
		}
	}

	transport_helicopter5 = {
		on_research_complete = { log = "[GetDateText]: [Root.GetName]: add tech transport_helicopter5" }

		enable_equipments = {
			transport_helicopter5 #not created
		}

		research_cost = 2
		start_year = 2035

		folder = {
			name = air_techs_folder
			position = { x = @row3 y = @2035 }
		}

		categories = {
			CAT_heli
			CAT_trans_heli
		}


		ai_will_do = {
			factor = 1
			modifier = {
				factor = 0.5
				date < 2035.01.01
			}
			modifier = {
				factor = 0.2
				date < 2030.01.01
			}
			modifier = {
				factor = 2
				check_variable = { gdp_per_capita > 59.999 }
			}
			modifier = {
				factor = 0
				AND = {
					NOT = {
						original_tag = CHI
						original_tag = SOV
					}
					check_variable = { gdp_per_capita < 20 }
				}
			}
		}
	} ##ASW Helis Deleted. Unnesscary. Will add replacment techs to just be like "better" ASW warfare capabilities
}
