﻿GER = {
	fleet_names_template = FLEET_NAME_GER
	diesel_attack_submarine = {
		prefix = ""
		generic = { "Unterseeboot" }
		unique = {
			"U-1" "U-2" "U-3" "U-4" "U-5" "U-6" "U-7" "U-8" "U-9" "U-10" "U-11" "U-12" "U-13" "U-14" "U-15"
			"U-16" "U-17" "U-18" "U-19" "U-20" "U-21" "U-22" "U-23" "U-24" "U-25" "U-26" "U-27" "U-28" "U-29"
			"U-30" "U-31" "U-32" "U-33" "U-34" "U-35" "U-36" "U-37" "U-38" "U-39" "U-40" "U-41" "U-42" "U-43"
			"U-44" "U-45" "U-46" "U-47" "U-48" "U-49" "U-50" "U-51" "U-52" "U-53" "U-54" "U-55" "U-56" "U-57"
			"U-58" "U-59" "U-60" "U-61" "U-62" "U-63" "U-64" "U-65" "U-66" "U-67" "U-68" "U-69" "U-70" "U-71"
			"U-72" "U-73" "U-74" "U-75" "U-76" "U-77" "U-78" "U-79" "U-80" "U-81" "U-82" "U-83" "U-84" "U-85"
			"U-86" "U-87" "U-88" "U-89" "U-90" "U-91" "U-92" "U-93" "U-94" "U-95" "U-96" "U-97" "U-98" "U-99"
			"U-100" "U-101" "U-102" "U-103" "U-104" "U-105" "U-106" "U-107" "U-108" "U-109" "U-110" "U-111"
			"U-112" "U-113" "U-114" "U-115" "U-116" "U-117" "U-118" "U-119" "U-120" "U-121" "U-122" "U-123"
			"U-124" "U-125" "U-126" "U-127" "U-128" "U-129" "U-130" "U-131" "U-132" "U-133" "U-134" "U-135"
			"U-136" "U-137" "U-138" "U-139" "U-140" "U-141" "U-142" "U-143" "U-144" "U-145" "U-146" "U-147"
			"U-148" "U-149" "U-150" "U-151" "U-152" "U-153" "U-154" "U-155" "U-156" "U-157" "U-158" "U-159"
			"U-160" "U-161" "U-162" "U-163" "U-164" "U-165" "U-166" "U-167" "U-168" "U-169" "U-170" "U-171"
			"U-172" "U-173" "U-174" "U-175" "U-176" "U-177" "U-178" "U-179" "U-180" "U-181" "U-182" "U-183"
			"U-184" "U-185" "U-186" "U-187" "U-188" "U-189" "U-190" "U-191" "U-192" "U-193" "U-194" "U-195"
			"U-196" "U-197" "U-198" "U-199" "U-200" "U-201" "U-202" "U-203" "U-204" "U-205" "U-206" "U-207"
			"U-208" "U-209" "U-210" "U-211" "U-212" "U-213" "U-214" "U-215" "U-216" "U-217" "U-218" "U-219"
			"U-220" "U-221" "U-222" "U-223" "U-224" "U-225" "U-226" "U-227" "U-228" "U-229" "U-230" "U-231"
			"U-232" "U-233" "U-234" "U-235" "U-236" "U-237" "U-238" "U-239" "U-240" "U-241" "U-242" "U-243"
			"U-244" "U-245" "U-246" "U-247" "U-248" "U-249" "U-250" "U-251" "U-252" "U-253" "U-254" "U-255"
			"U-256" "U-257" "U-258" "U-259" "U-260" "U-261" "U-262" "U-263" "U-264" "U-265" "U-266" "U-267"
			"U-268" "U-269" "U-270" "U-271" "U-272" "U-273" "U-274" "U-275" "U-276" "U-277" "U-278" "U-279"
			"U-280" "U-281" "U-282" "U-283" "U-284" "U-285" "U-286" "U-287" "U-288" "U-289" "U-290" "U-291"
			"U-292" "U-293" "U-294" "U-295" "U-296" "U-297" "U-298" "U-299" "U-300" "U-301" "U-302" "U-303"
			"U-304" "U-305" "U-306" "U-307" "U-308" "U-309" "U-310" "U-311" "U-312" "U-313" "U-314" "U-315"
			"U-316" "U-317" "U-318" "U-319" "U-320" "U-321" "U-322" "U-323" "U-324" "U-325" "U-326" "U-327"
			"U-328" "U-329" "U-330" "U-331" "U-332" "U-333" "U-334" "U-335" "U-336" "U-337" "U-338" "U-339"
			"U-340" "U-341" "U-342" "U-343" "U-344" "U-345" "U-346" "U-347" "U-348" "U-349" "U-350" "U-351"
			"U-352" "U-353" "U-354" "U-355" "U-356" "U-357" "U-358" "U-359" "U-360" "U-361" "U-362" "U-363"
			"U-364" "U-365" "U-366" "U-367" "U-368" "U-369" "U-370" "U-371" "U-372" "U-373" "U-374" "U-375"
			"U-376" "U-377" "U-378" "U-379" "U-380" "U-381" "U-382" "U-383" "U-384" "U-385" "U-386" "U-387"
			"U-388" "U-389" "U-390" "U-391" "U-392" "U-393" "U-394" "U-395" "U-396" "U-397" "U-398" "U-399"
			"U-400" "U-401" "U-402" "U-403" "U-404" "U-405" "U-406" "U-407" "U-408" "U-409" "U-410" "U-411"
			"U-412" "U-413" "U-414" "U-415" "U-416" "U-417" "U-418" "U-419" "U-420" "U-421" "U-422" "U-423"
			"U-424" "U-425" "U-426" "U-427" "U-428" "U-429" "U-430" "U-431" "U-432" "U-433" "U-434" "U-435"
			"U-436" "U-437" "U-438" "U-439" "U-440" "U-441" "U-442" "U-443" "U-444" "U-445" "U-446" "U-447"
			"U-448" "U-449" "U-450" "U-451" "U-452" "U-453" "U-454" "U-455" "U-456" "U-457" "U-458" "U-459"
			"U-460" "U-461" "U-462" "U-463" "U-464" "U-465" "U-466" "U-467" "U-468" "U-469" "U-470" "U-471"
			"U-472" "U-473" "U-474" "U-475" "U-476" "U-477" "U-478" "U-479" "U-480" "U-481" "U-482" "U-483"
			"U-484" "U-485" "U-486" "U-487" "U-488" "U-489" "U-490" "U-491" "U-492" "U-493" "U-494" "U-495"
			"U-496" "U-497" "U-498" "U-499" "U-500"
		}
	}
	attack_submarine = {
		prefix = ""
		generic = { "Atom-Unterseeboot" }
		unique = {
			"U(A)-1" "U(A)-2" "U(A)-3" "U(A)-4" "U(A)-5" "U(A)-6" "U(A)-7" "U(A)-8" "U(A)-9" "U(A)-10"
			"U(A)-11" "U(A)-12" "U(A)-13" "U(A)-14" "U(A)-15" "U(A)-16" "U(A)-17" "U(A)-18" "U(A)-19" "U(A)-20"
			"U(A)-21" "U(A)-22" "U(A)-23" "U(A)-24" "U(A)-25" "U(A)-26" "U(A)-27" "U(A)-28" "U(A)-29" "U(A)-30"
			"U(A)-31" "U(A)-32" "U(A)-33" "U(A)-34" "U(A)-35" "U(A)-36" "U(A)-37" "U(A)-38" "U(A)-39" "U(A)-40"
			"U(A)-41" "U(A)-42" "U(A)-43" "U(A)-44" "U(A)-45" "U(A)-46" "U(A)-47" "U(A)-48" "U(A)-49" "U(A)-50"
			"U(A)-51" "U(A)-52" "U(A)-53" "U(A)-54" "U(A)-55" "U(A)-56" "U(A)-57" "U(A)-58" "U(A)-59" "U(A)-60"
			"U(A)-61" "U(A)-62" "U(A)-63" "U(A)-64" "U(A)-65" "U(A)-66" "U(A)-67" "U(A)-68" "U(A)-69" "U(A)-70"
			"U(A)-71" "U(A)-72" "U(A)-73" "U(A)-74" "U(A)-75" "U(A)-76" "U(A)-77" "U(A)-78" "U(A)-79" "U(A)-80"
			"U(A)-81" "U(A)-82" "U(A)-83" "U(A)-84" "U(A)-85" "U(A)-86" "U(A)-87" "U(A)-88" "U(A)-89" "U(A)-90"
			"U(A)-91" "U(A)-92" "U(A)-93" "U(A)-94" "U(A)-95" "U(A)-96" "U(A)-97" "U(A)-98" "U(A)-99"
		}
	}
	missile_submarine = {
		prefix = ""
		generic = { "Rakete-Unterseeboot" }
		unique = {
			"U(R)-1" "U(R)-2" "U(R)-3" "U(R)-4" "U(R)-5" "U(R)-6" "U(R)-7" "U(R)-8" "U(R)-9" "U(R)-10"
			"U(R)-11" "U(R)-12" "U(R)-13" "U(R)-14" "U(R)-15" "U(R)-16" "U(R)-17" "U(R)-18" "U(R)-19" "U(R)-20"
			"U(R)-21" "U(R)-22" "U(R)-23" "U(R)-24" "U(R)-25" "U(R)-26" "U(R)-27" "U(R)-28" "U(R)-29" "U(R)-30"
			"U(R)-31" "U(R)-32" "U(R)-33" "U(R)-34" "U(R)-35" "U(R)-36" "U(R)-37" "U(R)-38" "U(R)-39" "U(R)-40"
			"U(R)-41" "U(R)-42" "U(R)-43" "U(R)-44" "U(R)-45" "U(R)-46" "U(R)-47" "U(R)-48" "U(R)-49" "U(R)-50"
			"U(R)-51" "U(R)-52" "U(R)-53" "U(R)-54" "U(R)-55" "U(R)-56" "U(R)-57" "U(R)-58" "U(R)-59" "U(R)-60"
			"U(R)-61" "U(R)-62" "U(R)-63" "U(R)-64" "U(R)-65" "U(R)-66" "U(R)-67" "U(R)-68" "U(R)-69" "U(R)-70"
			"U(R)-71" "U(R)-72" "U(R)-73" "U(R)-74" "U(R)-75" "U(R)-76" "U(R)-77" "U(R)-78" "U(R)-79" "U(R)-80"
			"U(R)-81" "U(R)-82" "U(R)-83" "U(R)-84" "U(R)-85" "U(R)-86" "U(R)-87" "U(R)-88" "U(R)-89" "U(R)-90"
			"U(R)-91" "U(R)-92" "U(R)-93" "U(R)-94" "U(R)-95" "U(R)-96" "U(R)-97" "U(R)-98" "U(R)-99"
		}
	}
	corvette = {
		prefix = ""
		generic = { "Korvette" }
		unique = {
			"Kobra"
			"Seehund"
			"Falke"
			"Tiger"
			"Iltis"
			"Greif"
			"Jaguar"
			"Kiebitz"
			"Widder"
			"Kondor"
			"Leopard"
			"Murmeltier"
			"Kormoran"
			"Löwe"
			"Otter"
			"Möwe"
			"Panther"
			"Luchs"
			"Pinguin"
			"Puma"
			"Seeadler"
			"Wolf"
			"Drache"
			"Roland"
			"Agreus"
			"Medusa"
			"Pallas"
			"Atlantis"
			"Orion"
			"Zeus"
			"Dictys"
			"Thor"
			"Hela"
			"Bienor"
			"Hylaeus"
			"Komet"
			"Lauting"
			"Ampelos"
			"Marsyas"
			"Niobe"
			"Minotaur"
			"Nomios"
			"Nymphe"
			"Phanes"
			"Ariadne"
			"Undine"
			"Pane"
			"Spargeus"
			"Riphonus"
			"Thetis"
			"Abroholos"
			"Passat"
			"Auster"
			"Sirocco"
			"Hurrikan"
			"Norte"
			"Austru"
			"Taifun"
			"Barat"
			"Leste"
			"Bayamo"
			"Bora"
			"Mistral"
			"Brisa"
			"Diablo"
			"Barber"
			"Euros"
			"Pampero"
			"Shamal"
			"Brisote"
		}
	}
	frigate = {
		prefix = ""
		generic = { "Fregatte" }
		unique = {
			"Adjutant"
			"Nordpol"
			"Hohes Venn"
			"Adler"
			"Samland"
			"Ruhr"
			"Arcona"
			"Coronel"
			"Doggerbank"
			"Usedom"
			"Angerapp"
			"Pregel"
			"Niederung"
			"Eiffel"
			"Hansa"
			"Wollin"
			"Kamerun"
			"Lausitz"
			"Hinterpommern"
			"Irben"
			"Vorbecksland"
			"Masuren"
			"Kehrwieder"
			"Kurland"
			"Malta"
			"Oder"
			"Ammerland"
			"Südwest"
			"Rabaul"
			"Siegerland"
			"Skagerrak"
			"Argonnerwald"
			"Memelland"
			"Vogesen"
			"Schwarzwald"
			"Zugspitze"
			"Watzmann"
			"Havelland"
			"Hundstod"
			"Togo"
			"Weichsel"
			"Tannenberg"
			"Crossen"
			"Greifenhagen"
			"Angerburg"
			"Arel"
			"Forbach"
			"Sennheim"
			"Czarnikau"
			"Darkehmen"
			"Arolsen"
			"Lübeck"
			"Bamberg"
			"Metz"
			"Berlin"
			"Duß"
			"Xanthen"
			"Bielefeld"
			"Karthaus"
			"Hamburg"
			"Bromberg"
			"Bochum"
			"Eydtkuhnen"
			"Bonn"
			"Breslau"
			"Hamm"
			"Oberhausen"
			"Tarnowitz"
			"Bückeburg"
			"Chemnitz"
			"Pleß"
			"Lissa"
			"Wirsitz"
			"Coburg"
			"Hannover"
			"Gelsenkirchen"
			"Freiburg"
			"Danzig"
			"Darmstadt"
			"Stargard"
			"Duisburg"
			"Kassel"
			"Labiau"
			"Küstrin"
			"Dortmund"
			"Gera"
			"Tilsit"
			"Schmalkalden"
			"Mönchengladbach"
			"Dresden"
			"Luxemburg"
			"Düsseldorf"
			"Elbing"
			"Altenburg"
			"Memel"
			"Greiz"
			"Halle"
			"Neustrelitz"
			"Heidelberg"
			"Insterburg"
			"Schöneberg"
			"Kiel"
			"Ulm"
			"Koblenz"
			"Sonderhausen"
			"Kolberg"
			"Köln"
			"Stettin"
			"Bottrop"
			"Krefeld"
			"Leverkusen"
			"Münster"
			"Meiningen"
			"Ludwigshafen"
			"Mannheim"
			"Neuss"
			"Rudolstadt"
			"Mülheim"
			"Paderborn"
			"Potsdam"
			"Saarbrücken"
			"Thorn"
			"Solingen"
			"Weimar"
			"Stuttgart"
			"Wuppertal"
			"Mainz" "Magdeburg" "München" "Medusa" "Niobe" "Nymphe" "Stettin" "Stuttgart" "Dresden" "Kolberg" "Augsburg" "Breslau" "Stralsund" "Straßburg" "Rostock"
			"Pillau" "Elbing" "Graudenz" "Regensburg" "Wiesbaden" "Frankfurt" "Brummer" "Bremen" "Berlin" "Danzig" "Hamburg"
			"Bremse" "Lübeck" "Gazelle" "Thetis" "Ariadne" "Amazone" "Frauenlob" "Arcona" "Undine"
			"Emden" "Königsberg" "Karlsruhe" "Köln" "Leipzig" "Nürnberg"
		}
	}
	destroyer = {
		prefix = ""
		generic = { "Zerstörer" }
		unique = {
			"Mainz" "Magdeburg" "München" "Medusa" "Niobe" "Nymphe" "Stettin" "Stuttgart" "Dresden" "Kolberg" "Augsburg" "Breslau" "Stralsund" "Straßburg" "Rostock"
			"Pillau" "Elbing" "Graudenz" "Regensburg" "Wiesbaden" "Frankfurt" "Brummer" "Bremen" "Berlin" "Danzig" "Hamburg"
			"Bremse" "Lübeck" "Gazelle" "Thetis" "Ariadne" "Amazone" "Frauenlob" "Arcona" "Undine"
			"Emden" "Königsberg" "Karlsruhe" "Köln" "Leipzig" "Nürnberg"
			"Crossen"
			"Greifenhagen"
			"Angerburg"
			"Château-Salins"
			"Arel"
			"Forbach"
			"Sennheim"
			"Czarnikau"
			"Darkehmen"
			"Arolsen"
			"Lübeck"
			"Bamberg"
			"Metz"
			"Berlin"
			"Duß"
			"Xanthen"
			"Bielefeld"
			"Karthaus"
			"Hamburg"
			"Bromberg"
			"Bochum"
			"Eydtkuhnen"
			"Bonn"
			"Breslau"
			"Hamm"
			"Oberhausen"
			"Tarnowitz"
			"Bückeburg"
			"Chemnitz"
			"Pleß"
			"Lissa"
			"Wirsitz"
			"Coburg"
			"Hannover"
			"Gelsenkirchen"
			"Freiburg"
			"Danzig"
			"Darmstadt"
			"Stargard"
			"Duisburg"
			"Kassel"
			"Labiau"
			"Küstrin"
			"Dortmund"
			"Gera"
			"Tilsit"
			"Schmalkalden"
			"Mönchengladbach"
			"Dresden"
			"Luxemburg"
			"Düsseldorf"
			"Elbing"
			"Altenburg"
			"Memel"
			"Greiz"
			"Halle"
			"Neustrelitz"
			"Heidelberg"
			"Insterburg"
			"Schöneberg"
			"Kiel"
			"Ulm"
			"Koblenz"
			"Sonderhausen"
			"Kolberg"
			"Köln"
			"Stettin"
			"Bottrop"
			"Krefeld"
			"Leverkusen"
			"Münster"
			"Meiningen"
			"Ludwigshafen"
			"Mannheim"
			"Neuss"
			"Rudolstadt"
			"Mülheim"
			"Paderborn"
			"Potsdam"
			"Saarbrücken"
			"Thorn"
			"Solingen"
			"Weimar"
			"Stuttgart"
			"Wuppertal"
		}
	}
	cruiser = {
		prefix = ""
		generic = { "Kreuzer" }
		unique = {
			#German States
			"Baden-Württemberg"
			"Niedersachsen"
			"Hessen"
			"Rheinland-Pfalz"
			"Hamburg"
			"Sachsen"
			"Sachsen-Anhalt"
			"Thüringen"
			"Saarland"
			"Nordrhein-Westfalen"
			"Schleswig-Holstein"
			"Bremen"
			"Bayern"
			"Brandenburg"
			"Mecklenburg-Vorpommern"
			"Niederschlesien"
			"Oberschlesien"
			"Elsass-Lothringen"
			"Westpreussen"
			"Ostpreussen"

			# Historical Names - Generals of Prussia & All admirals
			"Admiral Hipper"
			"Viktoria Luise"
			"Hermine Reuß"
			"Schmettau"
			"Admiral Koester"
			"Knobelsdorff"
			"Glasenapp"
			"Admiral Holtzendorff"
			"Prinz Oskar"
			"Kaiserin Augusta"
			"Prinz Johann"
			"Dennewitz"
			"Lehwaldt"
			"Lützow"
			"Nollendorf"
			"Prinz Albert"
			"Von Sparr"
			"Prinz Heinrich"
			"Kalckstein"
			"Linsingen"
			"Prinz Moritz"

			# Mythical names & extras
			"Wotan"
			"Odin"
			"Kriemhild"
			"Fenriswolf"
			"Alberich"
			"Mimir"
			"Ägir"
			"Mjölnir"
			"Hadubrand"
			"Fafnir"
		}
	}
	carrier = {
		prefix = ""
		generic = { "Flugzeugträger" }
		unique = {
			"Richthofen"
			"Peter Strasser"
			"Seydlitz"
			"Europa"
			"Potsdam"
			"Graf Zeppelin"
			"Barbarossa"
			"Clausewitz"
			"Tutschek"
			"Von der Lieth-Thomsen"
			"Otto Lilienthal"
			"Götterdämmerung"
			"Friedrich Schiller"
			"Johann Wolfgang von Goethe"
			"Friedrich Wölfert"
			"Germania"
			"Richard Wagner"
			"Parsifal"
			"Lohengrin"
			"Rheingold"
			"Paul Haenlein"
			"Hoeppner"
			"Seelöwe"
			"Hugo Eckener"
			"Sachsenberg"
			"Hugo Junkers"
			"Ernst Heinkel"
			"Claude Dornier"
			"Wilhelm Messerschmitt"
			"Hans Klemm"
			"Helmut Wilberg"
			"Schleich"

		}
	}

	Nuclear_carrier = {
		prefix = ""
		generic = { "Flugzeugträger" }
		unique = {
			"Prinzregent Luitpold"
			"Anhalt"
			"Zähringen"
			"Kaiser Wilhelm der Große"
			"Bayer"
			"Friedrich-Wilhelm"
			"Elsaß-Lothringen"
			"Brandenburg"
			"Katzbach"
			"Braunschweig"
			"Ebermaier"
			"Westpreußen"
			"Franken"
			"Württemberg"
			"Dessau"
			"Wittelsbach"
			"Detmold"
			"Hessen-Nassau"
			"Hohenzollern"
			"Wettin"
			"Kaiser Friedrich II"
			"Pommern"
			"Schwaben"
			"Kronprinz Wilhelm"
			"Kaiser"
			"Tirpitz"
			"Rheinpreußen"
			"Königin Viktoria"
			"Waldeck"
			"Lippe"
			"Oberpfalz"
			"Mark"
			"Posen"
			"Mecklenburg-Strelitz"
			"Reuß"
			"Schleswig-Holstein"
			"Sachsen-Weimar"
			"Thüringen"
			"Puttkamer"
			"Lüderitz"
			"Lettow-Vorbeck"
			"König Ruppprecht"
			"Kaiser Wilhelm II"
		}
	}
	LHA = {
		prefix = ""
		generic = { "Flugzeugträger" }
		unique = {
			"Alter Dessauer"
			"Dossow"
			"Grumbkow"
			"Falkenhayn"
			"Bittenfeld"
			"Müffling"
			"Francois"
			"Sparr"
			"Glasenapp"
			"Boyen"
			"Graf Finck"
			"Kleist"
			"Wylich"
			"Graf Schwerin"
			"Grolman"
			"Flemming"
			"Lilienstern"
			"Moltke"
			"Graf Barfus"
			"Schöning"
			"Reyher"
			"Graf Dohna"
			"Manteuffel"
			"Natzmer"
			"Graf Borcke"
		}
	}
	LPD = {
		prefix = ""
		generic = { "Flugzeugträger" }
		unique = {
			"Alter Dessauer"
			"Dossow"
			"Grumbkow"
			"Falkenhayn"
			"Bittenfeld"
			"Müffling"
			"Francois"
			"Sparr"
			"Glasenapp"
			"Boyen"
			"Graf Finck"
			"Kleist"
			"Wylich"
			"Graf Schwerin"
			"Grolman"
			"Flemming"
			"Lilienstern"
			"Moltke"
			"Graf Barfus"
			"Schöning"
			"Reyher"
			"Graf Dohna"
			"Manteuffel"
			"Natzmer"
			"Graf Borcke"
		}
	}


	infantry = {
		prefix = ""
		generic = { "Infanterie-Division" }
		generic_pattern = "UNIT_GENERIC_NAME_GER"
	}
	#motorized = {
	#	prefix = ""
	#	generic = { "" }
	#	generic_pattern = "UNIT_GENERIC_NAME_GER"
	#	unique = { }
	# }
	mountaineers = {
		prefix = ""
		generic = { "Gebirgsbrigade" }
		generic_pattern = "UNIT_GENERIC_NAME_GER"
		unique = { }
	}
	cavalry = {
		prefix = ""
		generic = { "Kavallerie-Kommando" }
		generic_pattern = "UNIT_GENERIC_NAME_GER"
		unique = { }
	}
	light_armor = {
		prefix = ""
		generic = { "Panzer-Division" }
		generic_pattern = "UNIT_GENERIC_NAME_GER"
		unique = { }
	}
	medium_armor = {
		prefix = ""
		generic = { "Panzer-Division" }
		generic_pattern = "UNIT_GENERIC_NAME_GER"
		unique = { }
	}



	### Air wings

	small_plane_airframe = {
		prefix = ""
		generic = { "Jagdgeschwader" }
		generic_pattern = AIR_WING_NAME_GER_GENERIC
		unique = {
			"Jagdgeschwader 51 'Immelmann'"
		}
	}
	small_plane_strike_airframe = {
		prefix = ""
		generic = { "Leichte-Kampfgeschwader" }
		generic_pattern = AIR_WING_NAME_GER_GENERIC
		unique = {
		}
	}
	small_plane_naval_bomber_airframe = {
		prefix = ""
		generic = { "Leichte-Träger-Jagdgruppe" }
		generic_pattern = AIR_WING_NAME_GER_GENERIC
		unique = {
		}
	}
	small_plane_cas_airframe = {
		prefix = ""
		generic = { "Schulgeschwader" }
		generic_pattern = AIR_WING_NAME_GER_GENERIC
		unique = {
		}
	}
	small_plane_suicide_airframe = {
		prefix = ""
		generic = { "Unbemanntes-Luftgeschwader" }
		generic_pattern = AIR_WING_NAME_GER_GENERIC
		unique = {
		}
	}

	medium_plane_airframe = {
		prefix = ""
		generic = { "Jagdbombergeschwader" }
		generic_pattern = "$NR$. $NAME$"
		unique = {
			"Jagdbombergeschwader 31 'Boelcke'" "Jagdbombergeschwader 32" "Jagdbombergeschwader 33"
		}
	}
	medium_plane_fighter_airframe = {
		prefix = ""
		generic = { "Jagdgeschwader" }
		generic_pattern = AIR_WING_NAME_GER_GENERIC
		unique = {
			"Jagdgeschwader 71 'Richthofen'" "Jagdgeschwader 73 'Steinhoff'" "Jagdgeschwader 74 'Mölders'"
		}
	}

	medium_plane_cas_airframe = {
		prefix = ""
		generic = { "Kampfgeschwader" }
		generic_pattern = AIR_WING_NAME_GER_GENERIC
		unique = {

		}
	}

	medium_plane_maritime_patrol_airframe = {
		prefix = ""
		generic = { "Kampfgeschwader" }
		generic_pattern = AIR_WING_NAME_GER_GENERIC
		unique = {

		}
	}

	medium_plane_suicide_airframe = {
		prefix = ""
		generic = { "Kampfgeschwader" }
		generic_pattern = AIR_WING_NAME_GER_GENERIC
		unique = {

		}
	}

	cv_medium_plane_airframe = {
		prefix = ""
		generic = { "Träger-Jagdgruppe" }
		generic_pattern = AIR_WING_NAME_GER_GENERIC
		unique = {
		}
	}

	cv_medium_plane_fighter_airframe = {
		prefix = ""
		generic = { "Träger-Jagdgruppe" }
		generic_pattern = AIR_WING_NAME_GER_GENERIC
		unique = {
		}
	}

	cv_medium_plane_maritime_patrol_airframe = {
		prefix = ""
		generic = { "Träger-Jagdgruppe" }
		generic_pattern = AIR_WING_NAME_GER_GENERIC
		unique = {
		}
	}

	cv_medium_plane_cas_airframe = {
		prefix = ""
		generic = { "Träger-Jagdgruppe" }
		generic_pattern = AIR_WING_NAME_GER_GENERIC
		unique = {
		}
	}

	cv_medium_plane_scout_airframe = {
		prefix = ""
		generic = { "Träger-Jagdgruppe" }
		generic_pattern = AIR_WING_NAME_GER_GENERIC
		unique = {
		}
	}

	cv_medium_plane_air_transport_airframe = {
		prefix = ""
		generic = { "Träger-Lufttransportgeschwader" }
		generic_pattern = AIR_WING_NAME_GER_GENERIC
		unique = {
		}
	}




	large_plane_airframe = {
		prefix = ""
		generic = { "Bombergeschwader" }
		generic_pattern = AIR_WING_NAME_GER_GENERIC
		unique = {
		}
	}

	large_plane_cas_airframe = {
		prefix = ""
		generic = { "Bombergeschwader" }
		generic_pattern = AIR_WING_NAME_GER_GENERIC
		unique = {
		}
	}

	large_plane_awacs_airframe = {
		prefix = ""
		generic = { "Frühwarnfliegergeschwader" }
		generic_pattern = AIR_WING_NAME_GER_GENERIC
		unique = {
		}
	}

	large_plane_air_transport_airframe = {
		prefix = ""
		generic = { "Lufttransportgeschwader" }
		generic_pattern = AIR_WING_NAME_GER_GENERIC
		unique = {
		}
	}
	large_plane_maritime_patrol_airframe = {
		prefix = ""
		generic = { "Marinefliegergeschwader" }
		generic_pattern = AIR_WING_NAME_GER_GENERIC
		unique = {
		}
	}

	attack_helicopter_hull = {
		prefix = ""
		generic = { "Kampfhubschrauberregiment" }
		generic_pattern = AIR_WING_NAME_GER_GENERIC
		unique = {
			"Kampfhubschrauberregiment 26 'Franken'" "Kampfhubschrauberregiment 36 'Kurhessen'"
		}
	}
	guided_missile_equipment = {
		prefix = ""
		generic = { "Flugabwehrraketengeschwader" }
		generic_pattern = AIR_WING_NAME_GER_GENERIC
		unique = {
			"Flugabwehrraketengeschwader 1"
		}
	}
}
