ideas = {
	country = {
		low_level_of_aids = {
			on_add = { log = "[GetDateText]: [Root.GetName]: add idea low_level_of_aids" }

			picture = population_down

			available = {
				always = yes
			}

			modifier = {
				conscription = -0.002
				production_speed_buildings_factor = -0.10
				industrial_capacity_factory = -0.10
				stability_factor = -0.03
				health_cost_multiplier_modifier = 0.05
			}
		}
		rising_level_of_aids = {
			on_add = { log = "[GetDateText]: [Root.GetName]: add idea rising_level_of_aids" }

			picture = population_stagnation

			available = {
				always = yes
			}

			modifier = {
				conscription = -0.004
				production_speed_buildings_factor = -0.20
				industrial_capacity_factory = -0.20
				stability_factor = -0.06
				health_cost_multiplier_modifier = 0.10
			}
		}
		high_level_of_aids = {
			on_add = { log = "[GetDateText]: [Root.GetName]: add idea high_level_of_aids" }

			picture = population_growth

			available = {
				always = yes
			}

			modifier = {
				conscription = -0.006
				production_speed_buildings_factor = -0.30
				industrial_capacity_factory = -0.30
				stability_factor = -0.09
				health_cost_multiplier_modifier = 0.15
			}
		}
		very_high_level_of_aids = {
			on_add = { log = "[GetDateText]: [Root.GetName]: add idea very_high_level_of_aids" }

			picture = population_rapid_growth

			available = {
				always = yes
			}

			modifier = {
				conscription = -0.006
				production_speed_buildings_factor = -0.40
				industrial_capacity_factory = -0.40
				stability_factor = -0.12
				health_cost_multiplier_modifier = 0.20
			}
		}
		critical_level_of_aids = {
			on_add = { log = "[GetDateText]: [Root.GetName]: add idea critical_level_of_aids" }

			picture = population_explosion

			available = {
				always = yes
			}

			modifier = {
				conscription = -0.008
				production_speed_buildings_factor = -0.50
				industrial_capacity_factory = -0.50
				stability_factor = -0.15
				health_cost_multiplier_modifier = 0.25
			}
		}
	}
}