state = {
	id = 579
	name = "STATE_579"

	history = {
		owner = LBA
		add_core_of = LBA
		2017.1.1 = {
			owner = HOR
			add_core_of = GNA
			add_core_of = GNC
			add_core_of = HOR
			add_manpower = 172
		}
	}

	impassable = yes

	provinces = {
		4191
	}
	manpower = 723
	buildings_max_level_factor = 1.000
	state_category = state_inhospitable
}
