﻿division_template = {
	name = "Infantry Brigade (A)"

	regiments = {
		Mot_Inf_Bat = { x = 0 y = 0 }
		Arty_Bat = { x = 0 y = 1 }
		Arm_Inf_Bat = { x = 1 y = 0 }
		Mech_Inf_Bat = { x = 2 y = 0 }
	}

	support = {
		Mot_Recce_Comp = { x = 0 y = 0 }
		L_Engi_Comp = { x = 0 y = 1 }
	}
}

division_template = {
	name = "Infantry Brigade (SPA)"

	regiments = {
		Mot_Inf_Bat = { x = 0 y = 0 }
		SP_Arty_Bat = { x = 0 y = 1 }
		Arm_Inf_Bat = { x = 1 y = 0 }
		Mech_Inf_Bat = { x = 2 y = 0 }
	}

	support = {
		Mot_Recce_Comp = { x = 0 y = 0 }
		L_Engi_Comp = { x = 0 y = 1 }
	}
}

division_template = {
	name = "Armored Battalion"

	regiments = {
		armor_Bat = { x = 0 y = 0 }
	}
}

units = {
	division = {
		name = "4th Infantry Brigade"
		location = 6942		#Capljina
		division_template = "Infantry Brigade (A)"
		start_experience_factor = 0.5
		start_equipment_factor = 0.01
	}

	division = {
		name = "5th Infantry Brigade"
		location = 6799		#Tuzla
		division_template = "Infantry Brigade (SPA)"
		start_experience_factor = 0.5
		start_equipment_factor = 0.01
	}

	division = {
		name = "5th Infantry Brigade"
		location = 6983		#Banja Luka
		division_template = "Infantry Brigade (SPA)"
		start_experience_factor = 0.5
		start_equipment_factor = 0.01
	}

	division = {
		name = "Armored Battalion"
		location = 6799		#Tuzla
		division_template = "Armored Battalion"
		start_experience_factor = 0.5
		start_equipment_factor = 0.01
	}
}

instant_effect = {
	add_equipment_to_stockpile = {
		type = APC_2			#M113
		amount = 80
		producer = USA
	}

	add_equipment_to_stockpile = {
		type = infantry_weapons1			#M16
		amount = 300
		producer = USA
	}

	add_equipment_to_stockpile = {
		type = infantry_weapons4			#M4
		amount = 300
		producer = USA
	}

	add_equipment_to_stockpile = {
		type = infantry_weapons3			#G36
		amount = 300
		producer = GER
	}

	add_equipment_to_stockpile = {
		type = infantry_weapons			#HK33
		amount = 300
		producer = GER
	}

	add_equipment_to_stockpile = {
		type = infantry_weapons3			#AK-103
		amount = 300
		producer = SOV
	}

	add_equipment_to_stockpile = {
		type = infantry_weapons1			#Zastava M70/M72
		amount = 300
		producer = SER
	}

	add_equipment_to_stockpile = {
		type = infantry_weapons4			#T-91
		amount = 300
		producer = TAI
	}

	add_equipment_to_stockpile = {
		type = MBT_2			#M-84
		amount = 87
		producer = SER
	}

	add_equipment_to_stockpile = {
		type = MBT_2			#AMX-30
		amount = 52
		producer = FRA
	}

	add_equipment_to_stockpile = {
		type = MBT_1			#M60A3
		#version_name = "M60A3"
		amount = 45
		producer = USA
	}

	add_equipment_to_stockpile = {
		type = MBT_1			#T-55
		amount = 150
		producer = SOV
	}

	add_equipment_to_stockpile = {
		type = IFV_2			#AMX-10P
		amount = 25
		producer = FRA
	}

	add_equipment_to_stockpile = {
		type = IFV_3			#BVP M-80
		amount = 103
		producer = SER
	}

	add_equipment_to_stockpile = {
		type = APC_3			#BOV-VP
		amount = 42
		producer = SER
	}

	add_equipment_to_stockpile = {
		type = APC_3			#BTR-70
		amount = 3
		producer = SOV
	}

	add_equipment_to_stockpile = {
		type = artillery_0			#D-30
		amount = 277
		producer = SOV
	}

	add_equipment_to_stockpile = {
		type = SP_arty_0			#2S1 Gvozdika
		#version_name = "2S1 Gvozdika"
		amount = 24
		producer = SOV
	}

	add_equipment_to_stockpile = {
		type = SP_R_arty_0			#2S1 Gvozdika
		amount = 41
		producer = SOV
	}

	add_equipment_to_stockpile = {
		type = SP_R_arty_0			#M-63 PLamen
		amount = 27
		producer = SER
	}

	add_equipment_to_stockpile = {
		type = SP_R_arty_1			#M-77 Oganj
		amount = 34
		producer = SER
	}

	add_equipment_to_stockpile = {
		type = SP_R_arty_1			#M-63 PLamen
		amount = 34
		producer = SER
	}

	add_equipment_to_stockpile = {
		type = Heavy_Anti_tank_0				#AT-3 Sagger
		amount = 260
		producer = SOV
	}

	add_equipment_to_stockpile = {
		type = Anti_tank_1				#AT-4 Spigot
		amount = 52
		producer = SOV
	}

	add_equipment_to_stockpile = {
		type = Anti_tank_1				#MILAN
		amount = 840
		producer = FRA
	}

	add_equipment_to_stockpile = {
		type = Anti_Air_0				#SA-7
		amount = 200
		producer = SOV
	}

	add_equipment_to_stockpile = {
		type = Anti_Air_1				#SA-16
		amount = 200
		producer = SOV
	}

	add_equipment_to_stockpile = {
		type = util_vehicle_1		#Mercedez Benz G-270
		amount = 33
		producer = GER
	}

	add_equipment_to_stockpile = {
		type = command_control_equipment
		amount = 250
		producer = SOV
	}

	add_equipment_to_stockpile = {
		type = util_vehicle_0
		amount = 200
		producer = SOV
	}
}