﻿capital = 557
2000.1.1 = {
	set_country_flag = dynamic_flag
	set_country_flag = dynamic_rebel_flag
	set_country_flag = IRQ_autonomous_kurdistan
	set_variable = { gdp_per_capita = 8.780 }
	add_to_variable = { var = IRQ_saddam_pissboy value = 0.12 }
	clamp_variable = { var = IRQ_saddam_pissboy min = 0 max = 0.50 }
	if = {
		limit = { has_dlc = "No Step Back" }
		set_oob = "IRQ_2000_nsb"
		else = {
			set_oob = "IRQ_2000_nonnsb"
		}
	}

	if = {
		limit = { has_dlc = "By Blood Alone" }
		set_air_oob = "IRQ_2000_bba"
		else = {
			set_air_oob = "IRQ_2000_nonbba"
		}
	}

	set_cosmetic_tag = IRQ_SADDAM
	set_country_flag = is_IRAQ

	add_ideas = {
		crippling_corruption
		export_economy
		stagnation
		defence_04
		edu_02
		health_02
		social_02
		bureau_04
		police_04
		draft_army
		volunteer_women
		sunni
		rentier_state
		multi_ethnic_state_idea
		shia_moderately_conservative_society
		youth_radicalization
		LoAS_member
		al_jazeera_allowed
		fossil_fuel_industry
		the_military
		oligarchs
		officer_advanced_training
		IRQ_recovering_from_the_gulf_war
		IRQ_MEK_bases
		IRQ_high_political_opposition
		IRQ_bastion_of_baathism
		IRQ_international_sanctions
	}

	add_dynamic_modifier = {
		modifier = IRQ_saddam_rage_idea
	}
	#CT
	set_country_flag = threat_level_moderate
	set_variable = { threat_level = 30 }
	set_variable = { radicalization = 20 }
	add_to_array = { global.ct_states = THIS }
	#Islamism
	set_variable = { social_conservatism_government = 50 }
	set_variable = { social_conservatism_society = 50 }
	set_country_flag = limited_alcohol
	set_country_flag = alcohol
	set_country_flag = relaxed_dress_code
	set_country_flag = same_sex_decriminalized
	#GCC
	add_to_array = { global.possible_gcc_members = THIS }
	#UAR
	add_to_array = { global.arabic_countries = THIS }	#From is_arabic_nation trigger

	### IRQ ###
	#Influence system
	init_influence = yes
	set_variable = { domestic_influence_amount = 180 }
	add_to_array = { influence_array = SOV.id }
	add_to_array = { influence_array_val = 65 }
	add_to_array = { influence_array = PER.id }
	add_to_array = { influence_array_val = 44 }
	add_to_array = { influence_array = SYR.id }
	add_to_array = { influence_array_val = 9 }
	add_to_array = { influence_array = TUR.id }
	add_to_array = { influence_array_val = 17 }
	add_to_array = { influence_array = SAU.id }
	add_to_array = { influence_array_val = 12 }
	startup_influence = yes

	set_variable = { var = debt value = 54.159 }
	set_variable = { var = treasury value = 10 }
	set_variable = { var = corporate_tax_rate value = 14 }
	set_variable = { var = population_tax_rate value = 12 }
	set_variable = { var = int_investments value = 0 }


	set_technology = {
		integrated_transportation_system = 1
		post_conventional_rail = 1
		early_freight_locomotive = 1

		legacy_doctrines = 1
		superior_firepower = 1
		infantry_weapons = 1
		infantry_weapons1 = 1
		support_weapons = 1

		combat_eng_equipment = 1

		night_vision_1 = 1

		command_control_equipment = 1

		util_vehicle_0 = 1

		Anti_tank_0 = 1
		Heavy_Anti_tank_0 = 1
		Anti_Air_0 = 1
		SP_Anti_Air_0 = 1

		landing_craft = 1
		camouflage = 1
		camouflage2 = 1

		basic_computing = 1
		integrated_circuit = 1
		computing1 = 1
		decryption1 = 1
		encryption1 = 1
		radar = 1
		internet1 = 1 	#1G
		fuel_silos = 1

		industrial_electrospun_polymeric_nanofibers = 1
		stereolitography = 1
		fuel_refining = 1
		construction1 = 1

		early_helicopter = 1

		transport_helicopter1 = 1
	}
	if = {
		limit = { has_dlc = "No Step Back" }

		set_technology = {
			mbt_tech = 1
			mbt_tech_1 = 1
			tank_components_tech = 1
			tank_components_tech_2 = 1
			small_medium_gun_tech = 1
			medium_gun_tech = 1
			armor_tech = 1
			era_tech = 1
			diesel_engine_tech = 1
			diesel_engine_tech_2 = 1
			afv_tech = 1
			nsb_artillery_0 = 1
			nsb_SP_arty_1 = 1
			nsb_SP_arty_2 = 1
			nsb_Anti_Air_0 = 1
			nsb_SP_Anti_Air_0 = 1
			light_tank_tech = 1
		}
	}
	if = {
		limit = { NOT = { has_dlc = "No Step Back" } }

		set_technology = {
			MBT_1 = 1
			MBT_2 = 1
			Early_APC = 1 #Vehicle Design
			APC_1 = 1
			IFV_1 = 1
			artillery_0 = 1
			SP_arty_0 = 1
			SP_arty_1 = 1
			SP_R_arty_0 = 1
			SP_R_arty_1 = 1
			Anti_Air_0 = 1
			SP_Anti_Air_0 = 1
			Rec_tank_0 = 1
		}
	}
	#Air variants
	if = {
		limit = { has_dlc = "By Blood Alone" }

		set_technology = {

			early_airframe_designs = 1

			flying_wing_design = 1

			refueling_1 = 1

			avionics_1 = 1

			drone_1 = 1
			suicide_drone_1 = 1

			awacs_1 = 1

			redundant_1 = 1

			early_weapons = 1
			countermeasures_1 = 1
		}

		else = {
			set_technology = {

				early_fighter = 1

				MR_Fighter1 = 1

				AS_Fighter1 = 1

				transport_plane1 = 1
			}
		}
	}
	set_popularities = {
		democratic = 8.0
		communism = 28.0
		fascism = 8.0
		neutrality = 4.0
		nationalist = 52.0
	}
	set_politics = {
		ruling_party = nationalist
		last_election = "1999.4.30"
		election_frequency = 48
		elections_allowed = no
	}

	start_politics_input = yes

	### Party Popularities
	set_variable = { party_pop_array^0 = 0 } #Western_Autocracy
	set_variable = { party_pop_array^1 = 0.05 } #conservatism
	set_variable = { party_pop_array^2 = 0.03 } #liberalism
	set_variable = { party_pop_array^3 = 0 } #socialism
	set_variable = { party_pop_array^4 = 0 } #Communist-State
	set_variable = { party_pop_array^5 = 0 } #anarchist_communism
	set_variable = { party_pop_array^6 = 0.14 } #Conservative
	set_variable = { party_pop_array^7 = 0 } #Autocracy
	set_variable = { party_pop_array^8 = 0.07 } #Mod_Vilayat_e_Faqih
	set_variable = { party_pop_array^9 = 0.07 } #Vilayat_e_Faqih
	set_variable = { party_pop_array^10 = 0 } #Kingdom
	set_variable = { party_pop_array^11 = 0.08 } #Caliphate
	set_variable = { party_pop_array^12 = 0.01 } #Neutral_Muslim_Brotherhood
	set_variable = { party_pop_array^13 = 0 } #Neutral_Autocracy
	set_variable = { party_pop_array^14 = 0 } #Neutral_conservatism
	set_variable = { party_pop_array^15 = 0 } #oligarchism
	set_variable = { party_pop_array^16 = 0 } #Neutral_Libertarian
	set_variable = { party_pop_array^17 = 0 } #Neutral_green
	set_variable = { party_pop_array^18 = 0 } #neutral_Social
	set_variable = { party_pop_array^19 = 0.03 } #Neutral_Communism
	set_variable = { party_pop_array^20 = 0 } #Nat_Populism
	set_variable = { party_pop_array^21 = 0.52 } #Nat_Fascism
	set_variable = { party_pop_array^22 = 0.05 } #Nat_Autocracy
	set_variable = { party_pop_array^23 = 0 } #Monarchist

	### Ruling Party
	add_to_array = { ruling_party = 21 }

	startup_politics = yes

	create_country_leader = {
		name = "Saddam Hussein"
		picture = "saddam_hussein.dds"
		expire = "2010.1.1"
		ideology = Nat_Fascism
		traits = {
			military_career
			nationalist_Nat_Populism
			ruthless
			sly
		}
	}
	every_controlled_state = {
		set_variable = { productivity_state_var = 510 }
	}
	set_variable = { overall_productivity = 510 }

	recruit_character = IRQ_izzat_ibrahim_al_douri
	recruit_character = IRQ_sultan_hashim_ahmad_al_tai
	recruit_character = IRQ_maher_abd_al_rashid
	recruit_character = IRQ_ali_hassan_al_majid
	recruit_character = IRQ_hamid_raja_shalah
	recruit_character = IRQ_mehnaz_bezazi
	recruit_character = IRQ_mahmoud_atai
	# 2017 Generals (Hidden)
	recruit_character = IRQ_othman_ghanimi
	recruit_character = IRQ_babaker_zebari
	recruit_character = IRQ_fadhil_barwari
	recruit_character = IRQ_nazal_qassim
	recruit_character = IRQ_abud_qanbar
	recruit_character = IRQ_othman_farhood
	recruit_character = IRQ_najah_al_shammari
	# Shi'ite Militia Generals
	recruit_character = IRQ_abu_ala_al_walai
	recruit_character = IRQ_akram_al_kaabi
	recruit_character = qais_al_khazali
	recruit_character = abu_qadir
}

2003.1.1 = {
	kill_country_leader = yes
}

2017.1.1 = {
	set_cosmetic_tag = IRQ_NEW
	set_country_flag = dynamic_flag_new
	capital = 557
	if = {
		limit = { has_dlc = "No Step Back" }
		set_oob = "IRQ_2000_nsb"
		else = {
			set_oob = "IRQ_2017_nonnsb"
		}
	}



	# Starting tech
	set_technology = {
		legacy_doctrines = 1
		superior_firepower = 1

		infantry_weapons = 1
		infantry_weapons1 = 1

		combat_eng_equipment = 1

		night_vision_1 = 1
		night_vision_2 = 1

		command_control_equipment = 1

		land_Drone_equipment = 1

		Rec_tank_0 = 1

		util_vehicle_0 = 1

		artillery_0 = 1
		SP_arty_0 = 1
		SP_R_arty_0 = 1

		Anti_tank_0 = 1
		Heavy_Anti_tank_0 = 1

		Anti_Air_0 = 1
		SP_Anti_Air_0 = 1

		early_fighter = 1
		Strike_fighter1 = 1

		MR_Fighter1 = 1
		MR_Fighter2 = 1

		AS_Fighter1 = 1

		L_Strike_fighter1 = 1

		corvette_1 = 1
		diesel_attack_submarine_1 = 1

		early_helicopter = 1

		landing_craft = 1

		body_armor_1980 = 1

		microprocessors = 1
		computing2 = 1
		decryption2 = 1
		encryption2 = 1
		computing3 = 1
		decryption3 = 1
		encryption3 = 1
		DNA_fingerprinting = 1

		internet2 = 1 	#2G
	}

	if = {
		limit = { has_dlc = "No Step Back" }

		set_technology = {
			nsb_attack_helicopter_tech_1 = 1
		}

		else = {
			set_technology = {
				attack_helicopter1 = 1
			}
		}
	}

	remove_ideas = {
		stagnation
		draft_army
		sunni
		al_jazeera_allowed
		the_military
	}
	add_ideas = {
		al_jazeera_banned
		sadrist_militias
		iranian_quds_force
		iranian_aid
		USA_usaid
		Inherent_Resolve
		volunteer_army
		shia
	}

	#CT
	clr_country_flag = threat_level_moderate
	set_country_flag = threat_level_critical
	set_variable = { threat_level = 85 }
	set_variable = { radicalization = 45 }

	### IRQ ###
	#Influence system
	init_influence = yes
	set_variable = { domestic_influence_amount = 45 }
	add_to_array = { influence_array = USA.id }
	add_to_array = { influence_array_val = 80 }
	add_to_array = { influence_array = ENG.id }
	add_to_array = { influence_array_val = 24 }
	add_to_array = { influence_array = SOV.id }
	add_to_array = { influence_array_val = 45 }
	add_to_array = { influence_array = PER.id }
	add_to_array = { influence_array_val = 140 }
	add_to_array = { influence_array = SYR.id }
	add_to_array = { influence_array_val = 20 }
	add_to_array = { influence_array = TUR.id }
	add_to_array = { influence_array_val = 3 }
	add_to_array = { influence_array = SAU.id }
	add_to_array = { influence_array_val = 1 }
	startup_influence = yes

	set_country_flag = Major_Importer_US_Arms #Trends-in-international-arms-transfers-2016.pdf
	set_variable = { fossil_fuel_industry_opinion = 80 }
	set_variable = { the_military_opinion = 60 }

	set_variable = { var = debt value = 288 }
	set_variable = { var = treasury value = 44.87 }
	set_variable = { var = int_investments value = 0.9 }
	set_variable = { var = corporate_tax_rate value = 14 }
	set_variable = { var = population_tax_rate value = 12 }

	give_military_access = FRA

	remove_opinion_modifier = { target = PER modifier = oppresses_sunni }
	add_opinion_modifier = { target = PER modifier = resistance_axis }
	add_opinion_modifier = { target = SYR modifier = resistance_axis }

	add_opinion_modifier = { target = KUR modifier = IRQ_Dont_Support_Kurdish_Independence }
	add_opinion_modifier = { target = ROJ modifier = IRQ_Dont_Support_Kurdish_Independence }

	diplomatic_relation = {
		country = SYR
		relation = military_access
		active = yes
	}

	set_popularities = {
		democratic = 16.3
		communism = 40.2
		fascism = 5.0
		neutrality = 24.4
		nationalist = 14.1
	}
	set_politics = {
		ruling_party = communism
		last_election = "2014.4.30"
		election_frequency = 48
		elections_allowed = yes
	}

	start_politics_input = yes

	### Party Popularities
	set_variable = { party_pop_array^0 = 0 } #Western_Autocracy
	set_variable = { party_pop_array^1 = 0.06 } #conservatism
	set_variable = { party_pop_array^2 = 0.063 } #liberalism
	set_variable = { party_pop_array^3 = 0.04 } #socialism
	set_variable = { party_pop_array^4 = 0 } #Communist-State
	set_variable = { party_pop_array^5 = 0.03 } #anarchist_communism
	set_variable = { party_pop_array^6 = 0.115 } #Conservative
	set_variable = { party_pop_array^7 = 0 } #Autocracy
	set_variable = { party_pop_array^8 = 0.107 } #Mod_Vilayat_e_Faqih
	set_variable = { party_pop_array^9 = 0.15 } #Vilayat_e_Faqih
	set_variable = { party_pop_array^10 = 0 } #Kingdom
	set_variable = { party_pop_array^11 = 0.05 } #Caliphate
	set_variable = { party_pop_array^12 = 0.084 } #Neutral_Muslim_Brotherhood
	set_variable = { party_pop_array^13 = 0 } #Neutral_Autocracy
	set_variable = { party_pop_array^14 = 0.13 } #Neutral_conservatism
	set_variable = { party_pop_array^15 = 0 } #oligarchism
	set_variable = { party_pop_array^16 = 0 } #Neutral_Libertarian
	set_variable = { party_pop_array^17 = 0 } #Neutral_green
	set_variable = { party_pop_array^18 = 0 } #neutral_Social
	set_variable = { party_pop_array^19 = 0.03 } #Neutral_Communism
	set_variable = { party_pop_array^20 = 0.141 } #Nat_Populism
	set_variable = { party_pop_array^21 = 0 } #Nat_Fascism
	set_variable = { party_pop_array^22 = 0 } #Nat_Autocracy
	set_variable = { party_pop_array^23 = 0 } #Monarchist

	### Ruling Party
	add_to_array = { ruling_party = 14 }

	startup_politics = yes

	create_country_leader = {
		name = "Haider al-Abadi"
		picture = "Haider_al-Abadi.dds"
		expire = "2050.1.1"
		ideology = Conservative
		traits = {
			emerging_Conservative
		}
	}

	retire_character = IRQ_izzat_ibrahim_al_douri
	retire_character = IRQ_raad_al_hamdani
	retire_character = IRQ_maher_abd_al_rashid
	retire_character = IRQ_ayad_futayyih_al_rawi
	retire_character = IRQ_hamid_raja_shalah

	recruit_character = IRQ_othman_ghanimi
	recruit_character = IRQ_babaker_zebari
	recruit_character = IRQ_fadhil_barwari
	recruit_character = IRQ_nazal_qassim
	recruit_character = IRQ_abud_qanbar
	recruit_character = IRQ_othman_farhood
}