ETH_eritrea_border_conflicts = {
	allowed = { original_tag = ETH }
	enable = {
		country_exists = ERI
		has_opinion_modifier = ERI_Border_Disputes
	}
	abort_when_not_enabled = yes

	ai_strategy = { type = antagonize id = "ERI" value = 100 }
	ai_strategy = { type = contain id = "ERI" value = 100 }
	ai_strategy = { type = conquer id = "ERI" value = 100 }
}

ETH_support_sudanese_rebels = {
	allowed = { original_tag = ETH has_start_date > 2016.1.1 }
	enable = {
		country_exists = SRF
		NOT = { has_war_with = SRF }
	}
	abort_when_not_enabled = yes

	ai_strategy = { type = befriend id = "SRF" value = 50 }
	ai_strategy = { type = protect id = "SRF" value = 50 }
	ai_strategy = { type = influence id = "SRF" value = 50 }
	ai_strategy = { type = support id = "SRF" value = 50 }
}

ETH_support_somalia_against_SHB = {
	allowed = { original_tag = ETH }
	enable = {
		country_exists = SHB
		SHB = { has_war_with = SOM }
	}
	abort_when_not_enabled = yes

	ai_strategy = { type = befriend id = "SOM" value = 75 }
	ai_strategy = { type = support id = "SOM" value = 75 }
	ai_strategy = { type = send_volunteers_desire id = "SOM" value = 100 }
}
