ideas = {

	country = {
		AU_member = { # AFRICAN UNION
			picture = AU_member
			on_add = {
				log = "[GetDateText]: [Root.GetName]: add idea AU_member"
				add_to_array = { global.AU_member = THIS }
			}
			on_remove = {
				log = "[GetDateText]: [Root.GetName]: remove idea AU_member"
				remove_from_array = { global.AU_member = THIS }
			}
			allowed = {
				is_african_nation = yes
			}
			allowed_civil_war = {
				no_jihadist_government = yes
			}
			cancel = {
				jihadist_government = yes
			}

			modifier = {
				political_power_gain = 0.20
				stability_factor = 0.05
			}
		}
		ecowas_member_state = { # ECOWAS
			on_add = {
				log = "[GetDateText]: [Root.GetName]: add idea ecowas_member_state"
				add_to_array = { global.ECOWAS_member = THIS }
			}
			on_remove = {
				log = "[GetDateText]: [Root.GetName]: remove idea ecowas_member_state"
				remove_from_array = { global.ECOWAS_member = THIS }
			}
			picture = ECOWAS
			allowed = { always = no }
			modifier = {
				political_power_gain = 0.15
			}
		}
		blood_diamond_trade = {
			on_add = { log = "[GetDateText]: [Root.GetName]: add idea blood_diamond_trade" }
			allowed = {
				OR = {
					original_tag = SIE
					original_tag = AFR
				}
			}
			allowed_civil_war = { always = yes }
			modifier = {
				political_power_gain = -0.25
				stability_factor = 0.10
				corruption_cost_factor = 0.50
				custom_modifier_tooltip = blood_diamond_trade_idea_TT
			}
		}

		CAR_central_bush_republic_war_idea = {
			on_add = { log = "[GetDateText]: [Root.GetName]: add idea CAR_central_bush_republic_war" }
			allowed = { original_tag = CAR }
			allowed_civil_war = { always = yes }

			picture = car_bush_war_icon
			modifier = {
				political_power_gain = -0.15
				stability_factor = -0.10
			}
		}

		AFRICA_idea_tuareg_rebellion = {
			on_add = { log = "[GetDateText]: [Root.GetName]: add idea AFRICA_idea_tuareg_rebellion" }
			picture = hutu_tutsi_tensions

			modifier = {
				police_cost_multiplier_modifier = 0.15
				resource_export_multiplier_modifier = -0.25
				population_tax_income_multiplier_modifier = -0.15
				stability_factor = -0.05
			}
		}
	}
}
