state = {
	id = 1123
	name = "STATE_1123"
	history = {
		owner = IRQ
		victory_points = {
			2004 5
		}
		victory_points = {
			8001 5
		}
		victory_points = {
			14951 1
		}
		buildings = {
			infrastructure = 1
			internet_station = 1
			offices = 1
		}
		add_core_of = IRQ
	}

	provinces = {
		2004 8001 12726 14518 14951
	}
	manpower = 1863587
	buildings_max_level_factor = 1.000
	state_category = state_03
}
