
strategic_region={
	id=137
	name="STRATEGICREGION_137"
	provinces={
		483 661 756 798 1216 1459 1479 1483 1532 1554 1573 1576 1593 1614 1623 1632 1649 1721 1919 2058 3007 3067 3085 3163 3551 3641 3662 3737 3798 4300 4374 4467 4482 4492 4549 4563 4578 4581 4629 4636 4638 4686 4773 4958 5003 7477 7491 7507 7541 7560 7563 7597 7600 7618 7635 7639 7682 7775 7777 7924 8099 9605 10148 10187 10205 10353 10357 10359 10395 10414 10435 10470 10485 10488 10510 10530 10601 10603 10660 10671 10742 11687 12161 12233 12239 12324 12329 12333 12385 12397 12465 12471 12491 12640 12658 12722 13215 13216 13217 13219 13220 13221 13222 13224 13225 14059 14060 14134 14135 14136 14205 14291 14292 14293 14345 14346 14368 14369 14370 14375 14376 14921 14922
	}
	weather={
		period={
			between={ 0.0 30.0 }
			temperature={ -4.0 6.0 }
			#temperature_day_night={ 8.0 -8.0 }
			no_phenomenon=0.800
			rain_light=0.000
			rain_heavy=0.000
			snow=0.200
			blizzard=0.000
			arctic_water=0.000
			mud=1.000
			sandstorm=0.000
			min_snow_level=0.000
		}
		period={
			between={ 0.1 27.1 }
			temperature={ -2.0 9.0 }
			#temperature_day_night={ 8.0 -8.0 }
			no_phenomenon=0.800
			rain_light=0.000
			rain_heavy=0.000
			snow=0.200
			blizzard=0.000
			arctic_water=0.000
			mud=1.000
			sandstorm=0.000
			min_snow_level=0.000
		}
		period={
			between={ 0.2 30.2 }
			temperature={ 7.0 10.0 }
			#temperature_day_night={ 8.0 -8.0 }
			no_phenomenon=0.850
			rain_light=0.050
			rain_heavy=0.000
			snow=0.050
			blizzard=0.050
			arctic_water=0.000
			mud=1.000
			sandstorm=0.000
			min_snow_level=0.000
		}
		period={
			between={ 0.3 29.3 }
			temperature={ 15.0 17.0 }
			#temperature_day_night={ 8.0 -8.0 }
			no_phenomenon=0.850
			rain_light=0.100
			rain_heavy=0.050
			snow=0.000
			blizzard=0.000
			arctic_water=0.000
			mud=1.000
			sandstorm=0.000
			min_snow_level=0.000
		}
		period={
			between={ 0.4 30.4 }
			temperature={ 19.0 22.0 }
			#temperature_day_night={ 8.0 -8.0 }
			no_phenomenon=0.750
			rain_light=0.100
			rain_heavy=0.150
			snow=0.000
			blizzard=0.000
			arctic_water=0.000
			mud=1.000
			sandstorm=0.000
			min_snow_level=0.000
		}
		period={
			between={ 0.5 29.5 }
			temperature={ 23.0 27.0 }
			#temperature_day_night={ 8.0 -8.0 }
			no_phenomenon=0.650
			rain_light=0.100
			rain_heavy=0.250
			snow=0.000
			blizzard=0.000
			arctic_water=0.000
			mud=1.000
			sandstorm=0.000
			min_snow_level=0.000
		}
		period={
			between={ 0.6 30.6 }
			temperature={ 24.0 32.0 }
			#temperature_day_night={ 8.0 -8.0 }
			no_phenomenon=0.800
			rain_light=0.000
			rain_heavy=0.000
			snow=0.000
			blizzard=0.000
			arctic_water=0.000
			mud=1.000
			sandstorm=0.100
			min_snow_level=0.000
		}
		period={
			between={ 0.7 30.7 }
			temperature={ 24.0 38.0 }
			#temperature_day_night={ 8.0 -8.0 }
			no_phenomenon=0.800
			rain_light=0.000
			rain_heavy=0.000
			snow=0.000
			blizzard=0.000
			arctic_water=0.000
			mud=1.000
			sandstorm=0.100
			min_snow_level=0.000
		}
		period={
			between={ 0.8 29.8 }
			temperature={ 19.0 35.0 }
			#temperature_day_night={ 8.0 -8.0 }
			no_phenomenon=0.800
			rain_light=0.000
			rain_heavy=0.000
			snow=0.000
			blizzard=0.000
			arctic_water=0.000
			mud=1.000
			sandstorm=0.100
			min_snow_level=0.000
		}
		period={
			between={ 0.9 30.9 }
			temperature={ 12.0 25.0 }
			#temperature_day_night={ 8.0 -8.0 }
			no_phenomenon=0.900
			rain_light=0.000
			rain_heavy=0.000
			snow=0.000
			blizzard=0.000
			arctic_water=0.000
			mud=1.000
			sandstorm=0.050
			min_snow_level=0.000
		}
		period={
			between={ 0.10 29.10 }
			temperature={ 6.0 14.0 }
			#temperature_day_night={ 8.0 -8.0 }
			no_phenomenon=0.900
			rain_light=0.050
			rain_heavy=0.000
			snow=0.050
			blizzard=0.000
			arctic_water=0.000
			mud=1.000
			sandstorm=0.000
			min_snow_level=0.000
		}
		period={
			between={ 0.11 30.11 }
			temperature={ -1.0 6.0 }
			#temperature_day_night={ 6.0 -6.0 }
			no_phenomenon=0.850
			rain_light=0.000
			rain_heavy=0.000
			snow=0.150
			blizzard=0.000
			arctic_water=0.000
			mud=1.000
			sandstorm=0.000
			min_snow_level=0.000
		}
	}
}
