ideas = {
	country = {

		TUR_guards_of_kemalism = {
			on_add = { log = "[GetDateText]: [Root.GetName]: add idea TUR_guards_of_kemalism" }
			picture = kemalist_army_officers_powerful_neutral
			allowed = {
				original_tag = TUR
			}

			allowed_civil_war = {
				NOT = { has_government = fascism }
			}

			on_remove = {
				if = {
					limit = { NOT = { has_country_flag = TUR_military_peacefully_removed } }
					country_event = { id = Turkey.11 }
				}
			}

			cancel = {
				NOT = { has_idea = the_military }
			}

			modifier = {
				stability_factor = 0.05
				fascism_drift = -0.05
				nationalist_drift = -0.03
				democratic_drift = 0.03
			}
		}
		TUR_kurdish_trouble = {
			on_add = { log = "[GetDateText]: [Root.GetName]: add idea TUR_kurdish_trouble" }
			name = TUR_kurdish_trouble_name
			picture = sectarian_troubles_kurdistan
			allowed = {
				original_tag = TUR
			}
			allowed_civil_war = {
				always = yes
			}
			modifier = {
				non_core_manpower = -0.075
				war_support_factor = -0.20
				resistance_growth = 0.15
				conscription_factor = -0.10
			}
		}
		TUR_kurdish_trouble2 = {
			on_add = { log = "[GetDateText]: [Root.GetName]: add idea TUR_kurdish_trouble2" }
			name = TUR_kurdish_trouble_name
			picture = sectarian_troubles_kurdistan
			allowed = {
				original_tag = TUR
			}
			allowed_civil_war = {
				always = yes
			}
			modifier = {
				non_core_manpower = -0.065
				war_support_factor = -0.15
				resistance_growth = 0.10
				conscription_factor = -0.05
			}
		}
		#
		TUR_kurdish_trouble3 = { #MEDIATION
			on_add = { log = "[GetDateText]: [Root.GetName]: add idea TUR_kurdish_trouble3" }
			name = TUR_kurdish_trouble3_name
			picture = sectarian_troubles_kurdistan
			allowed = {
				original_tag = TUR
			}
			allowed_civil_war = {
				always = yes
			}
			modifier = {
				non_core_manpower = -0.055
				war_support_factor = -0.10
				resistance_growth = 0.05
				conscription_factor = -0.05
			}
		}
		TUR_kurdish_trouble4 = { #MEDIATION
			on_add = { log = "[GetDateText]: [Root.GetName]: add idea TUR_kurdish_trouble4" }
			name = TUR_kurdish_trouble3_name
			picture = sectarian_troubles_kurdistan
			allowed = {
				original_tag = TUR
			}
			allowed_civil_war = {
				always = yes
			}
			modifier = {
				non_core_manpower = -0.035
				war_support_factor = -0.05
				resistance_growth = 0.05
			}
		}
		###
		TUR_kurdish_trouble5 = { #ENDLESS WAR
			on_add = { log = "[GetDateText]: [Root.GetName]: add idea TUR_kurdish_trouble5" }
			name = TUR_kurdish_trouble5_name
			picture = sectarian_troubles_kurdistan
			allowed = {
				original_tag = TUR
			}
			allowed_civil_war = {
				always = yes
			}
			modifier = {
				war_support_factor = -0.15
				resistance_growth = 0.10
				conscription_factor = -0.05
			}
		}
		TUR_kurdish_trouble6 = { #ENDLESS WAR
			on_add = { log = "[GetDateText]: [Root.GetName]: add idea TUR_kurdish_trouble6" }
			name = TUR_kurdish_trouble5_name
			picture = sectarian_troubles_kurdistan
			allowed = {
				original_tag = TUR
			}
			allowed_civil_war = {
				always = yes
			}
			modifier = {
				war_support_factor = -0.05
				resistance_growth = 0.15
				conscription_factor = -0.05
			}
		}
		TUR_kurdish_trouble7 = { #ENDLESS WAR
			on_add = { log = "[GetDateText]: [Root.GetName]: add idea TUR_kurdish_trouble7" }
			name = TUR_kurdish_trouble5_name
			picture = sectarian_troubles_kurdistan
			allowed = {
				original_tag = TUR
			}
			allowed_civil_war = {
				always = yes
			}
			modifier = {
				non_core_manpower = 0.20
				resistance_growth = 0.15
				conscription_factor = 0.05
				stability_factor = -0.05
			}
		}
		#
		TUR_military_happy = {
			on_add = { log = "[GetDateText]: [Root.GetName]: add idea TUR_military_anger1" }
			picture = national_defenders
			allowed = {
				original_tag = TUR
			}

			allowed_civil_war = {
				always = yes
			}

			cancel = {
				NOT = { has_idea = the_military }
			}

			modifier = {
				army_attack_factor = 0.05
				army_defence_factor = 0.10
				military_industry_tax_modifier = 0.15
				stability_factor = 0.10
			}
		}
		#
		TUR_military_anger1 = {
			on_add = { log = "[GetDateText]: [Root.GetName]: add idea TUR_military_anger1" }
			picture = wargaming
			allowed = {
				original_tag = TUR
			}

			allowed_civil_war = {
				always = yes
			}

			cancel = {
				NOT = { has_idea = the_military }
			}

			modifier = {
				army_attack_factor = -0.10
				army_defence_factor = -0.10
			}
		}
		#
		TUR_military_anger2 = {
			on_add = { log = "[GetDateText]: [Root.GetName]: add idea TUR_military_anger1" }
			picture = army_problems
			allowed = {
				original_tag = TUR
			}

			allowed_civil_war = {
				always = yes
			}

			cancel = {
				NOT = { has_idea = the_military }
			}

			modifier = {
				army_attack_factor = -0.15
				army_defence_factor = -0.15
				army_speed_factor = -0.15
				army_org = -10
			}
		}
		#
		TUR_military_anger3 = {
			on_add = { log = "[GetDateText]: [Root.GetName]: add idea TUR_military_anger3" }
			picture = army_corruption
			allowed = {
				original_tag = TUR
			}

			allowed_civil_war = {
				always = yes
			}

			cancel = {
				NOT = { has_idea = the_military }
			}

			modifier = {
				army_attack_factor = -0.20
				army_defence_factor = -0.20
				army_speed_factor = -0.25
				army_org = -15
			}
		}
		#
		TUR_military_anger4 = {
			on_add = { log = "[GetDateText]: [Root.GetName]: add idea TUR_military_anger4" }
			picture = army_corruption2
			allowed = {
				original_tag = TUR
			}

			allowed_civil_war = {
				always = yes
			}

			cancel = {
				NOT = { has_idea = the_military }
			}

			modifier = {
				army_attack_factor = -0.30
				army_defence_factor = -0.30
				army_speed_factor = -0.30
				army_org = -20
				air_accidents_factor = 0.10
				air_agility_factor = -0.10
				air_weather_penalty = 0.15
			}
		}
		#
		TUR_military_anger5 = {
			on_add = { log = "[GetDateText]: [Root.GetName]: add idea TUR_military_anger5" }
			picture = army_corruption3
			allowed = {
				original_tag = TUR
			}

			allowed_civil_war = {
				always = yes
			}

			cancel = {
				NOT = { has_idea = the_military }
			}

			modifier = {
				army_attack_factor = -0.40
				army_defence_factor = -0.40
				army_speed_factor = -0.40
				army_org = -30
				air_accidents_factor = 0.20
				air_agility_factor = -0.20
				air_weather_penalty = 0.25
				stability_factor = -0.40
			}
		}
		#
		TUR_no_disasters_plan = {
			on_add = { log = "[GetDateText]: [Root.GetName]: add idea TUR_no_disasters_plan" }
			picture = risk_of_famine
			allowed = {
				original_tag = TUR
			}
			allowed_civil_war = {
				always = yes
			}
			modifier = {
				production_speed_buildings_factor = -0.20
				health_cost_multiplier_modifier = 0.20
			}
		}
		#
		TUR_charity_disasters = { #Charity Based Disaster Plan
			on_add = { log = "[GetDateText]: [Root.GetName]: add idea TUR_charity_disasters" }
			picture = resource_production
			allowed = {
				original_tag = TUR
			}
			allowed_civil_war = {
				always = yes
			}
			modifier = {
				production_speed_buildings_factor = -0.10
				health_cost_multiplier_modifier = -0.10
				industry_repair_factor = 0.10
			}
		}
		#
		TUR_government_led_disaster = { #Government Based Disaster Plan
			on_add = { log = "[GetDateText]: [Root.GetName]: add idea TUR_government_led_disaster" }
			picture = resource_production
			allowed = {
				original_tag = TUR
			}
			allowed_civil_war = {
				always = yes
			}
			modifier = {
				production_speed_buildings_factor = 0.15
				health_cost_multiplier_modifier = 0.10
				industry_repair_factor = 0.10
			}
		}
		#
		TUR_refugees_maintained = { #
			on_add = { log = "[GetDateText]: [Root.GetName]: add idea TUR_refugees_maintained" }
			picture = disjointed_government
			allowed = {
				original_tag = TUR
			}
			allowed_civil_war = {
				always = yes
			}
			modifier = {
				production_factory_efficiency_gain_factor = 0.10
				stability_factor = -0.02
				political_power_factor = -0.03
			}
		}
		#
		TUR_drug_problem = { #
			on_add = { log = "[GetDateText]: [Root.GetName]: add idea TUR_drug_problem" }
			picture = prisoners
			allowed = {
				original_tag = TUR
			}
			allowed_civil_war = {
				always = yes
			}
			modifier = {
				monthly_population = -0.05
				recruitable_population_factor = -0.15
			}
		}
		#
		TUR_drugs_legalized = { #
			on_add = { log = "[GetDateText]: [Root.GetName]: add idea TUR_drugs_legalized" }
			picture = international_treaty
			allowed = {
				original_tag = TUR
			}
			allowed_civil_war = {
				always = yes
			}
			modifier = {
				police_cost_multiplier_modifier = -0.05
				corruption_cost_factor = 0.10
			}
		}
		#
		TUR_drugs_illegalized = { #
			on_add = { log = "[GetDateText]: [Root.GetName]: add idea TUR_drugs_illegalized" }
			picture = prisoners
			allowed = {
				original_tag = TUR
			}
			allowed_civil_war = {
				always = yes
			}
			modifier = {
				police_cost_multiplier_modifier = 0.05
				corruption_cost_factor = -0.10
			}
		}
		#
		TUR_nationalist_advantage = { #
			on_add = { log = "[GetDateText]: [Root.GetName]: add idea TUR_nationalist_advantage" }
			picture = segregation
			allowed = {
				original_tag = TUR
			}
			allowed_civil_war = {
				always = yes
			}
			modifier = {
				nationalist_drift = 0.05
				nationalist_acceptance = 30
				war_support_factor = 0.10
			}
		}
		#
		TUR_tourism = { #
			on_add = { log = "[GetDateText]: [Root.GetName]: add idea TUR_tourism" }
			picture = planning_bonus
			allowed = {
				original_tag = TUR
			}
			allowed_civil_war = {
				always = yes
			}
			modifier = {
				production_speed_infrastructure_factor = 0.20
			}
		}
		#
		TUR_fight_nationalist = { #
			on_add = { log = "[GetDateText]: [Root.GetName]: add idea TUR_fight_nationalist" }
			picture = national_unity
			allowed = {
				original_tag = TUR
			}
			allowed_civil_war = {
				always = yes
			}
			modifier = {
				nationalist_acceptance = -30
				nationalist_drift = -0.05
				democratic_drift = 0.05
				neutrality_drift = 0.05
			}
		}
		#
		TUR_mit_reformed = { #
			on_add = { log = "[GetDateText]: [Root.GetName]: add idea TUR_mit_reformed" }
			picture = propaganda
			allowed = {
				original_tag = TUR
			}
			allowed_civil_war = {
				always = yes
			}
			modifier = {
				drift_defence_factor = -0.05
				foreign_influence_defense_modifier = 0.15
			}
		}
		#
		TUR_mit_emboldened = { #
			on_add = { log = "[GetDateText]: [Root.GetName]: add idea TUR_mit_emboldened" }
			picture = propaganda
			allowed = {
				original_tag = TUR
			}
			allowed_civil_war = {
				always = yes
			}
			modifier = {
				drift_defence_factor = 0.15
				foreign_influence_defense_modifier = -0.05
			}
		}
		#
		TUR_mafia_active = {
			on_add = { log = "[GetDateText]: [Root.GetName]: add idea TUR_mafia_active" }
			picture = firearm_wall_sheep
			allowed = {
				original_tag = TUR
			}
			allowed_civil_war = {
				always = yes
			}
			modifier = {
				stability_factor = -0.05
				equipment_capture_factor = -0.35
				tax_gain_multiplier_modifier = -0.20
			}
		}
		#
		TUR_mafia_active2 = {
			on_add = { log = "[GetDateText]: [Root.GetName]: add idea TUR_mafia_active2" }
			picture = firearm_wall_sheep
			allowed = {
				original_tag = TUR
			}
			allowed_civil_war = {
				always = yes
			}
			modifier = {
				stability_factor = -0.05
				equipment_capture_factor = -0.20
				tax_gain_multiplier_modifier = -0.15
			}
		}
		#
		TUR_mafia_weakened = {
			on_add = { log = "[GetDateText]: [Root.GetName]: add idea TUR_mafia_weakened" }
			picture = firearm_wall_sheep
			allowed = {
				original_tag = TUR
			}
			allowed_civil_war = {
				always = yes
			}
			modifier = {
				stability_factor = -0.03
				equipment_capture_factor = -0.15
				tax_gain_multiplier_modifier = -0.10
			}
		}
		#
		TUR_mafia_weak = {
			on_add = { log = "[GetDateText]: [Root.GetName]: add idea TUR_mafia_weak" }
			picture = firearm_wall_sheep
			allowed = {
				original_tag = TUR
			}
			allowed_civil_war = {
				always = yes
			}
			modifier = {
				equipment_capture_factor = -0.10
				tax_gain_multiplier_modifier = -0.05
			}
		}
		#
		TUR_pkk_legalized = {
			on_add = { log = "[GetDateText]: [Root.GetName]: add idea TUR_pkk_legalized" }
			picture = fire
			allowed = {
				original_tag = TUR
			}
			allowed_civil_war = {
				always = yes
			}
			cancel = {
				neutrality_neutral_oligarch_are_in_power = yes
			}
			modifier = {
				production_speed_buildings_factor = -0.40
				production_factory_start_efficiency_factor = -0.40
				local_resources_factor = -0.20
				political_power_factor = -0.30
			}
		}
		#
		TUR_attacking_mafia1 = {
			on_add = { log = "[GetDateText]: [Root.GetName]: add idea TUR_attacking_mafia1" }
			picture = roit_police_idea
			allowed = {
				original_tag = TUR
			}
			allowed_civil_war = {
				always = yes
			}
			cancel = {
				neutrality_neutral_oligarch_are_in_power = yes
			}
			modifier = {
				police_cost_multiplier_modifier = -0.05
				industry_free_repair_factor = 0.10
				corruption_cost_factor = -0.10
			}
		}
		#
		TUR_attacking_mafia2 = {
			on_add = { log = "[GetDateText]: [Root.GetName]: add idea TUR_attacking_mafia2" }
			picture = roit_police_idea
			allowed = {
				original_tag = TUR
			}
			cancel = {
				neutrality_neutral_oligarch_are_in_power = yes
			}
			allowed_civil_war = {
				always = yes
			}
			modifier = {
				police_cost_multiplier_modifier = -0.10
				industry_free_repair_factor = 0.20
				corruption_cost_factor = -0.15
			}
		}
		#
		TUR_belgian_workers = { #Mafia idea
			on_add = { log = "[GetDateText]: [Root.GetName]: add idea TUR_belgian_workers" }
			picture = scientists_defect
			allowed = {
				original_tag = TUR
			}
			allowed_civil_war = {
				always = yes
			}
			modifier = {
				production_speed_industrial_complex_factor = 0.20
				production_speed_radar_station_factor = 0.20
				production_speed_arms_factory_factor = 0.20
			}
		}
		#
		TUR_tubitak_idea = {
			on_add = { log = "[GetDateText]: [Root.GetName]: add idea TUR_tubitak_idea" }
			name = TUR_tubitak_idea_name
			picture = tubitak_idea
			allowed = {
				original_tag = TUR
			}
			allowed_civil_war = {
				always = yes
			}
			modifier = {
				research_speed_factor = 0.05
				local_resources_factor = 0.05
				projects_cost_modifier = -0.10
			}
		}
		#
		TUR_tubitak_idea2 = {
			on_add = { log = "[GetDateText]: [Root.GetName]: add idea TUR_tubitak_idea2" }
			name = TUR_tubitak_idea_name
			picture = tubitak_idea
			allowed = {
				original_tag = TUR
			}
			allowed_civil_war = {
				always = yes
			}
			modifier = {
				fuel_gain_factor = 0.15
				local_resources_factor = 0.05
				research_speed_factor = 0.05
				projects_cost_modifier = -0.10
			}
		}
		#
		TUR_tubitak_idea3 = {
			on_add = { log = "[GetDateText]: [Root.GetName]: add idea TUR_tubitak_idea3" }
			name = TUR_tubitak_idea_name
			picture = tubitak_idea
			allowed = {
				original_tag = TUR
			}
			allowed_civil_war = {
				always = yes
			}
			modifier = {
				fuel_gain_factor = 0.15
				local_resources_factor = 0.05
				research_speed_factor = 0.10
				projects_cost_modifier = -0.15
				industrial_capacity_factory = 0.10
				global_building_slots_factor = 0.10
			}
		}
		#
		TUR_charity_led_plan = {
			on_add = { log = "[GetDateText]: [Root.GetName]: add idea TUR_charity_led_plan" }
			picture = inflation5
			allowed = {
				original_tag = TUR
			}
			allowed_civil_war = {
				always = yes
			}
			modifier = {
			}
		}
		#
		TUR_government_led_plan = {
			on_add = { log = "[GetDateText]: [Root.GetName]: add idea TUR_government_led_plan" }
			picture = inflation5
			allowed = {
				original_tag = TUR
			}
			allowed_civil_war = {
				always = yes
			}
			modifier = {
			}
		}
		#
		TUR_no_economic_plan = {
			on_add = { log = "[GetDateText]: [Root.GetName]: add idea TUR_no_economic_plan" }
			picture = turkey_collapse_of_econ
			allowed = {
				original_tag = TUR
			}
			allowed_civil_war = {
				always = yes
			}
			modifier = {
				stability_factor = -0.10
				production_speed_buildings_factor = -0.25
				tax_gain_multiplier_modifier = -0.05
				interest_rate_multiplier_modifier = 0.50
				projects_cost_modifier = 0.15
				local_resources_factor = -0.10
				consumer_goods_factor = 0.02
			}
		}
		TUR_economic_insecurity2 = {
			on_add = { log = "[GetDateText]: [Root.GetName]: add idea TUR_economic_insecurity2" }
			name = TUR_economic_insecurity_name
			picture = turkey_collapse_of_econ
			allowed = {
				original_tag = TUR
			}
			allowed_civil_war = {
				always = yes
			}
			modifier = {
				stability_factor = -0.10
				production_speed_buildings_factor = -0.20
				tax_gain_multiplier_modifier = -0.02
				interest_rate_multiplier_modifier = 0.30
				projects_cost_modifier = 0.10
				local_resources_factor = -0.05
				consumer_goods_factor = 0.02
			}
		}
		TUR_economic_insecurity3 = {
			on_add = { log = "[GetDateText]: [Root.GetName]: add idea TUR_economic_insecurity3" }
			name = TUR_economic_insecurity_name
			picture = turkey_collapse_of_econ
			allowed = {
				original_tag = TUR
			}
			allowed_civil_war = {
				always = yes
			}
			modifier = {
				stability_factor = -0.05
				production_speed_buildings_factor = -0.15
				tax_gain_multiplier_modifier = -0.01
				interest_rate_multiplier_modifier = 0.15
				projects_cost_modifier = 0.05
				consumer_goods_factor = 0.01
			}
		}
		TUR_economic_insecurity4 = {
			on_add = { log = "[GetDateText]: [Root.GetName]: add idea TUR_economic_insecurity4" }
			name = TUR_economic_insecurity_name
			picture = turkey_collapse_of_econ
			allowed = {
				original_tag = TUR
			}
			allowed_civil_war = {
				always = yes
			}
			modifier = {
				stability_factor = -0.02
				production_speed_buildings_factor = -0.05
				interest_rate_multiplier_modifier = 0.10
				projects_cost_modifier = 0.02
			}
		}
		TUR_economic_security = {
			on_add = { log = "[GetDateText]: [Root.GetName]: add idea TUR_economic_security" }
			name = TUR_economic_security_name
			picture = high_society
			allowed = {
				original_tag = TUR
			}
			allowed_civil_war = {
				always = yes
			}
			modifier = {
				stability_factor = 0.05
				production_speed_buildings_factor = 0.10
				interest_rate_multiplier_modifier = -0.50
			}
		}
		TUR_economic_security2 = {
			on_add = { log = "[GetDateText]: [Root.GetName]: add idea TUR_economic_security2" }
			name = TUR_economic_security_name
			picture = high_society
			allowed = {
				original_tag = TUR
			}
			allowed_civil_war = {
				always = yes
			}
			modifier = {
				stability_factor = 0.05
				production_speed_buildings_factor = 0.20
				tax_gain_multiplier_modifier = 0.05
				interest_rate_multiplier_modifier = -0.50
				projects_cost_modifier = -0.10
			}
		}
		TUR_economic_security3 = {
			on_add = { log = "[GetDateText]: [Root.GetName]: add idea TUR_economic_security3" }
			picture = high_society
			allowed = {
				original_tag = TUR
			}
			allowed_civil_war = {
				always = yes
			}
			modifier = {
				stability_factor = 0.10
				production_speed_buildings_factor = 0.25
				tax_gain_multiplier_modifier = 0.05
				interest_rate_multiplier_modifier = -1.00
				projects_cost_modifier = -0.10
				local_resources_factor = 0.10
				consumer_goods_factor = -0.02
			}
		}
		#
		TUR_revised_budgetting = {
			on_add = { log = "[GetDateText]: [Root.GetName]: add idea TUR_revised_budgetting" }
			name = TUR_revised_budgetting_name
			picture = positive_gold
			allowed = {
				original_tag = TUR
			}
			allowed_civil_war = {
				always = yes
			}
			modifier = {
				health_cost_multiplier_modifier = -0.10
				social_cost_multiplier_modifier = -0.15
			}
		}
		#
		TUR_revised_budgetting2 = {
			on_add = { log = "[GetDateText]: [Root.GetName]: add idea TUR_revised_budgetting2" }
			name = TUR_revised_budgetting_name
			picture = positive_gold
			allowed = {
				original_tag = TUR
			}
			allowed_civil_war = {
				always = yes
			}
			modifier = {
				health_cost_multiplier_modifier = -0.15
				social_cost_multiplier_modifier = -0.20
				recruitable_population_factor = 0.05
				monthly_population = 0.02
			}
		}
		#
		TUR_asteroid_mining = {
			on_add = { log = "[GetDateText]: [Root.GetName]: add idea TUR_asteroid_mining" }
			picture = production_bonus
			allowed = {
				original_tag = TUR
			}
			allowed_civil_war = {
				always = yes
			}
			modifier = {
				resource_export_multiplier_modifier = 0.10
				production_factory_max_efficiency_factor = 0.05
				production_factory_start_efficiency_factor = 0.10
			}
		}

		TUR_party_rumours = {
			on_add = { log = "[GetDateText]: [Root.GetName]: add idea TUR_party_rumours" }

			picture = political_drain

			allowed = {
				original_tag = TUR
			}

			allowed_civil_war = {
				has_country_leader = {
					character = TUR_bulent_ecevit
					ruling_only = yes
				}
			}

			cancel = {
				NOT = {
					has_country_leader = {
						character = TUR_bulent_ecevit
						ruling_only = yes
					}
				}
			}
			modifier = {
				political_power_factor = -0.20
				democratic_drift = -0.03
			}
		}
		TUR_minority_government = {
			on_add = { log = "[GetDateText]: [Root.GetName]: add idea TUR_minority_government" }
			picture = political_drain

			allowed = {
				original_tag = TUR
			}
			modifier = {
				political_power_factor = -0.25
			}
		}
		TUR_PKK_insurgency_ceasefire = {
			on_add = { log = "[GetDateText]: [Root.GetName]: add idea TUR_PKK_insurgency_ceasefire" }
			picture = pkks

			allowed = {
				original_tag = TUR
			}
			allowed_civil_war = {
				always = yes
			}
			cancel = {
				OR = {
					has_country_flag = TUR_PKK_tamed
					NOT = {
						any_owned_state = {
							is_core_of = KUR
						}
					}
				}
			}
			modifier = {
				stability_factor = -0.05
			}
		}
		TUR_PKK_insurgency_active = {
			on_add = { log = "[GetDateText]: [Root.GetName]: add idea TUR_PKK_insurgency_active" }
			picture = pkk_idea

			allowed = {
				original_tag = TUR
			}
			allowed_civil_war = {
				always = yes
			}
			cancel = {
				OR = {
					has_country_flag = TUR_PKK_tamed
					NOT = {
						any_owned_state = {
							is_core_of = KUR
						}
					}
				}
			}

			modifier = {
				stability_factor = -0.10
				consumer_goods_factor = 0.05
			}

		}

		TUR_PKK_active_foreign = {
			on_add = { log = "[GetDateText]: [Root.GetName]: add idea TUR_PKK_active_foreign" }
			picture = pkk_idea
			allowed = {
				OR = {
					original_tag = KUR
					original_tag = SYR
					original_tag = FSA
					original_tag = NUS
					original_tag = ROJ
					original_tag = PER
				}
			}

			allowed_civil_war = {
			}

			cancel = {
			}

			modifier = {
				stability_factor = -0.05
				neutrality_drift = 0.01
			}

		}
		TUR_gulenist_economic_advisors = {
			on_add = { log = "[GetDateText]: [Root.GetName]: add idea TUR_gulenist_economic_advisors" }
			picture = GFX_idea_economic_increase

			allowed = {
				original_tag = TUR
			}
			allowed_civil_war = {
				western_autocrats_are_in_power = yes
			}
			cancel = { western_autocrats_are_in_power = no }

			modifier = {
				production_speed_buildings_factor = 0.10
			}

		}

		TUR_gulenist_intelligence_network = {
			on_add = { log = "[GetDateText]: [Root.GetName]: add idea TUR_gulenist_intelligence_network" }

			picture = GFX_idea_spy_intel

			allowed = {
				original_tag = TUR
			}

			allowed_civil_war = {
				western_autocrats_are_in_power = yes
			}

			cancel = { western_autocrats_are_in_power = no }

			modifier = {
				intel_from_operatives_factor = 0.10
				decryption = 1
				police_cost_multiplier_modifier = 0.05
			}

		}
		TUR_gulenist_intelligence_network2 = {
			on_add = { log = "[GetDateText]: [Root.GetName]: add idea TUR_gulenist_intelligence_network2" }

			picture = GFX_idea_spy_intel

			allowed = {
				original_tag = TUR
			}

			allowed_civil_war = {
				western_autocrats_are_in_power = yes
			}

			cancel = { western_autocrats_are_in_power = no }

			modifier = {
				intel_from_operatives_factor = 0.15
				decryption = 2
				police_cost_multiplier_modifier = 0.10
			}

		}

		TUR_gulenist_educators = {
			on_add = { log = "[GetDateText]: [Root.GetName]: add idea TUR_gulenist_educators" }

			picture = GFX_idea_research_bonus

			allowed = {
				original_tag = TUR
			}

			allowed_civil_war = {
				western_autocrats_are_in_power = yes
			}

			cancel = { western_autocrats_are_in_power = no }

			modifier = {
				research_speed_factor = 0.05
				education_cost_multiplier_modifier = 0.05
			}

		}
		TUR_gulenist_educators2 = {
			on_add = { log = "[GetDateText]: [Root.GetName]: add idea TUR_gulenist_educators" }

			picture = GFX_idea_research_bonus

			allowed = {
				original_tag = TUR
			}

			allowed_civil_war = {
				western_autocrats_are_in_power = yes
			}

			cancel = { western_autocrats_are_in_power = no }

			modifier = {
				research_speed_factor = 0.10
				education_cost_multiplier_modifier = 0.10
				political_power_gain = 0.03
			}

		}

		TUR_mobilise_the_faithful_soldiers = {
			on_add = { log = "[GetDateText]: [Root.GetName]: add idea TUR_mobilise_the_faithful_soldiers" }

			picture = GFX_idea_reserve_divisions

			allowed = {
				original_tag = TUR
			}

			allowed_civil_war = {
				western_autocrats_are_in_power = yes
			}

			cancel = { western_autocrats_are_in_power = no }

			modifier = {
				weekly_manpower = 250
				monthly_population = 0.10
			}
		}
		TUR_mobilise_the_faithful_soldiers2 = {
			on_add = { log = "[GetDateText]: [Root.GetName]: add idea TUR_mobilise_the_faithful_soldiers2" }

			picture = GFX_idea_reserve_divisions

			allowed = {
				original_tag = TUR
			}

			allowed_civil_war = {
				western_autocrats_are_in_power = yes
			}

			cancel = { western_autocrats_are_in_power = no }

			modifier = {
				social_cost_multiplier_modifier = 0.05
				monthly_population = 0.05
				investment_cost_modifier = -0.05
				resource_export_multiplier_modifier = 0.05
			}
		}

		TUR_no_prime_minister = { #AKP idea
			on_add = { log = "[GetDateText]: [Root.GetName]: add idea TUR_no_prime_minister" }

			picture = political_reform

			allowed = {
				original_tag = TUR
			}

			allowed_civil_war = {
				neutrality_neutral_muslim_brotherhood_are_in_power = yes
			}

			cancel = { neutrality_neutral_muslim_brotherhood_are_in_power = no }

			modifier = {
				bureaucracy_cost_multiplier_modifier = -0.10
				tax_rate_change_multiplier_modifier = -0.15
			}
		}

		TUR_religious_directorate = { #AKP idea
			on_add = { log = "[GetDateText]: [Root.GetName]: add idea TUR_religious_directorate" }

			picture = jihad_of_education

			allowed = {
				original_tag = TUR
			}

			allowed_civil_war = {
				neutrality_neutral_muslim_brotherhood_are_in_power = yes
			}

			cancel = { neutrality_neutral_muslim_brotherhood_are_in_power = no }

			modifier = {
				neutrality_drift = 0.05
				research_speed_factor = 0.05
			}
		}

		TUR_rise_of_fp = {
			on_add = { log = "[GetDateText]: [Root.GetName]: add idea TUR_rise_of_fp" }
			picture = fizlet_idea
			allowed = {
				original_tag = TUR
			}

			allowed_civil_war = {
				always = yes
			}

			cancel = { has_country_flag = Turkey_FP_banned }

			modifier = {
				communism_drift = 0.06
			}

		}

		TUR_village_institutes = {
			on_add = { log = "[GetDateText]: [Root.GetName]: add idea TUR_village_institutes" }
			picture = shared_research
			allowed = {
				original_tag = TUR
			}

			allowed_civil_war = {
				western_conservatism_are_in_power = yes
			}

			cancel = { western_conservatism_are_in_power = no }

			modifier = {
				communism_drift = 0.01
				research_speed_factor = 0.10
				education_cost_multiplier_modifier = 0.05
			}

		}

		TUR_incentivised_farming = {
			on_add = { log = "[GetDateText]: [Root.GetName]: add idea TUR_incentivised_farming" }
			picture = agriculture
			allowed = {
				original_tag = TUR
			}

			allowed_civil_war = {
				western_liberals_are_in_power = yes
				emerging_communist_state_are_in_power = yes
				emerging_anarchist_communism_are_in_power = yes
				emerging_autocracy_are_in_power = yes
			}

			cancel = {
				NOT = {
					OR = {
						western_liberals_are_in_power = yes
						emerging_communist_state_are_in_power = yes
						emerging_anarchist_communism_are_in_power = yes
						emerging_autocracy_are_in_power = yes
					}
				}
			}

			modifier = {
				consumer_goods_factor = 0.02
				monthly_population = 0.10
				production_speed_buildings_factor = 0.10
			}

		}

		TUR_heavily_subsidised_agriculture = {
			on_add = { log = "[GetDateText]: [Root.GetName]: add idea TUR_heavily_subsidised_agriculture" }
			picture = agriculture
			allowed = {
				original_tag = TUR
			}

			allowed_civil_war = {
				emerging_communist_state_are_in_power = yes
			}

			cancel = {
				NOT = {
					OR = {
						western_liberals_are_in_power = yes
						emerging_communist_state_are_in_power = yes
						emerging_anarchist_communism_are_in_power = yes
						emerging_autocracy_are_in_power = yes
					}
				}
			}

			modifier = {
				consumer_goods_factor = 0.10	#TODO Replace with additional expense
				monthly_population = 0.15
			}

		}

		TUR_communal_farms = {
			on_add = { log = "[GetDateText]: [Root.GetName]: add idea TUR_communal_farms" }
			picture = agricultural_reforms
			allowed = {
				original_tag = TUR
			}

			allowed_civil_war = {
				emerging_anarchist_communism_are_in_power = yes
			}

			cancel = {
				NOT = {
					OR = {
						western_liberals_are_in_power = yes
						emerging_communist_state_are_in_power = yes
						emerging_anarchist_communism_are_in_power = yes
						emerging_autocracy_are_in_power = yes
					}
				}
			}

			modifier = {
				stability_factor = 0.10
				production_speed_buildings_factor = 0.10
			}

		}

		TUR_educating_revolutionaries = {
			on_add = { log = "[GetDateText]: [Root.GetName]: add idea TUR_educating_revolutionaries" }
			picture = research_bonus
			allowed = {
				original_tag = TUR
			}

			allowed_civil_war = {
				emerging_communist_state_are_in_power = yes
			}

			cancel = {
				NOT = {
					OR = {
						western_liberals_are_in_power = yes
						emerging_communist_state_are_in_power = yes
						emerging_anarchist_communism_are_in_power = yes
						emerging_autocracy_are_in_power = yes
					}
				}
			}

			modifier = {
				communism_drift = 0.03
				foreign_influence_defense_modifier = 0.10
			}

		}

		TUR_committees_of_resistance_patrol = {
			on_add = { log = "[GetDateText]: [Root.GetName]: add idea TUR_committees_of_resistance_patrol" }
			picture = morale_bonus
			allowed = {
				original_tag = TUR
			}

			allowed_civil_war = {
				emerging_anarchist_communism_are_in_power = yes
			}

			cancel = {
				NOT = {
					OR = {
						western_liberals_are_in_power = yes
						emerging_communist_state_are_in_power = yes
						emerging_anarchist_communism_are_in_power = yes
						emerging_autocracy_are_in_power = yes
					}
				}
			}

			modifier = {
				nationalist_drift = -0.02
				foreign_subversive_activites = -0.1
				enemy_operative_capture_chance_factor = 0.10
				enemy_operative_detection_chance_factor = 0.15
				political_power_factor = -0.05
			}

		}

		TUR_committees_of_production_for_factories = {
			on_add = { log = "[GetDateText]: [Root.GetName]: add idea TUR_committees_of_production_for_factories" }
			picture = fortification
			allowed = {
				original_tag = TUR
			}

			allowed_civil_war = {
				emerging_anarchist_communism_are_in_power = yes
			}

			cancel = {
				NOT = {
					OR = {
						western_liberals_are_in_power = yes
						emerging_communist_state_are_in_power = yes
						emerging_anarchist_communism_are_in_power = yes
						emerging_autocracy_are_in_power = yes
					}
				}
			}

			modifier = {
				production_factory_max_efficiency_factor = 0.15
				production_factory_efficiency_gain_factor = 0.10
				line_change_production_efficiency_factor = -0.10
			}

		}

		TUR_homeland_defence = { #Islamist Idea
			on_add = { log = "[GetDateText]: [Root.GetName]: add idea TUR_homeland_defence" }
			picture = fortification4
			allowed = {
				original_tag = TUR
			}

			allowed_civil_war = {
				emerging_autocracy_are_in_power = yes
			}

			cancel = { emerging_autocracy_are_in_power = no }

			modifier = {
				army_core_attack_factor = 0.10
				army_core_defence_factor = 0.10
			}
		}
		TUR_highways = { #Islamist Idea
			on_add = { log = "[GetDateText]: [Root.GetName]: add idea TUR_highways" }
			picture = GENERIC_public_works
			allowed = {
				original_tag = TUR
			}

			allowed_civil_war = {
				emerging_autocracy_are_in_power = yes
			}

			cancel = { emerging_autocracy_are_in_power = no }

			modifier = {
				production_speed_rail_way_factor = 0.20
				production_speed_supply_node_factor = 0.15
				supply_node_range = 0.10
			}
		}
		TUR_turkish_media_unctrolled = {
			on_add = { log = "[GetDateText]: [Root.GetName]: add idea TUR_turkish_media_unctrolled" }
			picture = democracy
			allowed = {
				original_tag = TUR
			}

			allowed_civil_war = {
				always = yes
			}

			modifier = {
				party_popularity_stability_factor = -0.10
				political_power_cost = 0.50
				corruption_cost_factor = -0.2
			}
		}
		TUR_turkish_media_unctrolled2 = {
			on_add = { log = "[GetDateText]: [Root.GetName]: add idea TUR_turkish_media_unctrolled2" }
			picture = democracy
			allowed = {
				original_tag = TUR
			}

			allowed_civil_war = {
				always = yes
			}

			modifier = {
				party_popularity_stability_factor = -0.05
				political_power_cost = 0.35
				corruption_cost_factor = -0.2
			}
		}
		TUR_turkish_media_restricted = {
			on_add = { log = "[GetDateText]: [Root.GetName]: add idea TUR_turkish_media_restricted" }
			picture = cctv_cluster
			allowed = {
				original_tag = TUR
			}

			allowed_civil_war = {
				always = yes
			}

			modifier = {
				party_popularity_stability_factor = 0.05
				political_power_cost = -0.35
				corruption_cost_factor = 0.3
				stability_factor = -0.05
			}
		}
		TUR_turkish_media_unrestricted = {
			on_add = { log = "[GetDateText]: [Root.GetName]: add idea TUR_turkish_media_unrestricted" }
			picture = cctv_cluster
			allowed = {
				original_tag = TUR
			}

			allowed_civil_war = {
				always = yes
			}

			modifier = {
				party_popularity_stability_factor = -0.05
				political_power_cost = 0.40
				corruption_cost_factor = -0.40
				corporate_tax_income_multiplier_modifier = 0.05
			}
		}
		TUR_turkish_cyberspace = {
			on_add = { log = "[GetDateText]: [Root.GetName]: add idea TUR_turkish_cyberspace" }
			picture = internet_icon
			allowed = {
				original_tag = TUR
			}

			allowed_civil_war = {
				always = yes
			}

			modifier = {
				production_speed_internet_station_factor = 0.10
				encryption_factor = 0.15
			}
		}
		TUR_turkish_cyberspace_restricted = {
			on_add = { log = "[GetDateText]: [Root.GetName]: add idea TUR_turkish_cyberspace_restricted" }
			picture = internet_icon
			allowed = {
				original_tag = TUR
			}

			allowed_civil_war = {
				always = yes
			}

			modifier = {
				production_speed_internet_station_factor = 0.15
				encryption_factor = 0.75
				research_speed_factor = 0.01
				civilian_intel_to_others = -20
				propaganda_campaign_cost_modifier = -0.15
				police_cost_multiplier_modifier = 0.05
			}
		}
		TUR_turkish_cyberspace_unrestricted = {
			on_add = { log = "[GetDateText]: [Root.GetName]: add idea TUR_turkish_cyberspace_unrestricted" }
			picture = internet_icon
			allowed = {
				original_tag = TUR
			}

			allowed_civil_war = {
				always = yes
			}

			modifier = {
				production_speed_internet_station_factor = 0.25
				research_speed_factor = 0.02
				civilian_intel_to_others = 10
				propaganda_campaign_cost_modifier = 0.15
				police_cost_multiplier_modifier = -0.05
			}
		}

		CIW_member = {
			on_add = { log = "[GetDateText]: [Root.GetName]: add idea CIW_member" }
			picture = ciwmember
			allowed = {
				OR = {
					is_middle_eastern_nation = yes
					original_tag = PAK
					original_tag = AFG
				}
			}

			allowed_civil_war = {
				has_government = communism
			}

			cancel = { }

			rule = {
				can_create_factions = no
			}
			modifier = {
				trade_opinion_factor = 0.1
				stability_factor = 0.05
				consumer_goods_factor = 0.05
				production_speed_buildings_factor = 0.25
			}
		}
		# CIW IDEAS
		TUR_ciw_infrastructure = { #CIW Idea
			picture = foreign_capital
			allowed_civil_war = {
				always = yes
			}
			modifier = {
				production_speed_radar_station_factor = 0.10
				production_speed_infrastructure_factor = 0.10
				production_speed_internet_station_factor = 0.10
			}
		}
		#
		TUR_ciw_disasters = { #CIW Idea
			picture = foreign_capital
			allowed_civil_war = {
				always = yes
			}
			modifier = {
				industry_repair_factor = 0.30
				political_power_gain = 0.15
			}
		}
		#
		TUR_ciw_industry = { #CIW Idea
			picture = foreign_capital
			allowed_civil_war = {
				always = yes
			}
			modifier = {
				production_factory_max_efficiency_factor = 0.10
				production_factory_start_efficiency_factor = 0.10
			}
		}
		#
		TUR_ciw_population = { #CIW Idea
			picture = foreign_capital
			allowed_civil_war = {
				always = yes
			}
			modifier = {
				production_factory_max_efficiency_factor = 0.10
				monthly_population = 0.02
				health_cost_multiplier_modifier = -0.05
			}
		}
		#
		TUR_ciw_education = { #CIW Idea
			picture = foreign_capital
			allowed_civil_war = {
				always = yes
			}
			modifier = {
				research_speed_factor = 0.05
				education_cost_multiplier_modifier = -0.10
			}
		}
		#
		TUR_naval_idea_1 = {
			picture = coastal_defense_ships
			name = TUR_naval_idea_name
			allowed_civil_war = {
				always = yes
			}
			modifier = {
				navy_max_range_factor = 0.10
				navy_leader_cost_factor = -0.15
				experience_gain_navy_unit_factor = 0.10
			}
		}
		TUR_naval_idea_2 = {
			picture = coastal_defense_ships
			name = TUR_naval_idea_name
			allowed_civil_war = {
				always = yes
			}
			modifier = {
				navy_max_range_factor = 0.10
				navy_leader_cost_factor = -0.15
				experience_gain_navy_unit_factor = 0.10
				convoy_retreat_speed = 0.10
				navy_carrier_air_targetting_factor = 0.15
				special_forces_out_of_supply_factor = -0.03
				paradrop_organization_factor = 0.10
				invasion_preparation = 0.10
				naval_invasion_penalty = -0.15
			}
		}
		TUR_airforce = {
			on_add = { log = "[GetDateText]: [Root.GetName]: add idea TUR_airforce" }
			allowed_civil_war = {
				always = yes
			}
			picture = air_bonus
			modifier = {
				aircraft_manufacturer_cost_factor = -0.25
				tank_manufacturer_cost_factor = -0.25
			}
			equipment_bonus = {
				attack_helicopter_hull = {
					build_cost_ic = -0.25
					instant = yes
				}
			}
		}
		TUR_neo_ottomanism = { #AKP/MHP Idea
			on_add = { log = "[GetDateText]: [Root.GetName]: add idea TUR_neo_ottomanism" }
			allowed_civil_war = {
				always = yes
			}
			cancel = {
				NOT = {
					neutrality_neutral_muslim_brotherhood_are_in_power = yes
				}
			}
			picture = ottoman_spirit
			modifier = {
				foreign_influence_modifier = 0.05
				conscription_factor = 0.075
			}
		}
		TUR_zero_problems = { #AKP Idea
			on_add = { log = "[GetDateText]: [Root.GetName]: add idea TUR_zero_problems" }
			allowed_civil_war = {
				always = yes
			}
			cancel = {
				NOT = {
					neutrality_neutral_muslim_brotherhood_are_in_power = yes
				}
			}
			picture = flexible_foreign_policy2
			modifier = {
				foreign_influence_defense_modifier = 0.10
				receiving_investment_cost_modifier = -0.10
			}
		}
		TUR_erdonomics_1 = { #AKP Idea
			on_add = { log = "[GetDateText]: [Root.GetName]: add idea TUR_erdonomics_1" }
			name = TUR_erdonomics_name
			allowed_civil_war = {
				always = yes
			}
			cancel = {
				NOT = {
					neutrality_neutral_muslim_brotherhood_are_in_power = yes
				}
			}
			picture = economic_increase
			modifier = {
				consumer_goods_factor = -0.02
				tax_gain_multiplier_modifier = 0.05
			}
		}
		TUR_erdonomics_2 = { #AKP Idea
			on_add = { log = "[GetDateText]: [Root.GetName]: add idea TUR_erdonomics_2" }
			name = TUR_erdonomics_name
			allowed_civil_war = {
				always = yes
			}
			cancel = {
				NOT = {
					neutrality_neutral_muslim_brotherhood_are_in_power = yes
				}
			}
			picture = financial_crisis
			modifier = {
				interest_rate_multiplier_modifier = -1.00
				production_factory_efficiency_gain_factor = -0.10
				production_factory_max_efficiency_factor = -0.05
			}
		}
		TUR_erdonomics_3 = { #AKP Idea
			on_add = { log = "[GetDateText]: [Root.GetName]: add idea TUR_erdonomics_3" }
			name = TUR_erdonomics_name
			allowed_civil_war = {
				always = yes
			}
			cancel = {
				NOT = {
					neutrality_neutral_muslim_brotherhood_are_in_power = yes
				}
			}
			picture = market_dynamics
			modifier = {
				consumer_goods_factor = -0.04
				tax_gain_multiplier_modifier = 0.10
				receiving_investment_cost_modifier = -0.15
			}
		}
		TUR_service_to_community = { #Hizmet Idea
			on_add = { log = "[GetDateText]: [Root.GetName]: add idea TUR_service_to_community" }
			name = TUR_service_community_name
			allowed_civil_war = {
				always = yes
			}
			cancel = { western_autocrats_are_in_power = no }
			picture = political_power_bonus
			modifier = {
				democratic_drift = 0.05
				economic_cycles_cost_factor = -0.15
				corruption_cost_factor = -0.15
			}
		}
		TUR_service_to_community2 = { #Hizmet Idea
			on_add = { log = "[GetDateText]: [Root.GetName]: add idea TUR_service_to_community2" }
			allowed_civil_war = {
				always = yes
			}
			cancel = { western_autocrats_are_in_power = no }
			picture = political_power_bonus
			modifier = {
				democratic_drift = 0.05
				economic_cycles_cost_factor = -0.15
				corruption_cost_factor = -0.15
				drift_defence_factor = 0.10
			}
		}
		TUR_akp_protests = { #Hizmet Idea
			on_add = { log = "[GetDateText]: [Root.GetName]: add idea TUR_akp_protests" }
			allowed_civil_war = {
				always = yes
			}
			cancel = { western_autocrats_are_in_power = no }
			picture = fire
			modifier = {
				consumer_goods_factor = 0.02
				political_power_factor = -0.10
				stability_factor = -0.05
			}
		}
		TUR_fund_oil_strikes = { #Hizmet Idea
			on_add = { log = "[GetDateText]: [Root.GetName]: add idea TUR_fund_oil_strikes" }
			allowed_civil_war = {
				always = yes
			}
			picture = factory_strikes
			modifier = {
				local_resources_factor = -0.10
				stability_factor = -0.05
			}
		}
		TUR_major_military_reform = { #MHP Idea
			on_add = { log = "[GetDateText]: [Root.GetName]: add idea TUR_major_military_reform" }
			allowed_civil_war = {
				always = yes
			}
			cancel = {
				NOT = {
					OR = {
						nationalist_military_junta_are_in_power = yes
						nationalist_monarchists_are_in_power = yes
					}
				}
			}
			picture = factory_strikes
			modifier = {
				conscription_factor = 0.10
				army_morale_factor = 0.05
				compliance_growth = 0.05
			}
		}
		TUR_threat_abroad = { #MHP Idea
			on_add = { log = "[GetDateText]: [Root.GetName]: add idea TUR_threat_abroad" }
			allowed_civil_war = {
				always = yes
			}
			cancel = {
				NOT = {
					OR = {
						nationalist_military_junta_are_in_power = yes
						nationalist_monarchists_are_in_power = yes
					}
				}
			}
			picture = scw_intervention_nat
			modifier = {
				send_volunteer_size = 4
				civil_war_involvement_tension = -0.10
				lend_lease_tension = -0.20
			}
		}
		TUR_radicalism_destroy = { #TSK Idea
			on_add = { log = "[GetDateText]: [Root.GetName]: add idea TUR_radicalism_destroy" }
			allowed_civil_war = {
				always = yes
			}
			cancel = {
				NOT = {
					nationalist_military_junta_are_in_power = yes
				}
			}
			picture = generic_oppression
			modifier = {
				fascism_acceptance = -30
				fascism_drift = -0.05
				bureaucracy_cost_multiplier_modifier = -0.10
			}
		}
		TUR_reformed_airforce = { #TSK Idea
			on_add = { log = "[GetDateText]: [Root.GetName]: add idea TUR_reformed_airforce" }
			allowed_civil_war = {
				always = yes
			}
			cancel = {
				NOT = {
					nationalist_military_junta_are_in_power = yes
				}
			}
			picture = air_support
			modifier = {
				ground_attack_factor = 0.10
				army_bonus_air_superiority_factor = 0.10
				air_superiority_efficiency = 0.05
				air_superiority_bonus_in_combat = 0.05
			}
		}
		TUR_mit_coop = { #TSK Idea
			on_add = { log = "[GetDateText]: [Root.GetName]: add idea TUR_mit_coop" }
			allowed_civil_war = {
				always = yes
			}
			cancel = {
				NOT = {
					nationalist_military_junta_are_in_power = yes
				}
			}
			picture = infantry_bonus
			modifier = {
				army_intel_factor = 0.15
				navy_intel_factor = 0.15
				airforce_intel_factor = 0.15
			}
		}
		TUR_mit_reform = { #TSK Idea
			on_add = { log = "[GetDateText]: [Root.GetName]: add idea TUR_mit_reform" }
			allowed_civil_war = {
				always = yes
			}
			cancel = {
				NOT = {
					nationalist_military_junta_are_in_power = yes
				}
			}
			picture = general_staff
			modifier = {
				intelligence_agency_defense = 0.5
				intel_network_gain_factor = 0.15
				root_out_resistance_effectiveness_factor = 0.10
			}
		}
		TUR_new_armed_forces = { #TSK Idea
			on_add = { log = "[GetDateText]: [Root.GetName]: add idea TUR_new_armed_forces" }
			allowed_civil_war = {
				always = yes
			}
			cancel = {
				NOT = {
					nationalist_military_junta_are_in_power = yes
				}
			}
			picture = national_mobilization
			modifier = {
				personnel_cost_multiplier_modifier = -0.15
				army_org_factor = 0.05
				land_reinforce_rate = 0.10
			}
		}
		TUR_traditional_ideals = { #Islamist Idea
			on_add = { log = "[GetDateText]: [Root.GetName]: add idea TUR_new_armed_forces" }
			allowed_civil_war = {
				always = yes
			}
			cancel = {
				NOT = {
					emerging_reactionaries_are_in_power = yes
				}
			}
			picture = halal
			modifier = {
				democratic_acceptance = -30
				communism_drift = 0.05
				democratic_drift = -0.05
			}
		}
		TUR_alawite_mili_experience = { #Shi'ite Idea
			on_add = { log = "[GetDateText]: [Root.GetName]: add idea TUR_alawite_mili_experience" }
			allowed_civil_war = {
				always = yes
			}
			picture = gentleman_officers
			modifier = {
				experience_gain_army_factor = 0.10
				training_time_army_factor = -0.10
				initiative_factor = 0.05
				planning_speed = 0.10
			}
		}
		TUR_our_own_experience = { #Shi'ite Idea
			on_add = { log = "[GetDateText]: [Root.GetName]: add idea TUR_alawite_mili_experience" }
			allowed_civil_war = {
				always = yes
			}
			picture = national_unity
			modifier = {
				army_org_regain = 0.10
				special_forces_training_time_factor = -0.10
				terrain_penalty_reduction = 0.05
				planning_speed = 0.10
			}
		}
		TUR_archeology_cooperation = { #
			on_add = { log = "[GetDateText]: [Root.GetName]: add idea TUR_archeology_cooperation" }
			allowed_civil_war = {
				always = yes
			}
			picture = central_management
			modifier = {
				production_lack_of_resource_penalty_factor = -0.20
			}
		}
		TUR_win_over_workers = { #Soc-dem Idea
			on_add = { log = "[GetDateText]: [Root.GetName]: add idea TUR_win_over_workers" }
			allowed_civil_war = {
				always = yes
			}
			cancel = {
				NOT = {
					western_social_democrats_are_in_power = yes
				}
			}
			picture = consumer_goods
			modifier = {
				corporate_tax_income_multiplier_modifier = 0.10
				military_industry_tax_modifier = 0.25
			}
		}
		#
		TUR_islamic_legacy = { #IBDA-C Idea
			on_add = { log = "[GetDateText]: [Root.GetName]: add idea TUR_islamic_legacy" }
			allowed_civil_war = {
				always = yes
			}
			cancel = {
				NOT = {
					salafist_caliphate_are_in_power = yes
				}
			}
			picture = islam
			modifier = {
				fascism_drift = 0.05
				army_attack_factor = 0.05
				stability_factor = -0.05
			}
		}
		TUR_islamic_legacy2 = { #IBDA-C Idea
			on_add = { log = "[GetDateText]: [Root.GetName]: add idea TUR_islamic_legacy2" }
			allowed_civil_war = {
				always = yes
			}
			cancel = {
				NOT = {
					salafist_caliphate_are_in_power = yes
				}
			}
			picture = islam
			modifier = {
				fascism_drift = 0.10
				conscription_factor = 0.10
				army_attack_factor = 0.10
				stability_factor = -0.05
			}
		}
	}
	hidden_ideas = {
		TUR_taxing_bosphor = {
			on_add = { log = "[GetDateText]: [Root.GetName]: add idea TUR_taxing_bosphor" }

			allowed = {
			}

			allowed_civil_war = {
				always = yes
			}

			cancel = {
				NOT = { has_government = communism }
			}

			modifier = {
				custom_modifier_tooltip = TUR_taxing_bosphorus
			}
		}
		TUR_PKK_autonomy_idea = { #Meant for the PKK incase the player puppets them
			on_add = { log = "[GetDateText]: [Root.GetName]: add idea TUR_PKK_autonomy_idea" }

			picture = political_drain

			allowed = {
				original_tag = PKK
			}

			allowed_civil_war = {
				always = yes
			}
			cancel = {
			}
			modifier = {
				autonomy_gain = 30
			}
			targeted_modifier = {
				tag = TUR
				attack_bonus_against = 0.20
				defense_bonus_against = 0.50
			}
		}
	}
}