{
    "rest_url": "https://cs3.salesforce.com/services/data/v41.0", 
    "user_id": "00541000001NVWsAAO", 
    "session_id": "00DQ000000EeJJj!ARgAQHMB14_lSiVs4_980JfzoTC5nY2FIXWfbqUZwPs8QmdzBdB7tRYC9RuhYJ8uwDq15n1db7y5uChuqcnlA_VzfW.cq3hA", 
    "success": true, 
    "time_stamp": "2017-12-06 14:38:16", 
    "instance_url": "https://cs3.salesforce.com", 
    "metadata_url": "https://cs3.salesforce.com/services/Soap/m/41.0", 
    "project name": "AZ US Sandbox dev1", 
    "headers": {
        "Content-Type": "application/json; charset=UTF-8", 
        "Accept": "application/json", 
        "Authorization": "OAuth 00DQ000000EeJJj!ARgAQHMB14_lSiVs4_980JfzoTC5nY2FIXWfbqUZwPs8QmdzBdB7tRYC9RuhYJ8uwDq15n1db7y5uChuqcnlA_VzfW.cq3hA"
    }, 
    "partner_url": "https://cs3.salesforce.com/services/Soap/u/41.0", 
    "X-SFDC-Session": "00DQ000000EeJJj!ARgAQHMB14_lSiVs4_980JfzoTC5nY2FIXWfbqUZwPs8QmdzBdB7tRYC9RuhYJ8uwDq15n1db7y5uChuqcnlA_VzfW.cq3hA", 
    "server_url": "https://cs3.salesforce.com/services/Soap/u/5.0/00DQ000000EeJJj", 
    "apex_url": "https://cs3.salesforce.com/services/Soap/s/41.0"
}