{
  "userList": [
    {
      "FirstName": "ahg",
      "LastName": "dh",
      "Email": "dj",
      "id": 1
    }
  ],
  "taskList": [
    {
      "Task": "ahd",
      "Description": "agd",
      "userId": "1",
      "id": 1
    }
  ]
}