{
 "actions": [],
 "allow_rename": 1,
 "autoname": "P-.####",
 "creation": "2022-06-07 12:20:05.272458",
 "doctype": "DocType",
 "editable_grid": 1,
 "engine": "InnoDB",
 "field_order": [
  "property_name",
  "city",
  "property_type",
  "property_price",
  "discount",
  "address",
  "map"
 ],
 "fields": [
  {
   "fieldname": "property_name",
   "fieldtype": "Data",
   "label": "Property Name"
  },
  {
   "fieldname": "city",
   "fieldtype": "Data",
   "label": "City"
  },
  {
   "fieldname": "property_type",
   "fieldtype": "Data",
   "label": "Property Type"
  },
  {
   "fieldname": "property_price",
   "fieldtype": "Float",
   "label": "Property Price"
  },
  {
   "fieldname": "discount",
   "fieldtype": "Float",
   "label": "Discount"
  },
  {
   "fieldname": "address",
   "fieldtype": "Data",
   "label": "Address"
  },
  {
   "fieldname": "map",
   "fieldtype": "Geolocation",
   "label": "Map"
  }
 ],
 "index_web_pages_for_search": 1,
 "links": [],
 "modified": "2022-06-07 12:21:18.840834",
 "modified_by": "Administrator",
 "module": "Bank Management",
 "name": "property",
 "naming_rule": "Expression (old style)",
 "owner": "Administrator",
 "permissions": [
  {
   "create": 1,
   "delete": 1,
   "email": 1,
   "export": 1,
   "print": 1,
   "read": 1,
   "report": 1,
   "role": "System Manager",
   "share": 1,
   "write": 1
  }
 ],
 "sort_field": "modified",
 "sort_order": "DESC",
 "states": [],
 "track_changes": 1
}