{
 "actions": [],
 "allow_rename": 1,
 "autoname": "c-.####",
 "creation": "2022-06-30 13:06:08.609357",
 "doctype": "DocType",
 "editable_grid": 1,
 "engine": "InnoDB",
 "field_order": [
  "id",
  "name1",
  "capital",
  "area"
 ],
 "fields": [
  {
   "fieldname": "id",
   "fieldtype": "Data",
   "label": "ID"
  },
  {
   "fieldname": "name1",
   "fieldtype": "Data",
   "label": "Name"
  },
  {
   "fieldname": "capital",
   "fieldtype": "Data",
   "label": "Capital"
  },
  {
   "fieldname": "area",
   "fieldtype": "Int",
   "label": "Area"
  }
 ],
 "index_web_pages_for_search": 1,
 "links": [],
 "modified": "2022-06-30 13:06:08.609357",
 "modified_by": "Administrator",
 "module": "Bank Management",
 "name": "countries",
 "naming_rule": "Expression (old style)",
 "owner": "Administrator",
 "permissions": [
  {
   "create": 1,
   "delete": 1,
   "email": 1,
   "export": 1,
   "print": 1,
   "read": 1,
   "report": 1,
   "role": "System Manager",
   "share": 1,
   "write": 1
  }
 ],
 "quick_entry": 1,
 "sort_field": "modified",
 "sort_order": "DESC",
 "states": [],
 "track_changes": 1
}