{
 "actions": [],
 "allow_rename": 1,
 "autoname": "BM.####",
 "creation": "2022-05-17 15:27:34.884686",
 "doctype": "DocType",
 "editable_grid": 1,
 "engine": "InnoDB",
 "field_order": [
  "bank_name",
  "ifsc_code",
  "account_number",
  "department",
  "address"
 ],
 "fields": [
  {
   "fieldname": "bank_name",
   "fieldtype": "Data",
   "in_list_view": 1,
   "label": "Bank Name",
   "reqd": 1
  },
  {
   "fieldname": "ifsc_code",
   "fieldtype": "Int",
   "in_list_view": 1,
   "label": "IFSC Code",
   "reqd": 1
  },
  {
   "fieldname": "department",
   "fieldtype": "Data",
   "label": "Department",
   "reqd": 1
  },
  {
   "fieldname": "address",
   "fieldtype": "Data",
   "in_list_view": 1,
   "label": "Address"
  },
  {
   "fieldname": "account_number",
   "fieldtype": "Int",
   "in_list_view": 1,
   "label": "Account Number",
   "reqd": 1
  }
 ],
 "index_web_pages_for_search": 1,
 "links": [],
 "modified": "2022-05-26 15:26:04.864212",
 "modified_by": "Administrator",
 "module": "Bank Management",
 "name": "bank",
 "naming_rule": "Expression (old style)",
 "owner": "Administrator",
 "permissions": [
  {
   "create": 1,
   "delete": 1,
   "email": 1,
   "export": 1,
   "print": 1,
   "read": 1,
   "report": 1,
   "role": "System Manager",
   "share": 1,
   "write": 1
  },
  {
   "create": 1,
   "delete": 1,
   "email": 1,
   "export": 1,
   "print": 1,
   "read": 1,
   "report": 1,
   "role": "Accountant",
   "select": 1,
   "share": 1,
   "write": 1
  },
  {
   "email": 1,
   "export": 1,
   "print": 1,
   "read": 1,
   "report": 1,
   "role": "Customer",
   "share": 1
  }
 ],
 "quick_entry": 1,
 "sort_field": "modified",
 "sort_order": "ASC",
 "states": [],
 "track_changes": 1
}