{
 "actions": [],
 "allow_rename": 1,
 "creation": "2022-06-06 15:36:30.030680",
 "doctype": "DocType",
 "editable_grid": 1,
 "engine": "InnoDB",
 "field_order": [
  "note"
 ],
 "fields": [
  {
   "fieldname": "note",
   "fieldtype": "Text",
   "label": "Note"
  }
 ],
 "index_web_pages_for_search": 1,
 "is_virtual": 1,
 "links": [],
 "modified": "2022-06-06 15:36:30.030680",
 "modified_by": "Administrator",
 "module": "Bank Management",
 "name": "My Virtual Doctype",
 "owner": "Administrator",
 "permissions": [
  {
   "create": 1,
   "delete": 1,
   "email": 1,
   "export": 1,
   "print": 1,
   "read": 1,
   "report": 1,
   "role": "System Manager",
   "share": 1,
   "write": 1
  }
 ],
 "sort_field": "modified",
 "sort_order": "DESC",
 "states": [],
 "track_changes": 1
}