{
 "actions": [],
 "autoname": "autoincrement",
 "creation": "2022-07-18 10:58:53.645171",
 "doctype": "DocType",
 "editable_grid": 1,
 "engine": "InnoDB",
 "field_order": [
  "first_name",
  "last_name"
 ],
 "fields": [
  {
   "fieldname": "first_name",
   "fieldtype": "Data",
   "label": "First Name"
  },
  {
   "fieldname": "last_name",
   "fieldtype": "Data",
   "label": "Last Name"
  }
 ],
 "index_web_pages_for_search": 1,
 "links": [],
 "modified": "2022-07-18 10:58:53.645171",
 "modified_by": "Administrator",
 "module": "Bank Management",
 "name": "Api_doc",
 "naming_rule": "Autoincrement",
 "owner": "Administrator",
 "permissions": [
  {
   "create": 1,
   "delete": 1,
   "email": 1,
   "export": 1,
   "print": 1,
   "read": 1,
   "report": 1,
   "role": "System Manager",
   "share": 1,
   "write": 1
  }
 ],
 "quick_entry": 1,
 "sort_field": "modified",
 "sort_order": "DESC",
 "states": [],
 "track_changes": 1
}