{
 "content": null,
 "creation": "2022-06-24 11:39:27.607416",
 "docstatus": 0,
 "doctype": "Page",
 "icon": "Sample Page",
 "idx": 0,
 "modified": "2022-07-18 17:52:56.895989",
 "modified_by": "Administrator",
 "module": "Bank Management",
 "name": "sample-page",
 "owner": "Administrator",
 "page_name": "sample-page",
 "restrict_to_domain": "",
 "roles": [],
 "script": null,
 "standard": "Yes",
 "style": null,
 "system_page": 0,
 "title": "Customer"
}