1 10 20
100 200 125
201 210 89
900 1000 174
704510 704511 243
1 704511 509
7830 743703 509
232866 775800 509
865209 39036 525
517814 100775 470
544816 433814 470
781860 242054 509
542499 531788 408
751402 129725 509
236388 832594 509
281621 860856 525
697366 828512 504
912096 595829 525
105310 470949 449
729980 114690 509
118299 290607 443
310305 915635 525
19517 96912 351
371137 394963 436
975397 105110 525
180727 86304 383
278552 543562 470
684456 156680 509
20362 279108 443
781292 357893 509
240600 764965 509
172647 413999 449
235291 663502 509
730928 389091 509
369012 825300 509
390730 924317 525
434160 916289 525
152571 359080 443
327228 876335 525
907181 658556 525
570921 565514 377
437813 758159 509
1015 408396 443
138687 405302 443
758097 582045 509
699598 829799 504
576911 309990 470
249890 606440 470
249802 122337 443
229382 886787 525
55788 521240 470
559553 771958 509
893085 351329 525
525142 974103 525
830451 316290 509
144531 71574 375
801496 505640 509
706667 601198 509
206155 499833 449
582965 950830 525
254792 607216 470
384513 516329 470
992970 52912 525
28109 869320 525
78682 487588 449
299039 745594 509
548890 13168 470
54182 508709 449
8524 32884 308
295941 369345 441
902589 624672 525
965670 48192 525
790872 809775 468
454664 758610 509
834734 42506 509
511463 355053 449
26784 482486 449
436121 244202 449
46768 127257 354
195256 187985 360
10796 681050 509
366121 441160 449
796055 114559 509
623597 760816 509
69473 230941 443
820901 701182 504
626305 194864 470
583012 264309 470
153432 904262 525
731179 415701 509
72178 288581 443
787589 193684 509
686755 102627 509
271136 142269 443
466982 551745 470
488451 579523 470
927697 131905 525
48719 776896 509
232359 397371 441
386503 469715 449
344577 978978 525
163693 245011 443
278877 67655 443
539876 260086 470
760795 750667 424
949823 433686 525
938671 840207 476
819450 209418 509
788427 397850 509
526074 854611 525
462342 314164 449
174191 519980 470
527420 994131 525
474022 718109 509
974736 968004 458
505979 458046 444
98103 965639 525
733642 266594 509
183333 232936 443
276144 521755 470
67082 300043 443
91225 747883 509
660414 704868 504
84514 269189 443
474575 625681 470
931051 21551 525
35124 983016 525
571875 382162 470
825449 333769 509
931462 592356 525
61807 799354 509
391098 721037 509
169437 344964 443
948741 144449 525
302916 958419 525
797715 202593 509
633800 664805 429
264574 33419 443
414756 857017 525
660718 582996 509
21728 122560 354
622885 443184 470
274363 603352 470
944366 477880 525
339762 938023 525
731814 164776 509
435783 5113 449
961786 201584 525
367502 10776 443
156630 204043 370
654040 946052 525
951141 257579 525
632906 76459 509
779351 675299 504
465074 920581 525
775149 562101 509
406440 124579 443
250862 687956 509
59928 745917 509
794743 733038 468
577372 722379 509
111299 183166 383
941474 721315 525
217632 26092 386
525489 139313 470
504502 927515 525
101937 753909 509
472572 750246 509
351517 416640 449
662286 120778 509
709533 220705 509
410106 244582 449
79528 776689 509
584344 324791 470
542460 586242 452
380561 748459 509
694608 16312 509
589544 670457 509
658570 45469 509
490094 747099 509
129075 779058 509
664407 549919 509
38956 711354 509
585547 624611 447
560532 850603 525
784544 250933 509
193776 116763 383
768910 706472 468
635016 871966 525
634838 240473 509
968566 50151 525
492170 23510 449
478552 115045 449
404150 54598 443
39342 994569 525
533317 379414 470
610369 214992 470
580328 1613 470
834760 689547 504
404306 553804 470
121079 3978 354
921307 135554 525
873623 585369 525
991733 722887 525
729081 840862 525
28070 207027 383
