[
  {
    "name": "John Smith",
    "date": "2023-03-28",
    "time": "10:00 AM",
    "service": "CRM",
    "bookedfor": "harry",
    "id": "1",
    "price": "$999",
    "message": "I need it to be online by June"
  },
  {
    "name": "Jane Doe",
    "date": "2023-03-29",
    "time": "2:00 PM",
    "bookedfor": "harry",
    "price": "$999",
    "service": "Animations",
    "id": "2",
    "message": "Can you add some more Animations?"
  },
  {
    "name": "Bob Johnson",
    "date": "2023-03-30",
    "time": "12:30 PM",
    "bookedfor": "harry",
    "price": "$999",
    "service": "E-Commerce Website",
    "id": "3",
    "message": "Please focus on the UI."
  }
]