[
  {
    "name": "John Smith",
    "date": "2023-03-28",
    "time": "10:00 AM",
    "service": "CRM",
    "bookedfor":"harry",
    "id": "1234",
    "price": "$880",
    "message": "I need it to be online by June"
  },
  {
    "name": "Jane Doe",
    "date": "2023-03-29",
    "time": "2:00 PM",
    "bookedfor":"harry",
    "price": "$560",

    "service": "Animations",
    "id": "5678",
    "message": "Can you add some more Animations?"
  },
  {
    "name": "Bob Johnson",
    "date": "2023-03-30",
    "time": "12:30 PM",
    "bookedfor":"harry",
    "price": "$960",

    "service": "E-Commerce Website",
    "id": "9012",
    "message": "Please focus on the UI."
  }
]
