[
      {
        "question": "How do I make a booking?",
        "answer": "You can make a booking on our website by selecting your desired destination, dates, and accommodation type. Follow the prompts to complete your booking."
      },
      {
        "question": "Can I modify or cancel my booking?",
        "answer": "Yes, you can modify or cancel your booking depending on the cancellation policy of the accommodation provider. Log in to your account to make changes or contact our customer support team for assistance."
      },
      {
        "question": "Is my personal information secure?",
        "answer": "Yes, we take data privacy and security very seriously. Your personal information is encrypted and protected by industry-standard security measures."
      },
      {
        "question": "How do I pay for my booking?",
        "answer": "You can pay for your booking using a variety of payment methods, including credit card, debit card, or PayPal. Follow the prompts during the booking process to select your preferred payment method."
      },
      {
        "question": "What if I have a special request or requirement?",
        "answer": "You can contact our customer support team to make a special request or notify us of any requirements you may have, such as accessibility needs or dietary restrictions. We will do our best to accommodate your needs."
      },
      {
        "question": "Do you offer travel insurance?",
        "answer": "We do not offer travel insurance directly, but we recommend that you purchase travel insurance separately to protect your trip in case of unforeseen circumstances."
      },
      {
        "question": "How do I know my booking is confirmed?",
        "answer": "You will receive a confirmation email with all the details of your booking, including the accommodation provider's contact information and check-in instructions. Please keep this email for reference."
      },
      {
        "question": "What if I have a problem during my stay?",
        "answer": "If you encounter any issues during your stay, please contact the accommodation provider first to resolve the issue. If you are unable to resolve the issue, you can contact our customer support team for assistance."
      },
      {
        "question": "Can I make a booking for a large group?",
        "answer": "Yes, you can make a booking for a large group on our website. Please contact our customer support team for assistance with group bookings."
      },
      {
        "question": "Do you offer discounts or promotions?",
        "answer": "We may offer discounts or promotions from time to time. Sign up for our newsletter or follow us on social media to stay updated on our latest offers."
      }
    ]
  