{
    "states": [
      "Assam",
      "Bihar",
      "Chhattisgarh",
      "Goa",
      "Gujarat",
      "Haryana",
      "Jharkhand",
      "Karnataka",
      "Kerala",
      "Maharashtra",
      "Manipur",
      "Meghalaya",
      "Mizoram",
      "Nagaland",
      "Odisha",
      "Punjab",
      "Rajasthan",
      "Sikkim",
      "Tamil Nadu",
      "Telangana",
      "Tripura",
      "Uttarakhand",
      "West Bengal"
    ]
  }
  