<svg width="16" height="24" viewBox="0 0 16 24" fill="none" xmlns="http://www.w3.org/2000/svg">
<path d="M1.18339 13.4826L12.0977 23.3269C12.277 23.4902 12.4892 23.6187 12.722 23.705C12.9548 23.7913 13.2036 23.8337 13.4541 23.8297C13.7046 23.8256 13.9518 23.7753 14.1815 23.6816C14.4112 23.5879 14.6188 23.4526 14.7923 23.2836C15.14 22.9457 15.3306 22.4932 15.3224 22.0248C15.3143 21.5565 15.1081 21.1103 14.7489 20.7838L5.20194 12.0702L14.4429 3.14344C14.7906 2.80559 14.9811 2.35306 14.973 1.88468C14.9649 1.41631 14.7587 0.970149 14.3995 0.643654C14.2209 0.478959 14.009 0.349056 13.7761 0.261475C13.5433 0.173892 13.2941 0.130372 13.043 0.133431C12.7919 0.138439 12.5444 0.18994 12.3147 0.284955C12.085 0.379967 11.8777 0.516606 11.7049 0.686948L1.13817 10.8764C0.948433 11.0455 0.798206 11.2495 0.696955 11.4754C0.595704 11.7014 0.545625 11.9445 0.549873 12.1893C0.554121 12.4341 0.612604 12.6755 0.721637 12.898C0.83067 13.1206 0.987889 13.3196 1.18339 13.4826Z" fill="white"/>
</svg>
