<svg xmlns="http://www.w3.org/2000/svg" width="19.468" height="19.499" viewBox="0 0 19.468 19.499">
    <g>
        <path fill="#ffbc01" d="M16.78 12.673l-2.41-2.41a1.6 1.6 0 0 0-2.668.6A1.64 1.64 0 0 1 9.809 11.9a7.431 7.431 0 0 1-4.476-4.477A1.56 1.56 0 0 1 6.366 5.53a1.6 1.6 0 0 0 .6-2.668L4.559.452a1.719 1.719 0 0 0-2.324 0L.6 2.087C-1.035 3.808.772 8.37 4.817 12.415s8.607 5.939 10.328 4.217L16.78 15a1.719 1.719 0 0 0 0-2.327z" transform="rotate(8 1.201 17.182)"/>
    </g>
</svg>
