module dice

go 1.20

require (
	github.com/prometheus/client_golang v1.16.0
	go.opentelemetry.io/contrib/instrumentation/net/http/otelhttp v0.44.0
	go.opentelemetry.io/otel v1.18.0
	go.opentelemetry.io/otel/exporters/jaeger v1.17.0
	go.opentelemetry.io/otel/exporters/prometheus v0.41.0
	go.opentelemetry.io/otel/metric v1.18.0
	go.opentelemetry.io/otel/sdk v1.18.0
	go.opentelemetry.io/otel/sdk/metric v0.41.0
)

require (
	github.com/beorn7/perks v1.0.1 // indirect
	github.com/cespare/xxhash/v2 v2.2.0 // indirect
	github.com/felixge/httpsnoop v1.0.3 // indirect
	github.com/go-logr/logr v1.2.4 // indirect
	github.com/go-logr/stdr v1.2.2 // indirect
	github.com/golang/protobuf v1.5.3 // indirect
	github.com/matttproud/golang_protobuf_extensions v1.0.4 // indirect
	github.com/prometheus/client_model v0.4.0 // indirect
	github.com/prometheus/common v0.42.0 // indirect
	github.com/prometheus/procfs v0.10.1 // indirect
	go.opentelemetry.io/otel/trace v1.18.0 // indirect
	golang.org/x/sys v0.12.0 // indirect
	google.golang.org/protobuf v1.31.0 // indirect
)
