// Jest Snapshot v1, https://goo.gl/fbAQLP

exports[`COMPONENT -> Input -> snapshot... expect to render correct properties 1`] = `
<wrapper__Wrapper
  className="input-field"
>
  <label
    className="label"
    htmlFor="null-text-input"
  >
    <span>
      default
    </span>
  </label>
  <br />
  <input
    id="null-text-input"
    loaded={true}
    onChange={[Function]}
    type="text"
    value=""
  />
</wrapper__Wrapper>
`;
