// Jest Snapshot v1, https://goo.gl/fbAQLP

exports[`LAYOUT -> Table -> snapshot... expect to render correct properties 1`] = `
<wrapper__Wrapper
  className="table"
>
  <thead>
    <tr />
  </thead>
  <tbody />
</wrapper__Wrapper>
`;
