// Jest Snapshot v1, https://goo.gl/fbAQLP

exports[`COMPONENT -> Header -> Mock properties... expect snapshot to pass... 1`] = `
<Fragment>
  <HideOnScroll>
    <WithStyles(ForwardRef(AppBar))>
      <WithStyles(ForwardRef(Toolbar))>
        <WithStyles(ForwardRef(Container))
          className="makeStyles-navContainer-1"
          maxWidth="xl"
        >
          <WithStyles(ForwardRef(IconButton))
            aria-label="home"
            color="inherit"
            component={
              Object {
                "$$typeof": Symbol(react.forward_ref),
                "render": [Function],
              }
            }
            disabled={false}
            edge="start"
            href="/"
            naked={true}
          >
            <Memo([object Object])
              color="disabled"
              fontSize="large"
            />
          </WithStyles(ForwardRef(IconButton))>
          <Hidden
            smDown={true}
          >
            <WithStyles(ForwardRef(List))
              aria-labelledby="main navigation"
              className="makeStyles-navList-2"
              component="nav"
            >
              <WithStyles(ForwardRef(ListItem))
                activeClassName="is-active"
                button={true}
                className="makeStyles-link-3"
                component={
                  Object {
                    "$$typeof": Symbol(react.forward_ref),
                    "render": [Function],
                  }
                }
                disabled={false}
                href="/"
                key="home"
              >
                <WithStyles(ForwardRef(ListItemText))
                  primary="home"
                />
              </WithStyles(ForwardRef(ListItem))>
            </WithStyles(ForwardRef(List))>
          </Hidden>
          <Hidden
            mdUp={true}
          >
            <SideDrawer
              navLinks={
                Array [
                  Object {
                    "path": "/",
                    "title": "home",
                  },
                ]
              }
            />
          </Hidden>
        </WithStyles(ForwardRef(Container))>
      </WithStyles(ForwardRef(Toolbar))>
    </WithStyles(ForwardRef(AppBar))>
  </HideOnScroll>
  <WithStyles(ForwardRef(Toolbar))
    id="back-to-top-anchor"
  />
  <BackToTop>
    <WithStyles(ForwardRef(Fab))
      aria-label="scroll back to top"
      color="primary"
      size="large"
    >
      <Memo([object Object]) />
    </WithStyles(ForwardRef(Fab))>
  </BackToTop>
</Fragment>
`;
