module gitlab.com/shinetown/common/common_go/services/mailsink

go 1.14

require (
	github.com/konsorten/go-windows-terminal-sequences v1.0.2 // indirect
	github.com/sirupsen/logrus v1.4.2
	golang.org/x/sys v0.0.0-20200223170610-d5e6a3e2c0ae // indirect
)
