{
  "swagger": "2.0",
  "info": {
    "title": "argon.proto",
    "version": "version not set"
  },
  "schemes": [
    "http",
    "https"
  ],
  "consumes": [
    "application/json"
  ],
  "produces": [
    "application/json"
  ],
  "paths": {
    "/argon/appointment-invite": {
      "post": {
        "operationId": "SendAppointmentInvite",
        "responses": {
          "200": {
            "description": "A successful response.",
            "schema": {
              "$ref": "#/definitions/argonSendAppointmentInviteResponse"
            }
          }
        },
        "parameters": [
          {
            "name": "body",
            "in": "body",
            "required": true,
            "schema": {
              "$ref": "#/definitions/argonSendAppointmentInviteRequest"
            }
          }
        ],
        "tags": [
          "Endpoints"
        ]
      }
    },
    "/argon/appointment-slots": {
      "post": {
        "operationId": "ListAppointmentSlots",
        "responses": {
          "200": {
            "description": "A successful response.",
            "schema": {
              "$ref": "#/definitions/argonListAppointmentSlotsResponse"
            }
          }
        },
        "parameters": [
          {
            "name": "body",
            "in": "body",
            "required": true,
            "schema": {
              "$ref": "#/definitions/argonListAppointmentSlotsRequest"
            }
          }
        ],
        "tags": [
          "Endpoints"
        ]
      }
    },
    "/argon/appointments": {
      "post": {
        "operationId": "ListAppointments",
        "responses": {
          "200": {
            "description": "A successful response.",
            "schema": {
              "$ref": "#/definitions/argonListAppointmentsResponse"
            }
          }
        },
        "parameters": [
          {
            "name": "body",
            "in": "body",
            "required": true,
            "schema": {
              "$ref": "#/definitions/argonListAppointmentsRequest"
            }
          }
        ],
        "tags": [
          "Endpoints"
        ]
      }
    },
    "/argon/block-times/rooms": {
      "post": {
        "operationId": "ListBlockTimesOfRooms",
        "responses": {
          "200": {
            "description": "A successful response.",
            "schema": {
              "$ref": "#/definitions/argonListBlockTimesOfRoomsResponse"
            }
          }
        },
        "parameters": [
          {
            "name": "body",
            "in": "body",
            "required": true,
            "schema": {
              "$ref": "#/definitions/argonListBlockTimesOfRoomsRequest"
            }
          }
        ],
        "tags": [
          "Endpoints"
        ]
      }
    },
    "/argon/block-times/service-providers": {
      "post": {
        "operationId": "ListBlockTimesOfServiceProviders",
        "responses": {
          "200": {
            "description": "A successful response.",
            "schema": {
              "$ref": "#/definitions/argonListBlockTimesOfServiceProvidersResponse"
            }
          }
        },
        "parameters": [
          {
            "name": "body",
            "in": "body",
            "required": true,
            "schema": {
              "$ref": "#/definitions/argonListBlockTimesOfServiceProvidersRequest"
            }
          }
        ],
        "tags": [
          "Endpoints"
        ]
      }
    },
    "/argon/categories": {
      "post": {
        "operationId": "ListCategories",
        "responses": {
          "200": {
            "description": "A successful response.",
            "schema": {
              "$ref": "#/definitions/argonListCategoriesResponse"
            }
          }
        },
        "parameters": [
          {
            "name": "body",
            "in": "body",
            "required": true,
            "schema": {
              "$ref": "#/definitions/argonListCategoriesRequest"
            }
          }
        ],
        "tags": [
          "Endpoints"
        ]
      }
    },
    "/argon/class-sessions": {
      "post": {
        "operationId": "ListClassSessions",
        "responses": {
          "200": {
            "description": "A successful response.",
            "schema": {
              "$ref": "#/definitions/argonListClassSessionsResponse"
            }
          }
        },
        "parameters": [
          {
            "name": "body",
            "in": "body",
            "required": true,
            "schema": {
              "$ref": "#/definitions/argonListClassSessionsRequest"
            }
          }
        ],
        "tags": [
          "Endpoints"
        ]
      }
    },
    "/argon/classes": {
      "post": {
        "operationId": "ListClasses",
        "responses": {
          "200": {
            "description": "A successful response.",
            "schema": {
              "$ref": "#/definitions/argonListClassesResponse"
            }
          }
        },
        "parameters": [
          {
            "name": "body",
            "in": "body",
            "required": true,
            "schema": {
              "$ref": "#/definitions/argonListClassesRequest"
            }
          }
        ],
        "tags": [
          "Endpoints"
        ]
      }
    },
    "/argon/massage-appointment-slots": {
      "post": {
        "operationId": "ListMassageAppointmentSlots",
        "responses": {
          "200": {
            "description": "A successful response.",
            "schema": {
              "$ref": "#/definitions/argonListMassageAppointmentSlotsResponse"
            }
          }
        },
        "parameters": [
          {
            "name": "body",
            "in": "body",
            "required": true,
            "schema": {
              "$ref": "#/definitions/argonListAppointmentSlotsRequest"
            }
          }
        ],
        "tags": [
          "Endpoints"
        ]
      }
    },
    "/argon/massage-appointments": {
      "post": {
        "operationId": "ListMassageAppointments",
        "responses": {
          "200": {
            "description": "A successful response.",
            "schema": {
              "$ref": "#/definitions/argonListMassageAppointmentsResponse"
            }
          }
        },
        "parameters": [
          {
            "name": "body",
            "in": "body",
            "required": true,
            "schema": {
              "$ref": "#/definitions/argonListAppointmentsRequest"
            }
          }
        ],
        "tags": [
          "Endpoints"
        ]
      }
    },
    "/argon/service-providers": {
      "post": {
        "operationId": "ListServiceProviders",
        "responses": {
          "200": {
            "description": "A successful response.",
            "schema": {
              "$ref": "#/definitions/argonListServiceProvidersResponse"
            }
          }
        },
        "parameters": [
          {
            "name": "body",
            "in": "body",
            "required": true,
            "schema": {
              "$ref": "#/definitions/argonListServiceProvidersRequest"
            }
          }
        ],
        "tags": [
          "Endpoints"
        ]
      }
    },
    "/argon/services": {
      "post": {
        "operationId": "ListServices",
        "responses": {
          "200": {
            "description": "A successful response.",
            "schema": {
              "$ref": "#/definitions/argonListServicesResponse"
            }
          }
        },
        "parameters": [
          {
            "name": "body",
            "in": "body",
            "required": true,
            "schema": {
              "$ref": "#/definitions/argonListServicesRequest"
            }
          }
        ],
        "tags": [
          "Endpoints"
        ]
      }
    },
    "/argon/settings": {
      "post": {
        "operationId": "ListSettings",
        "responses": {
          "200": {
            "description": "A successful response.",
            "schema": {
              "$ref": "#/definitions/argonListSettingsResponse"
            }
          }
        },
        "parameters": [
          {
            "name": "body",
            "in": "body",
            "required": true,
            "schema": {
              "$ref": "#/definitions/argonListSettingsRequest"
            }
          }
        ],
        "tags": [
          "Endpoints"
        ]
      }
    },
    "/argon/validate/appointment-slots": {
      "post": {
        "operationId": "ValidateAppointmentSlots",
        "responses": {
          "200": {
            "description": "A successful response.",
            "schema": {
              "$ref": "#/definitions/argonValidateAppointmentSlotsResponse"
            }
          }
        },
        "parameters": [
          {
            "name": "body",
            "in": "body",
            "required": true,
            "schema": {
              "$ref": "#/definitions/argonValidateAppointmentSlotsRequest"
            }
          }
        ],
        "tags": [
          "Endpoints"
        ]
      }
    },
    "/argon/validate/class-sessions": {
      "post": {
        "operationId": "ValidateClassSessions",
        "responses": {
          "200": {
            "description": "A successful response.",
            "schema": {
              "$ref": "#/definitions/argonValidateClassSessionsResponse"
            }
          }
        },
        "parameters": [
          {
            "name": "body",
            "in": "body",
            "required": true,
            "schema": {
              "$ref": "#/definitions/argonValidateClassSessionsRequest"
            }
          }
        ],
        "tags": [
          "Endpoints"
        ]
      }
    }
  },
  "definitions": {
    "argonAppointment": {
      "type": "object",
      "properties": {
        "program_id": {
          "type": "string",
          "title": "unique identifier of program(fitness/massage...) where service/appointment is scheduled"
        },
        "location_id": {
          "type": "string",
          "title": "unique identifier of location(NewYork/London...) where service/appointment is scheduled"
        },
        "division_id": {
          "type": "string",
          "title": "unique identifier of division where service/appointment is scheduled"
        },
        "id": {
          "type": "string",
          "title": "unique identifier of booking/appointment"
        },
        "start_time": {
          "type": "string",
          "format": "date-time",
          "title": "timeslot between which the appointment is scheduled"
        },
        "end_time": {
          "type": "string",
          "format": "date-time"
        },
        "service_provider_id": {
          "type": "string",
          "title": "unique identifier of service provider conducting/performing the service/appointment"
        },
        "room_code": {
          "type": "string",
          "title": "unique identifier of room where service/appointment is scheduled"
        },
        "service_id": {
          "type": "string",
          "title": "unique identifier of service for which booking/appointment is scheduled"
        },
        "participation_type": {
          "$ref": "#/definitions/argonParticipationType",
          "title": "participation(INDIVIDUAL/BUDDY/GROUP) for booking/appointment"
        },
        "channel": {
          "$ref": "#/definitions/argonChannel",
          "title": "medium(IN_PERSON/DIGITAL) in which booking/appointment is scheduled"
        },
        "appointment_status": {
          "$ref": "#/definitions/argonAppointmentStatus",
          "title": "status of appointment"
        },
        "appointment_customers": {
          "type": "array",
          "items": {
            "$ref": "#/definitions/argonAppointmentCustomer"
          },
          "title": "details of customers who have booked the appointment"
        },
        "difficulty": {
          "$ref": "#/definitions/argonDifficulty",
          "title": "difficulty(BEGINNER, INTERMEDIATE or ADVANCED) of service"
        },
        "appointment_slot_id": {
          "type": "string",
          "title": "unique identifier of AppointmentSlot"
        },
        "is_organizer_based": {
          "type": "boolean",
          "format": "boolean",
          "title": "represents if the appointment is organizer based or not"
        },
        "organizer_email": {
          "type": "string",
          "title": "organizer of the appointment/booking\nnote: it is not compulsory for the organizer to be a customer"
        },
        "timestamp": {
          "type": "string",
          "format": "date-time",
          "title": "represents time when the appointment object was last modified"
        },
        "is_deleted": {
          "type": "boolean",
          "format": "boolean",
          "title": "represents deleted field in appointy"
        }
      },
      "title": "Appointment Bookings\nwill also function as Pub/Sub object"
    },
    "argonAppointmentCancellationAndLeadPolicySettings": {
      "type": "object",
      "properties": {
        "cancel_before_payment_in_hours": {
          "type": "integer",
          "format": "int64",
          "title": "how many hours before an appointment should the appointment-booking be cancelled if no payment is received"
        },
        "advance_booking_allowed_before_weeks": {
          "type": "integer",
          "format": "int64",
          "title": "how far in advance can users book an appointment"
        },
        "min_hours_to_book": {
          "type": "integer",
          "format": "int64",
          "title": "minimum advance notice required to book an appointment\nnote: this setting will be overridden by settings set at category or digital/in-person filter level"
        },
        "min_hours_to_book_in_person": {
          "type": "integer",
          "format": "int64",
          "title": "minimum advance notice required to book an in-person/onsite/on-campus appointment\nnote: this setting will be overridden by settings set at category level"
        },
        "min_hours_to_book_digital": {
          "type": "integer",
          "format": "int64",
          "title": "minimum advance notice required to book a digital appointment\nnote: this setting will be overridden by settings set at category level"
        }
      },
      "title": "Lead and Cancellation Policy settings for appointment/service bookings"
    },
    "argonAppointmentCustomer": {
      "type": "object",
      "properties": {
        "id": {
          "type": "string",
          "title": "unique identifier of customer"
        },
        "email": {
          "type": "string",
          "title": "email of customer"
        },
        "first_name": {
          "type": "string",
          "title": "first name of customer"
        },
        "last_name": {
          "type": "string",
          "title": "last name of customer"
        },
        "appointment_customer_status": {
          "$ref": "#/definitions/argonAppointmentCustomerStatus",
          "title": "status of customer"
        },
        "user_deleted_status": {
          "type": "boolean",
          "format": "boolean",
          "title": "represents if user was deleted in the Appointy system and is not associated with Google any more"
        }
      },
      "title": "details of customer who has booked an appointment"
    },
    "argonAppointmentCustomerStatus": {
      "type": "string",
      "enum": [
        "APPOINTMENT_CUSTOMER_BOOKED",
        "APPOINTMENT_CUSTOMER_CANCELLED",
        "APPOINTMENT_CUSTOMER_NO_SHOW",
        "APPOINTMENT_CUSTOMER_LATE_CANCELLED"
      ],
      "default": "APPOINTMENT_CUSTOMER_BOOKED"
    },
    "argonAppointmentNode": {
      "type": "object",
      "properties": {
        "cursor": {
          "type": "string"
        },
        "appointment": {
          "$ref": "#/definitions/argonAppointment"
        }
      }
    },
    "argonAppointmentPrice": {
      "type": "object",
      "properties": {
        "value": {
          "type": "number",
          "format": "double",
          "title": "value is used to identify the amount to be charged for appointment"
        },
        "currency_code": {
          "$ref": "#/definitions/argonCurrencyCode",
          "title": "IANA(ISO-4217) CurrencyCode"
        }
      },
      "title": "Price objects holds the amount and currency combination"
    },
    "argonAppointmentSlot": {
      "type": "object",
      "properties": {
        "program_id": {
          "type": "string",
          "title": "unique identifier of program(fitness/massage...) where bookable-slot is available"
        },
        "location_id": {
          "type": "string",
          "title": "unique identifier of location(NewYork/London...) where bookable-slot is available"
        },
        "division_id": {
          "type": "string",
          "title": "unique identifier of division where bookable-slot is available"
        },
        "id": {
          "type": "string",
          "title": "unique identifier of bookable-slot for appointment scheduling"
        },
        "start_time": {
          "type": "string",
          "format": "date-time",
          "title": "timeslot between which the appointment is scheduled"
        },
        "end_time": {
          "type": "string",
          "format": "date-time"
        },
        "service_provider_id": {
          "type": "string",
          "title": "unique identifier of service provider in bookable-slot for appointment scheduling"
        },
        "room_code": {
          "type": "string",
          "title": "unique identifier of room where bookable-slot is available"
        },
        "service_id": {
          "type": "string",
          "title": "unique identifier of service in bookable-slot for appointment scheduling"
        },
        "participation_type": {
          "$ref": "#/definitions/argonParticipationType",
          "title": "participation(INDIVIDUAL/BUDDY/GROUP) for booking/appointment"
        },
        "participation_type_id": {
          "type": "string",
          "title": "participation-id for (INDIVIDUAL/BUDDY/GROUP) for booking/appointment\nin appointy used as channel_id for loading slots"
        },
        "channel": {
          "$ref": "#/definitions/argonChannel",
          "title": "medium(IN_PERSON/DIGITAL) in which booking/appointment is scheduled"
        },
        "bookable_capacity": {
          "type": "integer",
          "format": "int32",
          "title": "total capacity for booking in appointment-slot"
        },
        "appointment_price": {
          "$ref": "#/definitions/argonAppointmentPrice",
          "title": "price of bookable-slot for appointment scheduling"
        },
        "difficulty": {
          "$ref": "#/definitions/argonDifficulty",
          "title": "difficulty(BEGINNER, INTERMEDIATE or ADVANCED) of service"
        },
        "is_bookable": {
          "type": "boolean",
          "format": "boolean",
          "description": "represents if a appointment slot is available for booking by the user."
        },
        "appointment_slot_status": {
          "$ref": "#/definitions/argonAppointmentSlotStatus",
          "description": "represents if a appointment slot is available for booking by the user."
        },
        "available_capacity": {
          "type": "integer",
          "format": "int32",
          "title": "available_capacity represents the number of slots available for customers to book the appointment-slot"
        },
        "is_organizer_based": {
          "type": "boolean",
          "format": "boolean",
          "title": "represents if the appointment slot is organizer based or not"
        },
        "timestamp": {
          "type": "string",
          "format": "date-time",
          "title": "represents time when the appointment-slot object was last modified"
        },
        "is_deleted": {
          "type": "boolean",
          "format": "boolean",
          "title": "represents deleted field in appointy"
        }
      },
      "title": "Booking/Appointment bookable Slot\nwill also function as Pub/Sub object"
    },
    "argonAppointmentSlotBookingPossibility": {
      "type": "object",
      "properties": {
        "appointment_slot_id": {
          "type": "string"
        },
        "appointment_slot_booking_status": {
          "$ref": "#/definitions/argonAppointmentSlotBookingStatus"
        },
        "reasons": {
          "type": "array",
          "items": {
            "$ref": "#/definitions/argonBookingReason"
          }
        }
      }
    },
    "argonAppointmentSlotBookingStatus": {
      "type": "string",
      "enum": [
        "APPOINTMENT_SLOT_BOOKING_STATUS_UNDEFINED",
        "APPOINTMENT_SLOT_BOOKING_AVAILABLE",
        "APPOINTMENT_SLOT_BOOKING_UNAVAILABLE"
      ],
      "default": "APPOINTMENT_SLOT_BOOKING_STATUS_UNDEFINED"
    },
    "argonAppointmentSlotNode": {
      "type": "object",
      "properties": {
        "cursor": {
          "type": "string"
        },
        "appointment_slot": {
          "$ref": "#/definitions/argonAppointmentSlot"
        }
      }
    },
    "argonAppointmentSlotStatus": {
      "type": "string",
      "enum": [
        "APPOINTMENT_SLOT_AVAILABLE",
        "APPOINTMENT_SLOT_UNAVAILABLE"
      ],
      "default": "APPOINTMENT_SLOT_AVAILABLE"
    },
    "argonAppointmentStatus": {
      "type": "string",
      "enum": [
        "APPOINTMENT_BOOKED",
        "APPOINTMENT_CANCELLED",
        "APPOINTMENT_NO_SHOW"
      ],
      "default": "APPOINTMENT_BOOKED"
    },
    "argonBlockTimeServiceProvider": {
      "type": "object",
      "properties": {
        "program_id": {
          "type": "string",
          "title": "unique identifier of program(fitness/massage...) where block time was set"
        },
        "location_id": {
          "type": "string",
          "title": "unique identifier of location(NewYork/London...) where block time was set"
        },
        "division_id": {
          "type": "string",
          "title": "unique identifier of division where block time was set"
        },
        "id": {
          "type": "string",
          "title": "unique identifier of block time"
        },
        "service_provider_id": {
          "type": "string",
          "title": "unique identifier of service provider in block time"
        },
        "start_time": {
          "type": "string",
          "format": "date-time",
          "title": "timeslot between which the block-time is set"
        },
        "end_time": {
          "type": "string",
          "format": "date-time"
        },
        "timestamp": {
          "type": "string",
          "format": "date-time",
          "title": "represents time when the block time object was last modified"
        },
        "is_deleted": {
          "type": "boolean",
          "format": "boolean",
          "title": "represents deleted field in appointy"
        }
      },
      "title": "Block times added corresponding to service provider\nwill also function as Pub/Sub object"
    },
    "argonBlockTimeServiceRoom": {
      "type": "object",
      "properties": {
        "program_id": {
          "type": "string",
          "title": "unique identifier of program(fitness/massage...) where block time was set"
        },
        "id": {
          "type": "string",
          "title": "unique identifier of block time"
        },
        "room_code": {
          "type": "string",
          "title": "unique identifier of room in block time"
        },
        "start_time": {
          "type": "string",
          "format": "date-time",
          "title": "timeslot between which the block-time is set"
        },
        "end_time": {
          "type": "string",
          "format": "date-time"
        },
        "timestamp": {
          "type": "string",
          "format": "date-time",
          "title": "represents time when the block time object was last modified"
        },
        "is_deleted": {
          "type": "boolean",
          "format": "boolean",
          "title": "represents deleted field in appointy"
        }
      },
      "title": "Block times added corresponding to room\nwill also function as Pub/Sub object"
    },
    "argonBookingReason": {
      "type": "string",
      "enum": [
        "BOOKING_REASON_UNDEFINED",
        "ROOM_INACTIVE",
        "ROOM_NOT_FOUND",
        "ROOM_DIVISION_LINKING_NOT_EXISTS",
        "SERVICE_ROOM_LINKING_NOT_EXISTS",
        "STAFF_INACTIVE",
        "STAFF_NOT_FOUND",
        "STAFF_DIVISION_LINKING_NOT_EXISTS",
        "SERVICE_STAFF_LINKING_NOT_EXISTS",
        "CUSTOMER_NOT_FOUND",
        "STAFF_HAVE_BLOCK_TIME",
        "ROOM_HAVE_BLOCK_TIME",
        "REQUIRED_PRICING_TIER_MATRIX_NOT_FOUND_FOR_STAFF",
        "STAFF_HAVE_ANOTHER_BOOKING",
        "CUSTOMER_ALREADY_HAVE_BOOKING",
        "STAFF_HAVE_CONFLICTING_APPOINTMENT",
        "SERVICE_NOT_FOUND",
        "SERVICE_INACTIVE",
        "REQUIRED_CERTIFICATE_EXPIRED",
        "REQUIRED_CERTIFICATE_NOT_FOUND",
        "ORGANIZER_BASED_BOOKING_CANNOT_BE_BOOKED",
        "BOOKING_VIOLATES_MIN_HOURS_DIFFERENCE_ALLOWED_TIME",
        "BOOKING_VIOLATES_MAX_ADVANCE_BOOKING_ALLOWED_TIME",
        "VACANCY_FULL",
        "USER_NOT_ALLOWED_TO_BOOK",
        "SLOT_NOT_FOUND",
        "STAFF_HAVE_CONFLICTING_CLASS",
        "APPOINTMENT_PER_CUSTOMER_SERVICE_LIMIT_EXCEEDS",
        "APPOINTMENT_PER_CUSTOMER_LIMIT_EXCEEDS",
        "CLASS_NOT_FOUND",
        "CLASS_INACTIVE",
        "SESSION_NOT_FOUND",
        "REGULAR_CLASS_SESSIONS_PER_CUSTOMER_LIMIT_EXCEEDS",
        "REGULAR_CLASS_SESSIONS_PER_CUSTOMER_PER_CLASS_LIMIT_EXCEEDS",
        "STAFF_BLOCKED_FOR_USER",
        "STAFF_ALREADY_HAVE_BOOKING",
        "USER_NOT_ALLOWED_FOR_MEMBERSHIP_CLASS",
        "DROP_IN_NOT_ALLOWED_TO_SERIES",
        "USER_NOT_FOUND",
        "FULL_CLASS_SIGNUP_NOT_ALLOWED",
        "CUSTOMER_ALREADY_ENROLLED_TO_REQUESTED_APPOINTMENT_SLOT",
        "CUSTOMER_ALREADY_ENROLLED_TO_REQUESTED_CLASS",
        "CUSTOMER_ALREADY_ENROLLED_TO_REQUESTED_CLASS_SESSION",
        "CUSTOMER_ALREADY_WAITLISTED_TO_REQUESTED_CLASS",
        "CUSTOMER_ALREADY_WAITLISTED_TO_REQUESTED_CLASS_SESSION"
      ],
      "default": "BOOKING_REASON_UNDEFINED"
    },
    "argonCategory": {
      "type": "object",
      "properties": {
        "program_id": {
          "type": "string",
          "title": "unique identifier of program(fitness/massage...) to which category belongs to"
        },
        "id": {
          "type": "string",
          "title": "unique identifier representing category"
        },
        "name": {
          "type": "string",
          "title": "name of the category"
        },
        "override_min_hours_to_book_appointment": {
          "type": "boolean",
          "format": "boolean",
          "title": "minimum advance notice required to book an in-person/onsite/on-campus appointment\nnote: this setting will override global/location-level settings if set to true"
        },
        "min_hours_to_book_appointment": {
          "type": "integer",
          "format": "int64"
        },
        "override_min_hours_to_book_class": {
          "type": "boolean",
          "format": "boolean",
          "title": "minimum advance notice required to book a in-person/onsite/on-campus class\nnote: this setting will override global/location-level settings if set to true"
        },
        "min_hours_to_book_class": {
          "type": "integer",
          "format": "int64"
        },
        "timestamp": {
          "type": "string",
          "format": "date-time",
          "title": "represents time when the category object was last modified"
        },
        "is_deleted": {
          "type": "boolean",
          "format": "boolean",
          "title": "represents deleted field in appointy"
        },
        "description": {
          "type": "string",
          "title": "description of the category\ncontains html content"
        }
      },
      "title": "Category is used to identify group of services/classes\nwill also function as Pub/Sub object"
    },
    "argonChannel": {
      "type": "string",
      "enum": [
        "IN_PERSON",
        "DIGITAL"
      ],
      "default": "IN_PERSON",
      "title": "medium through which service/appointment/class will be performed/provided"
    },
    "argonClass": {
      "type": "object",
      "properties": {
        "program_id": {
          "type": "string",
          "title": "unique identifier of program(fitness/massage...) where class is scheduled"
        },
        "location_id": {
          "type": "string",
          "title": "unique identifier of location(NewYork/London...) where class is scheduled"
        },
        "division_id": {
          "type": "string",
          "title": "unique identifier of division where class is scheduled"
        },
        "id": {
          "type": "string",
          "title": "unique identifier of class"
        },
        "title": {
          "type": "string",
          "title": "title of class"
        },
        "description": {
          "type": "string",
          "title": "description of class"
        },
        "image_url": {
          "type": "string",
          "title": "image for class"
        },
        "room_code": {
          "type": "string",
          "title": "room in which class can be performed"
        },
        "category_id": {
          "type": "string",
          "title": "category to which class belongs to\noptional. can be empty"
        },
        "class_template_id": {
          "type": "string",
          "title": "class template for which this class was created\noptional. can be empty"
        },
        "is_active": {
          "type": "boolean",
          "format": "boolean",
          "title": "active status of class\nif inactive then class is not available for booking"
        },
        "is_drop_in_allowed": {
          "type": "boolean",
          "format": "boolean",
          "title": "series classes only\nallows to book individual sessions of series class"
        },
        "flexible_drop_in": {
          "type": "boolean",
          "format": "boolean",
          "title": "allows user to drop-in freely in any session of class(series/regular)\nIn Regular class: always true\nIn Series class: false =\u003e only next future session signup (default case)\n               : true  =\u003e any future session signup"
        },
        "is_membership_based": {
          "type": "boolean",
          "format": "boolean",
          "title": "class can be purchased only through memberships\nif false: fixed pricing is used for class"
        },
        "only_allow_first_series_session_signup": {
          "type": "boolean",
          "format": "boolean",
          "title": "In Series class: false =\u003e normal flow\n               : true  =\u003e only first series session allowed for signup and waiting clear process"
        },
        "class_price": {
          "$ref": "#/definitions/argonClassPrice",
          "title": "pricing of class\noptional. null if class is membership based"
        },
        "pre_requisite_template_ids": {
          "type": "array",
          "items": {
            "type": "string"
          },
          "title": "for sign-up at least one session should be signed up for each pre-requisite templates"
        },
        "max_booking_per_customer": {
          "type": "integer",
          "format": "int64",
          "title": "maximum future booking allowed for class"
        },
        "certificates_required": {
          "type": "array",
          "items": {
            "type": "string"
          },
          "title": "certificate required to perform the class"
        },
        "channels": {
          "type": "array",
          "items": {
            "$ref": "#/definitions/argonChannel"
          },
          "title": "medium(IN_PERSON/DIGITAL) through which class will be provided"
        },
        "class_type": {
          "$ref": "#/definitions/argonClassType",
          "title": "type(REGULAR/SERIES) defines the way a class can be booked by customer\nREGULAR or RECURRING classes can only be booked one session at a time\nSERIES classes can be booked for single session or all sessions in one go"
        },
        "difficulty": {
          "$ref": "#/definitions/argonDifficulty",
          "title": "difficulty(BEGINNER, INTERMEDIATE or ADVANCED) of class"
        },
        "goals": {
          "type": "array",
          "items": {
            "$ref": "#/definitions/argonGoal"
          },
          "title": "goals of class"
        },
        "interest_areas": {
          "type": "array",
          "items": {
            "$ref": "#/definitions/argonInterestArea"
          },
          "title": "interest areas of class"
        },
        "capacity": {
          "$ref": "#/definitions/argonClassCapacity",
          "title": "capacity(CONFIRMED/WAITING) represents the number of customers that can book the class"
        },
        "class_sessions": {
          "type": "array",
          "items": {
            "$ref": "#/definitions/argonClassSession"
          },
          "title": "deprecated: with fetch empty sessions. Use ClassSessions endpoint to fetch sessions.\nclass sessions represents the bookable entities of class available for booking by customers\nthese store the information of time-range, service-providers, and customers"
        },
        "class_status": {
          "$ref": "#/definitions/argonClassStatus",
          "title": "status of class"
        },
        "g2g": {
          "type": "boolean",
          "format": "boolean",
          "title": "g2g filter used by google team internally"
        },
        "service_provider_ids": {
          "type": "array",
          "items": {
            "type": "string"
          },
          "title": "unique identifier of service-providers conducting/performing the class"
        },
        "available_capacity": {
          "$ref": "#/definitions/argonClassCapacity",
          "title": "available_capacity(CONFIRMED/WAITING) represents the number of slots available for customers to book the class"
        },
        "min_hours_to_book": {
          "type": "integer",
          "format": "int64",
          "description": "setting: minimum advance notice required to book a class/clas-session.\nthe settings includes category based rules as well."
        },
        "activity": {
          "type": "string",
          "title": "activity associated with class"
        },
        "tags": {
          "type": "array",
          "items": {
            "type": "string"
          },
          "title": "tags of class"
        },
        "timestamp": {
          "type": "string",
          "format": "date-time",
          "title": "represents time when the class object was last modified"
        },
        "is_deleted": {
          "type": "boolean",
          "format": "boolean",
          "title": "represents deleted field in appointy"
        }
      },
      "title": "Classes + Sessions\nwill also function as Pub/Sub object"
    },
    "argonClassBookingPossibility": {
      "type": "object",
      "properties": {
        "class_id": {
          "type": "string"
        },
        "class_booking_status": {
          "$ref": "#/definitions/argonClassBookingStatus"
        },
        "reasons": {
          "type": "array",
          "items": {
            "$ref": "#/definitions/argonBookingReason"
          }
        }
      }
    },
    "argonClassBookingStatus": {
      "type": "string",
      "enum": [
        "CLASS_BOOKING_STATUS_UNDEFINED",
        "CLASS_BOOKING_CONFIRMED",
        "CLASS_BOOKING_WAITING",
        "CLASS_BOOKING_UNAVAILABLE"
      ],
      "default": "CLASS_BOOKING_STATUS_UNDEFINED"
    },
    "argonClassCancellationAndLeadPolicySettings": {
      "type": "object",
      "properties": {
        "cancel_before_payment_in_hours": {
          "type": "integer",
          "format": "int64",
          "title": "how many hours before a class should the class-booking be cancelled if no payment is received"
        },
        "advance_booking_allowed_before_weeks": {
          "type": "integer",
          "format": "int64",
          "title": "how far in advance can users book a class"
        },
        "min_hours_to_book": {
          "type": "integer",
          "format": "int64",
          "title": "minimum advance notice required to book a class\nnote: this setting will be overridden by settings set at category or digital/in-person filter level"
        },
        "min_hours_to_book_in_person": {
          "type": "integer",
          "format": "int64",
          "title": "minimum advance notice required to book an in-person/onsite/on-campus class\nnote: this setting will be overridden by settings set at category level"
        },
        "min_hours_to_book_digital": {
          "type": "integer",
          "format": "int64",
          "title": "minimum advance notice required to book a digital class\nnote: this setting will be overridden by settings set at category level"
        }
      },
      "title": "Lead and Cancellation Policy settings for class bookings"
    },
    "argonClassCapacity": {
      "type": "object",
      "properties": {
        "confirmed": {
          "type": "integer",
          "format": "int32",
          "title": "confirmed slots available for booking"
        },
        "waiting": {
          "type": "integer",
          "format": "int32",
          "title": "waiting slots available for booking\nif some customer cancels a confirmed booking, then waiting customer's booking is confirmed\nwaiting is cleared in FIFO method"
        }
      }
    },
    "argonClassCustomer": {
      "type": "object",
      "properties": {
        "id": {
          "type": "string",
          "title": "unique identifier of customer"
        },
        "email": {
          "type": "string",
          "title": "email of customer"
        },
        "first_name": {
          "type": "string",
          "title": "first name of customer"
        },
        "last_name": {
          "type": "string",
          "title": "last name of customer"
        },
        "class_customer_status": {
          "$ref": "#/definitions/argonClassCustomerStatus",
          "title": "status of customer"
        },
        "user_deleted_status": {
          "type": "boolean",
          "format": "boolean",
          "title": "represents if user was deleted in the Appointy system and is not associated with Google any more"
        },
        "waitlist_rank": {
          "type": "integer",
          "format": "int64",
          "description": "represents the rank in wailist, if rank is n, then n confirmed customers need to dropout before the user is confirmed."
        }
      },
      "title": "details of customer who has booked an appointment"
    },
    "argonClassCustomerStatus": {
      "type": "string",
      "enum": [
        "CLASS_CUSTOMER_CONFIRMED",
        "CLASS_CUSTOMER_WAITING",
        "CLASS_CUSTOMER_CANCELLED",
        "CLASS_CUSTOMER_NO_SHOW",
        "CLASS_CUSTOMER_CHECK_IN",
        "CLASS_CUSTOMER_LATE_CANCELLED"
      ],
      "default": "CLASS_CUSTOMER_CONFIRMED"
    },
    "argonClassNode": {
      "type": "object",
      "properties": {
        "cursor": {
          "type": "string"
        },
        "class": {
          "$ref": "#/definitions/argonClass"
        }
      }
    },
    "argonClassPrice": {
      "type": "object",
      "properties": {
        "full_class_price": {
          "type": "number",
          "format": "double",
          "title": "value is used to identify the amount to be charged for full class booking"
        },
        "single_session_price": {
          "type": "number",
          "format": "double",
          "title": "value is used to identify the amount to be charged for single session booking"
        },
        "currency_code": {
          "$ref": "#/definitions/argonCurrencyCode",
          "title": "IANA(ISO-4217) CurrencyCode"
        }
      }
    },
    "argonClassSession": {
      "type": "object",
      "properties": {
        "id": {
          "type": "string",
          "title": "unique identifier of class-session"
        },
        "class_id": {
          "type": "string",
          "title": "unique identifier of class to which class-session belongs"
        },
        "start_time": {
          "type": "string",
          "format": "date-time",
          "title": "timeslot between which the class-session is scheduled"
        },
        "end_time": {
          "type": "string",
          "format": "date-time"
        },
        "session_status": {
          "$ref": "#/definitions/argonSessionStatus",
          "title": "status of class-session"
        },
        "service_provider_ids": {
          "type": "array",
          "items": {
            "type": "string"
          },
          "title": "unique identifier of service-providers conducting/performing the class-session"
        },
        "class_customers": {
          "type": "array",
          "items": {
            "$ref": "#/definitions/argonClassCustomer"
          },
          "title": "customers who have booked the class-session"
        },
        "is_bookable": {
          "type": "boolean",
          "format": "boolean",
          "description": "represents if a class session is available for booking by the user."
        },
        "available_capacity": {
          "$ref": "#/definitions/argonClassCapacity",
          "title": "available_capacity(CONFIRMED/WAITING) represents the number of slots available for customers to book the class-session"
        },
        "timestamp": {
          "type": "string",
          "format": "date-time",
          "title": "represents time when the class-session object was last modified"
        },
        "is_deleted": {
          "type": "boolean",
          "format": "boolean",
          "title": "represents deleted field in appointy"
        }
      },
      "title": "class sessions represents the bookable entities of class available for booking by customers\nwill also function as Pub/Sub object"
    },
    "argonClassSessionBookingPossibility": {
      "type": "object",
      "properties": {
        "class_session_id": {
          "type": "string"
        },
        "class_session_booking_status": {
          "$ref": "#/definitions/argonClassSessionBookingStatus"
        },
        "reasons": {
          "type": "array",
          "items": {
            "$ref": "#/definitions/argonBookingReason"
          }
        }
      }
    },
    "argonClassSessionBookingStatus": {
      "type": "string",
      "enum": [
        "CLASS_SESSION_BOOKING_STATUS_UNDEFINED",
        "CLASS_SESSION_BOOKING_CONFIRMED",
        "CLASS_SESSION_BOOKING_WAITING",
        "CLASS_SESSION_BOOKING_UNAVAILABLE"
      ],
      "default": "CLASS_SESSION_BOOKING_STATUS_UNDEFINED"
    },
    "argonClassSessionNode": {
      "type": "object",
      "properties": {
        "cursor": {
          "type": "string"
        },
        "class_session": {
          "$ref": "#/definitions/argonClassSession"
        }
      }
    },
    "argonClassStatus": {
      "type": "string",
      "enum": [
        "CLASS_BOOKED",
        "CLASS_CANCELLED",
        "CLASS_WAIT_LIST_AVAILABLE",
        "CLASS_UNAVAILABLE"
      ],
      "default": "CLASS_BOOKED"
    },
    "argonClassType": {
      "type": "string",
      "enum": [
        "SINGLE",
        "SERIES",
        "RECURRING"
      ],
      "default": "SINGLE"
    },
    "argonCurrencyCode": {
      "type": "string",
      "enum": [
        "UNKNOWN",
        "AED",
        "AFN",
        "ALL",
        "AMD",
        "ANG",
        "AOA",
        "ARS",
        "AUD",
        "AWG",
        "AZN",
        "BAM",
        "BBD",
        "BDT",
        "BGN",
        "BHD",
        "BIF",
        "BMD",
        "BND",
        "BOB",
        "BOV",
        "BRL",
        "BSD",
        "BTN",
        "BWP",
        "BYN",
        "BZD",
        "CAD",
        "CDF",
        "CHE",
        "CHF",
        "CHW",
        "CLF",
        "CLP",
        "COP",
        "COU",
        "CRC",
        "CUC",
        "CUP",
        "CVE",
        "CZK",
        "DJF",
        "DKK",
        "DOP",
        "DZD",
        "EGP",
        "ERN",
        "ETB",
        "EUR",
        "FJD",
        "FKP",
        "GBP",
        "GEL",
        "GHS",
        "GIP",
        "GMD",
        "GNF",
        "GTQ",
        "GYD",
        "HKD",
        "HNL",
        "HRK",
        "HTG",
        "HUF",
        "IDR",
        "ILS",
        "INR",
        "IQD",
        "IRR",
        "ISK",
        "JMD",
        "JOD",
        "JPY",
        "KES",
        "KGS",
        "KHR",
        "KMF",
        "KPW",
        "KRW",
        "KWD",
        "KYD",
        "KZT",
        "LAK",
        "LBP",
        "LKR",
        "LRD",
        "LSL",
        "LYD",
        "MAD",
        "MDL",
        "MGA",
        "MKD",
        "MMK",
        "MNT",
        "MOP",
        "MRU",
        "MUR",
        "MVR",
        "MWK",
        "MXN",
        "MXV",
        "MYR",
        "MZN",
        "NAD",
        "NGN",
        "NIO",
        "NOK",
        "NPR",
        "NZD",
        "OMR",
        "PAB",
        "PEN",
        "PGK",
        "PHP",
        "PKR",
        "PLN",
        "PYG",
        "QAR",
        "RON",
        "RSD",
        "CNY",
        "RUB",
        "RWF",
        "SAR",
        "SBD",
        "SCR",
        "SDG",
        "SEK",
        "SGD",
        "SHP",
        "SLL",
        "SLE",
        "SOS",
        "SRD",
        "SSP",
        "STN",
        "SVC",
        "SYP",
        "SZL",
        "THB",
        "TJS",
        "TMT",
        "TND",
        "TOP",
        "TRY",
        "TTD",
        "TWD",
        "TZS",
        "UAH",
        "UGX",
        "USD",
        "USN",
        "UYI",
        "UYU",
        "UYW",
        "UZS",
        "VED",
        "VES",
        "VND",
        "VUV",
        "WST",
        "XAF",
        "XAG",
        "XAU",
        "XBA",
        "XBB",
        "XBC",
        "XBD",
        "XCD",
        "XDR",
        "XOF",
        "XPD",
        "XPF",
        "XPT",
        "XSU",
        "XTS",
        "XUA",
        "XXX",
        "YER",
        "ZAR",
        "ZMW",
        "ZWL"
      ],
      "default": "UNKNOWN",
      "title": "source: https://en.wikipedia.org/wiki/ISO_4217#Active_codes (dated: Aug 2022)"
    },
    "argonDifficulty": {
      "type": "string",
      "enum": [
        "ALL_LEVELS",
        "BEGINNER",
        "INTERMEDIATE",
        "ADVANCE"
      ],
      "default": "ALL_LEVELS"
    },
    "argonEquipmentType": {
      "type": "string",
      "enum": [
        "CHAIR",
        "MAT",
        "TABLE"
      ],
      "default": "CHAIR"
    },
    "argonGoal": {
      "type": "string",
      "enum": [
        "QUICK_MENTAL_RESET",
        "BOOST_ENERGY",
        "LOSE_WEIGHT",
        "IMPROVE_APPEARANCE",
        "IMPROVE_MOOD",
        "INCREASE_FOCUS",
        "IMPROVE_COGNITION",
        "CONTROL_PAIN",
        "RELAX_AND_RECOVER",
        "IMPROVE_STRESS_MANAGEMENT",
        "BE_PHYSICALLY_HEALTHY",
        "INCREASE_ATHLETIC_PERFORMANCE"
      ],
      "default": "QUICK_MENTAL_RESET"
    },
    "argonInterestArea": {
      "type": "string",
      "enum": [
        "TRAINING",
        "YOGA",
        "PILATES",
        "DANCE",
        "MARTIAL_ARTS",
        "EDUCATION",
        "FUNCTIONAL_MOVEMENT_TRAINING",
        "GYMNASTICS",
        "HYPERTROPHY",
        "MOBILITY",
        "OLYMPIC_LIFTING",
        "POST_INJURY_REHABILITATION_OR_CORRECTIONAL_EXERCISE",
        "POWERLIFTING",
        "PRE_POST_NATAL",
        "SPORTS_SPECIFIC",
        "STRENGTH_AND_CONDITIONING",
        "WEIGHT_LOSS_OR_WEIGHT_MANAGEMENT",
        "WELLNESS_COACHING",
        "CARDIO",
        "PILATES_REFORMER",
        "SWIM"
      ],
      "default": "TRAINING"
    },
    "argonListAppointmentSlotsRequest": {
      "type": "object",
      "properties": {
        "program_id": {
          "type": "string",
          "title": "unique identifier of program(fitness/massage...) to which appointment slot belongs"
        },
        "appointment_slot_ids": {
          "type": "array",
          "items": {
            "type": "string"
          },
          "title": "appointment slot ids for filtered response\noptional\nresponse will be in same order\nfor invalid id, null will be returned"
        },
        "start_time": {
          "type": "string",
          "format": "date-time",
          "title": "timeslot between which the appointment slots are to be fetched\noptional"
        },
        "end_time": {
          "type": "string",
          "format": "date-time"
        },
        "cursor": {
          "type": "string",
          "title": "cursor after which the data should be pulled"
        },
        "count": {
          "type": "integer",
          "format": "int64",
          "title": "number of objects to be pulled"
        },
        "publishing_data": {
          "type": "boolean",
          "format": "boolean",
          "title": "flag to transform response for publishing"
        }
      }
    },
    "argonListAppointmentSlotsResponse": {
      "type": "object",
      "properties": {
        "appointment_slot_nodes": {
          "type": "array",
          "items": {
            "$ref": "#/definitions/argonAppointmentSlotNode"
          },
          "title": "list of appointment slots"
        },
        "page_info": {
          "$ref": "#/definitions/argonPageInfo",
          "description": "PageInfo contains information that will be used to fetch next request."
        }
      }
    },
    "argonListAppointmentsRequest": {
      "type": "object",
      "properties": {
        "program_id": {
          "type": "string",
          "title": "unique identifier of program(fitness/massage...) to which service provider belongs"
        },
        "appointment_ids": {
          "type": "array",
          "items": {
            "type": "string"
          },
          "title": "appointment ids for filtered response\noptional\nresponse will be in same order\nfor invalid id, null will be returned"
        },
        "start_time": {
          "type": "string",
          "format": "date-time",
          "title": "timeslot between which the appointments are to be fetched\noptional"
        },
        "end_time": {
          "type": "string",
          "format": "date-time"
        },
        "cursor": {
          "type": "string",
          "title": "cursor after which the data should be pulled"
        },
        "count": {
          "type": "integer",
          "format": "int64",
          "title": "number of objects to be pulled"
        },
        "publishing_data": {
          "type": "boolean",
          "format": "boolean",
          "title": "flag to transform response for publishing"
        }
      }
    },
    "argonListAppointmentsResponse": {
      "type": "object",
      "properties": {
        "appointment_nodes": {
          "type": "array",
          "items": {
            "$ref": "#/definitions/argonAppointmentNode"
          },
          "title": "list of appointments"
        },
        "page_info": {
          "$ref": "#/definitions/argonPageInfo",
          "description": "PageInfo contains information that will be used to fetch next request."
        }
      }
    },
    "argonListBlockTimesOfRoomsRequest": {
      "type": "object",
      "properties": {
        "program_id": {
          "type": "string",
          "title": "unique identifier of program(fitness/massage...) to which block times belongs"
        },
        "room_codes": {
          "type": "array",
          "items": {
            "type": "string"
          },
          "title": "room codes for filtered response\noptional\nresponse will be in same order\nfor invalid id, null will be returned"
        }
      }
    },
    "argonListBlockTimesOfRoomsResponse": {
      "type": "object",
      "properties": {
        "block_times_of_room": {
          "type": "array",
          "items": {
            "$ref": "#/definitions/argonBlockTimeServiceRoom"
          }
        }
      }
    },
    "argonListBlockTimesOfServiceProvidersRequest": {
      "type": "object",
      "properties": {
        "program_id": {
          "type": "string",
          "title": "unique identifier of program(fitness/massage...) to which block times belongs"
        },
        "service_provider_ids": {
          "type": "array",
          "items": {
            "type": "string"
          },
          "title": "service provider ids for filtered response\noptional\nresponse will be in same order\nfor invalid id, null will be returned"
        }
      }
    },
    "argonListBlockTimesOfServiceProvidersResponse": {
      "type": "object",
      "properties": {
        "block_times_of_service_providers": {
          "type": "array",
          "items": {
            "$ref": "#/definitions/argonBlockTimeServiceProvider"
          }
        }
      }
    },
    "argonListCategoriesRequest": {
      "type": "object",
      "properties": {
        "program_id": {
          "type": "string",
          "title": "unique identifier of program(fitness/massage...) to which category belongs"
        },
        "category_ids": {
          "type": "array",
          "items": {
            "type": "string"
          },
          "title": "category ids for filtered response\noptional\nresponse will be in same order\nfor invalid id, null will be returned"
        },
        "publishing_data": {
          "type": "boolean",
          "format": "boolean",
          "title": "flag to transform response for publishing"
        }
      }
    },
    "argonListCategoriesResponse": {
      "type": "object",
      "properties": {
        "categories": {
          "type": "array",
          "items": {
            "$ref": "#/definitions/argonCategory"
          }
        }
      }
    },
    "argonListClassSessionsRequest": {
      "type": "object",
      "properties": {
        "program_id": {
          "type": "string",
          "title": "unique identifier of program(fitness/massage...) to which service provider belongs"
        },
        "class_session_ids": {
          "type": "array",
          "items": {
            "type": "string"
          },
          "title": "class session ids for filtered response\nresponse will be in same order\nfor invalid id, null will be returned\noptional"
        },
        "class_ids": {
          "type": "array",
          "items": {
            "type": "string"
          },
          "title": "class ids for filtered response\nclass sessions corresponding to each class will be returned\ninvalid ids will be skipped, and no error response will be generated\noptional"
        },
        "start_time": {
          "type": "string",
          "format": "date-time",
          "title": "timeslot between which the classes are to be fetched\noptional"
        },
        "end_time": {
          "type": "string",
          "format": "date-time"
        },
        "cursor": {
          "type": "string",
          "title": "cursor after which the data should be pulled"
        },
        "count": {
          "type": "integer",
          "format": "int64",
          "title": "number of objects to be pulled"
        },
        "publishing_data": {
          "type": "boolean",
          "format": "boolean",
          "title": "flag to transform response for publishing"
        }
      }
    },
    "argonListClassSessionsResponse": {
      "type": "object",
      "properties": {
        "class_session_nodes": {
          "type": "array",
          "items": {
            "$ref": "#/definitions/argonClassSessionNode"
          },
          "title": "list of class-sessions"
        },
        "page_info": {
          "$ref": "#/definitions/argonPageInfo",
          "description": "PageInfo contains information that will be used to fetch next request."
        }
      }
    },
    "argonListClassesRequest": {
      "type": "object",
      "properties": {
        "program_id": {
          "type": "string",
          "title": "unique identifier of program(fitness/massage...) to which class belongs"
        },
        "class_ids": {
          "type": "array",
          "items": {
            "type": "string"
          },
          "title": "class ids for filtered response\noptional\nresponse will be in same order\nfor invalid id, null will be returned"
        },
        "start_time": {
          "type": "string",
          "format": "date-time",
          "title": "timeslot between which the classes are to be fetched\noptional"
        },
        "end_time": {
          "type": "string",
          "format": "date-time"
        },
        "cursor": {
          "type": "string",
          "title": "cursor after which the data should be pulled"
        },
        "count": {
          "type": "integer",
          "format": "int64",
          "title": "number of objects to be pulled"
        },
        "list_class_sessions": {
          "type": "boolean",
          "format": "boolean",
          "title": "if true, list all class sessions for each class"
        },
        "publishing_data": {
          "type": "boolean",
          "format": "boolean",
          "title": "flag to transform response for publishing"
        }
      }
    },
    "argonListClassesResponse": {
      "type": "object",
      "properties": {
        "class_nodes": {
          "type": "array",
          "items": {
            "$ref": "#/definitions/argonClassNode"
          },
          "title": "list of classes"
        },
        "page_info": {
          "$ref": "#/definitions/argonPageInfo",
          "description": "PageInfo contains information that will be used to fetch next request."
        }
      }
    },
    "argonListMassageAppointmentSlotsResponse": {
      "type": "object",
      "properties": {
        "appointment_slot_nodes": {
          "type": "array",
          "items": {
            "$ref": "#/definitions/argonMassageAppointmentSlotNode"
          },
          "title": "list of appointment slots"
        },
        "page_info": {
          "$ref": "#/definitions/argonPageInfo",
          "description": "PageInfo contains information that will be used to fetch next request."
        }
      }
    },
    "argonListMassageAppointmentsResponse": {
      "type": "object",
      "properties": {
        "appointment_nodes": {
          "type": "array",
          "items": {
            "$ref": "#/definitions/argonMassageAppointmentNode"
          },
          "title": "list of appointments"
        },
        "page_info": {
          "$ref": "#/definitions/argonPageInfo",
          "description": "PageInfo contains information that will be used to fetch next request."
        }
      }
    },
    "argonListServiceProvidersRequest": {
      "type": "object",
      "properties": {
        "program_id": {
          "type": "string",
          "title": "unique identifier of program(fitness/massage...) to which service provider belongs"
        },
        "service_provider_ids": {
          "type": "array",
          "items": {
            "type": "string"
          },
          "title": "service provider ids for filtered response\noptional\nresponse will be in same order\nfor invalid id, null will be returned"
        },
        "cursor": {
          "type": "string",
          "title": "cursor after which the data should be pulled"
        },
        "count": {
          "type": "integer",
          "format": "int64",
          "title": "number of objects to be pulled"
        },
        "publishing_data": {
          "type": "boolean",
          "format": "boolean",
          "title": "flag to transform response for publishing"
        }
      }
    },
    "argonListServiceProvidersResponse": {
      "type": "object",
      "properties": {
        "service_provider_nodes": {
          "type": "array",
          "items": {
            "$ref": "#/definitions/argonServiceProviderNode"
          },
          "title": "list of service providers"
        },
        "page_info": {
          "$ref": "#/definitions/argonPageInfo",
          "description": "PageInfo contains information that will be used to fetch next request."
        }
      }
    },
    "argonListServicesRequest": {
      "type": "object",
      "properties": {
        "program_id": {
          "type": "string",
          "title": "unique identifier of program(fitness/massage...) to which service belongs"
        },
        "service_ids": {
          "type": "array",
          "items": {
            "type": "string"
          },
          "title": "service ids for filtered response\noptional\nresponse will be in same order\nfor invalid id, null will be returned"
        },
        "cursor": {
          "type": "string",
          "title": "cursor after which the data should be pulled"
        },
        "count": {
          "type": "integer",
          "format": "int64",
          "title": "number of objects to be pulled"
        },
        "publishing_data": {
          "type": "boolean",
          "format": "boolean",
          "title": "flag to transform response for publishing"
        }
      }
    },
    "argonListServicesResponse": {
      "type": "object",
      "properties": {
        "service_nodes": {
          "type": "array",
          "items": {
            "$ref": "#/definitions/argonServiceNode"
          },
          "title": "list of services"
        },
        "page_info": {
          "$ref": "#/definitions/argonPageInfo",
          "description": "PageInfo contains information that will be used to fetch next request."
        }
      }
    },
    "argonListSettingsRequest": {
      "type": "object",
      "properties": {
        "program_id": {
          "type": "string",
          "title": "unique identifier of program(fitness/massage...) to which settings belongs"
        },
        "location_id": {
          "type": "string",
          "title": "unique identifier of location(NewYork/London...) to which settings belongs to\noptional. empty value wil fetch global/program level settings"
        },
        "fetch_all_location_level": {
          "type": "boolean",
          "format": "boolean",
          "title": "to fetch all overridden location level settings along with global/program settings"
        },
        "publishing_data": {
          "type": "boolean",
          "format": "boolean",
          "title": "flag to transform response for publishing"
        }
      }
    },
    "argonListSettingsResponse": {
      "type": "object",
      "properties": {
        "settings": {
          "type": "array",
          "items": {
            "$ref": "#/definitions/argonSettings"
          }
        }
      }
    },
    "argonMassageAppointment": {
      "type": "object",
      "properties": {
        "program_id": {
          "type": "string",
          "title": "unique identifier of program(massage...) where service/appointment is scheduled"
        },
        "location_id": {
          "type": "string",
          "title": "unique identifier of location(NewYork/London...) where service/appointment is scheduled"
        },
        "division_id": {
          "type": "string",
          "title": "unique identifier of division where service/appointment is scheduled"
        },
        "id": {
          "type": "string",
          "title": "unique identifier of booking/appointment"
        },
        "start_time": {
          "type": "string",
          "format": "date-time",
          "title": "timeslot between which the appointment is scheduled"
        },
        "end_time": {
          "type": "string",
          "format": "date-time"
        },
        "service_provider_id": {
          "type": "string",
          "title": "unique identifier of service provider conducting/performing the service/appointment"
        },
        "room_code": {
          "type": "string",
          "title": "unique identifier of room where service/appointment is scheduled"
        },
        "service_id": {
          "type": "string",
          "title": "unique identifier of service for which booking/appointment is scheduled"
        },
        "equipment_type": {
          "$ref": "#/definitions/argonEquipmentType",
          "title": "participation(MAT/CHAIR/TABLE) for booking/appointment"
        },
        "channel": {
          "$ref": "#/definitions/argonChannel",
          "title": "medium(IN_PERSON/DIGITAL) in which booking/appointment is scheduled"
        },
        "appointment_status": {
          "$ref": "#/definitions/argonAppointmentStatus",
          "title": "status of appointment"
        },
        "appointment_customers": {
          "type": "array",
          "items": {
            "$ref": "#/definitions/argonAppointmentCustomer"
          },
          "title": "details of customers who have booked the appointment"
        },
        "appointment_slot_id": {
          "type": "string",
          "title": "unique identifier of AppointmentSlot"
        },
        "timestamp": {
          "type": "string",
          "format": "date-time",
          "title": "represents time when the appointment object was last modified"
        },
        "is_deleted": {
          "type": "boolean",
          "format": "boolean",
          "title": "represents deleted field in appointy"
        },
        "is_prenatal": {
          "type": "boolean",
          "format": "boolean",
          "title": "this represent slot as prenatal in case of massage"
        },
        "price": {
          "$ref": "#/definitions/argonAppointmentPrice"
        }
      }
    },
    "argonMassageAppointmentNode": {
      "type": "object",
      "properties": {
        "cursor": {
          "type": "string"
        },
        "appointment": {
          "$ref": "#/definitions/argonMassageAppointment"
        }
      }
    },
    "argonMassageAppointmentPrice": {
      "type": "object",
      "properties": {
        "base_price": {
          "$ref": "#/definitions/argonRegularAndDiscountedPricing"
        },
        "employee_type_pricing": {
          "type": "object",
          "additionalProperties": {
            "$ref": "#/definitions/argonRegularAndDiscountedPricing"
          },
          "title": "key : employee type string (employee,vendor,intern,google friend.....)\nvalue : RegularAndDiscountedPricing"
        }
      }
    },
    "argonMassageAppointmentSlot": {
      "type": "object",
      "properties": {
        "program_id": {
          "type": "string",
          "title": "unique identifier of program(fitness/massage...) where bookable-slot is available"
        },
        "location_id": {
          "type": "string",
          "title": "unique identifier of location(NewYork/London...) where bookable-slot is available"
        },
        "division_id": {
          "type": "string",
          "title": "unique identifier of division where bookable-slot is available"
        },
        "id": {
          "type": "string",
          "title": "unique identifier of bookable-slot for appointment scheduling"
        },
        "start_time": {
          "type": "string",
          "format": "date-time",
          "title": "timeslot between which the appointment is scheduled"
        },
        "end_time": {
          "type": "string",
          "format": "date-time"
        },
        "service_provider_id": {
          "type": "string",
          "title": "unique identifier of service provider in bookable-slot for appointment scheduling"
        },
        "room_code": {
          "type": "string",
          "title": "unique identifier of room where bookable-slot is available"
        },
        "service_id": {
          "type": "string",
          "title": "unique identifier of service in bookable-slot for appointment scheduling"
        },
        "equipment_type": {
          "$ref": "#/definitions/argonEquipmentType",
          "title": "participation(MAT/CHAIR/TABLE) for booking/appointment"
        },
        "equipment_type_id": {
          "type": "string",
          "title": "participation-id for (MAT/CHAIR/TABLE) for booking/appointment\nin appointy used as channel_id for loading slots"
        },
        "channel": {
          "$ref": "#/definitions/argonChannel",
          "title": "medium(IN_PERSON/DIGITAL) in which booking/appointment is scheduled"
        },
        "bookable_capacity": {
          "type": "integer",
          "format": "int32",
          "title": "total capacity for booking in appointment-slot"
        },
        "massage_appointment_price": {
          "$ref": "#/definitions/argonMassageAppointmentPrice",
          "title": "price of bookable-slot for appointment scheduling"
        },
        "appointment_slot_status": {
          "$ref": "#/definitions/argonAppointmentSlotStatus",
          "description": "represents if a appointment slot is available for booking by the user."
        },
        "available_capacity": {
          "type": "integer",
          "format": "int32",
          "title": "available_capacity represents the number of slots available for customers to book the appointment-slot"
        },
        "is_organizer_based": {
          "type": "boolean",
          "format": "boolean",
          "title": "represents if the appointment slot is organizer based or not"
        },
        "timestamp": {
          "type": "string",
          "format": "date-time",
          "title": "represents time when the appointment-slot object was last modified"
        },
        "is_deleted": {
          "type": "boolean",
          "format": "boolean",
          "title": "represents deleted field in appointy"
        },
        "is_prenatal": {
          "type": "boolean",
          "format": "boolean",
          "title": "this represent slot as prenatal in case of massage"
        },
        "is_reserved": {
          "type": "boolean",
          "format": "boolean"
        },
        "is_premium": {
          "type": "boolean",
          "format": "boolean"
        },
        "is_private": {
          "type": "boolean",
          "format": "boolean"
        }
      }
    },
    "argonMassageAppointmentSlotNode": {
      "type": "object",
      "properties": {
        "cursor": {
          "type": "string"
        },
        "appointment_slot": {
          "$ref": "#/definitions/argonMassageAppointmentSlot"
        }
      }
    },
    "argonMassageBookingRestrictions": {
      "type": "object",
      "properties": {
        "max_chair_massage": {
          "type": "integer",
          "format": "int64",
          "title": "maximum chair based future booking allowed from current time to next 3 months"
        },
        "max_non_chair_massage": {
          "type": "integer",
          "format": "int64",
          "title": "maximum non-chair based future booking allowed from current time to next 3 months"
        },
        "same_day_restriction": {
          "type": "boolean",
          "format": "boolean",
          "title": "this setting represents if max_booking_per_customer,max_chair_massage,max_non_chair_massage to applied if trying to book same day appointments"
        },
        "number_of_discounted_booking": {
          "type": "integer",
          "format": "int64",
          "title": "maximum number of bookings that can be booked at discounted price in a year per in a program (only in massage)"
        }
      }
    },
    "argonPageInfo": {
      "type": "object",
      "properties": {
        "has_next": {
          "type": "boolean",
          "format": "boolean",
          "title": "HasNext specifies if more nodes exists after the current response based on arguments"
        },
        "next_cursor": {
          "type": "string",
          "title": "NextCursor specifies the value used to call next page data"
        }
      }
    },
    "argonParticipationType": {
      "type": "string",
      "enum": [
        "INDIVIDUAL",
        "BUDDY",
        "GROUP"
      ],
      "default": "INDIVIDUAL",
      "title": "participation(allowed capacity) for service/appointment"
    },
    "argonRegularAndDiscountedPricing": {
      "type": "object",
      "properties": {
        "regular_price": {
          "$ref": "#/definitions/argonAppointmentPrice"
        },
        "discounted_price": {
          "$ref": "#/definitions/argonAppointmentPrice",
          "title": "a googler can book x number of appointments at discounted pricing a year"
        }
      }
    },
    "argonRegularClassBookingRestriction": {
      "type": "object",
      "properties": {
        "max_booking_per_class_per_customer": {
          "type": "integer",
          "format": "int64",
          "title": "maximum future booking allowed for any one regular/recurring class"
        },
        "max_booking_per_customer": {
          "type": "integer",
          "format": "int64",
          "title": "maximum future booking allowed for all regular/recurring classes combined"
        }
      },
      "title": "future booking restriction on booking of regular/recurring classes"
    },
    "argonSendAppointmentInviteRequest": {
      "type": "object",
      "properties": {
        "appointment_id": {
          "type": "string",
          "title": "unique identifier for Appointment Booking for customer"
        },
        "invite_to_email": {
          "type": "string",
          "title": "email address which will receive the invite link"
        },
        "invited_by_email": {
          "type": "string",
          "title": "email address which generated the invite link"
        }
      }
    },
    "argonSendAppointmentInviteResponse": {
      "type": "object",
      "properties": {
        "success": {
          "type": "boolean",
          "format": "boolean"
        },
        "message": {
          "type": "string"
        }
      }
    },
    "argonService": {
      "type": "object",
      "properties": {
        "program_id": {
          "type": "string",
          "title": "unique identifier of program(fitness/massage...) to which service belongs to"
        },
        "location_id": {
          "type": "string",
          "title": "unique identifier of location(NewYork/London...) to which service belongs to"
        },
        "id": {
          "type": "string",
          "title": "unique identifier representing service"
        },
        "title": {
          "type": "string",
          "title": "title of service"
        },
        "description": {
          "type": "string",
          "title": "description of service"
        },
        "image_url": {
          "type": "string",
          "title": "image for service"
        },
        "category_id": {
          "type": "string",
          "title": "category to which service belongs to\noptional. can be empty"
        },
        "linked_rooms": {
          "type": "array",
          "items": {
            "type": "string"
          },
          "title": "rooms(room-codes) in which service can be performed"
        },
        "linked_service_providers": {
          "type": "array",
          "items": {
            "type": "string"
          },
          "title": "service-providers(ids) which provide the service"
        },
        "certificates_required": {
          "type": "array",
          "items": {
            "type": "string"
          },
          "title": "certificate required to perform the service"
        },
        "channels": {
          "type": "array",
          "items": {
            "$ref": "#/definitions/argonChannel"
          },
          "title": "medium(IN_PERSON/DIGITAL) through which service will be provided"
        },
        "difficulty": {
          "$ref": "#/definitions/argonDifficulty",
          "title": "difficulty(BEGINNER, INTERMEDIATE or ADVANCED) of service"
        },
        "participation_types": {
          "type": "array",
          "items": {
            "$ref": "#/definitions/argonParticipationType"
          },
          "title": "participation(INDIVIDUAL/BUDDY/GROUP) for service"
        },
        "goals": {
          "type": "array",
          "items": {
            "$ref": "#/definitions/argonGoal"
          },
          "title": "goals of services"
        },
        "interest_areas": {
          "type": "array",
          "items": {
            "$ref": "#/definitions/argonInterestArea"
          },
          "title": "interest areas of service"
        },
        "is_active": {
          "type": "boolean",
          "format": "boolean",
          "title": "active status of service\nif inactive then service is not available for booking"
        },
        "g2g": {
          "type": "boolean",
          "format": "boolean",
          "title": "g2g filter used by google team internally"
        },
        "min_hours_to_book_digital": {
          "type": "integer",
          "format": "int64",
          "description": "setting: minimum advance notice required to book an appointment.\nthe settings includes category based rules as well."
        },
        "min_hours_to_book_in_person": {
          "type": "integer",
          "format": "int64",
          "description": "setting: minimum advance notice required to book an appointment.\nthe settings includes category based rules as well."
        },
        "is_organizer_based": {
          "type": "boolean",
          "format": "boolean",
          "title": "represents if the service is organizer based or not"
        },
        "is_premium": {
          "type": "boolean",
          "format": "boolean"
        },
        "timestamp": {
          "type": "string",
          "format": "date-time",
          "title": "represents time when the service object was last modified"
        },
        "is_deleted": {
          "type": "boolean",
          "format": "boolean",
          "title": "represents deleted field in appointy"
        }
      },
      "title": "Service represents entities for which customers schedule an appointment\nThis object will work w.r.t. appointment workflow only (not for classes)\nwill also function as Pub/Sub object"
    },
    "argonServiceBookingRestriction": {
      "type": "object",
      "properties": {
        "max_booking_per_service_per_customer": {
          "type": "integer",
          "format": "int64",
          "title": "maximum future booking allowed for any one type of service"
        },
        "max_booking_per_customer": {
          "type": "integer",
          "format": "int64",
          "title": "maximum future booking allowed for all services combined"
        },
        "massage_booking_restrictions": {
          "$ref": "#/definitions/argonMassageBookingRestrictions"
        }
      },
      "title": "future booking restriction on booking of service/appointments"
    },
    "argonServiceNode": {
      "type": "object",
      "properties": {
        "cursor": {
          "type": "string"
        },
        "service": {
          "$ref": "#/definitions/argonService"
        }
      }
    },
    "argonServiceProvider": {
      "type": "object",
      "properties": {
        "program_id": {
          "type": "string",
          "title": "unique identifier of program(fitness/massage...) to which service provider belongs"
        },
        "id": {
          "type": "string",
          "title": "unique identifier representing service-provider"
        },
        "first_name": {
          "type": "string",
          "title": "first name of service provider"
        },
        "last_name": {
          "type": "string",
          "title": "last name of service provider"
        },
        "email": {
          "type": "string",
          "title": "email of service provider"
        },
        "description": {
          "type": "string",
          "title": "description about service provider\ncan contain valid html content"
        },
        "photo_url": {
          "type": "string",
          "title": "profile picture of service provider"
        },
        "is_active": {
          "type": "boolean",
          "format": "boolean",
          "title": "active status of service provider\nif inactive then service provider is not available for booking"
        },
        "allow_notice_period_booking": {
          "type": "boolean",
          "format": "boolean",
          "title": "this setting is used to show booked appointments with available capacity for booking\nappointments should be within the time based on minimum-notice-period-required setting"
        },
        "qualifications": {
          "type": "array",
          "items": {
            "type": "string"
          },
          "title": "qualifications of service provider"
        },
        "service_provider_certificates": {
          "type": "array",
          "items": {
            "$ref": "#/definitions/argonServiceProviderCertificate"
          },
          "title": "assigned and approved certificates of service provider\nonly valid and approved certificates\nused to validate if a service provider can perform a service/class or not"
        },
        "service_provider_blocked_users": {
          "type": "array",
          "items": {
            "$ref": "#/definitions/argonServiceProviderBlockedUser"
          },
          "title": "users blocked by service provider will not be able to schedule a booking with them"
        },
        "timestamp": {
          "type": "string",
          "format": "date-time",
          "title": "represents time when the service provider object was last modified"
        },
        "is_deleted": {
          "type": "boolean",
          "format": "boolean",
          "title": "represents deleted field in appointy"
        },
        "specialities": {
          "type": "array",
          "items": {
            "type": "string"
          }
        }
      },
      "title": "Service Provider represents the trainers/staff which will be available for booking by customers\nwill also function as Pub/Sub object"
    },
    "argonServiceProviderBlockedUser": {
      "type": "object",
      "properties": {
        "id": {
          "type": "string",
          "title": "unique identifier for user/customer"
        },
        "email": {
          "type": "string",
          "title": "email of user/customer"
        }
      },
      "title": "ServiceProviderBlockedUser represents users/customers blocked by service provider\nUser/customer will not be able to book any future booking with service provider"
    },
    "argonServiceProviderCertificate": {
      "type": "object",
      "properties": {
        "id": {
          "type": "string",
          "title": "unique identifier representing service-provider-certificate"
        },
        "name": {
          "type": "string",
          "title": "name of certificate"
        },
        "certificate_type_id": {
          "type": "string",
          "title": "Certificate-Type represents the actual certificate assigned to service provider\nin Appointy, Certificate-Types(object/module) is the master module\nCertificate-Types stores various types of certificates supported by system"
        },
        "valid_from": {
          "type": "string",
          "format": "date-time",
          "title": "validity of certificate"
        },
        "valid_till": {
          "type": "string",
          "format": "date-time"
        },
        "url": {
          "type": "string",
          "title": "url of certificate"
        },
        "license_number": {
          "type": "string",
          "title": "license number of certificate"
        }
      },
      "title": "Service Provider Certificates represents the certificates(types) assigned to service providers"
    },
    "argonServiceProviderNode": {
      "type": "object",
      "properties": {
        "cursor": {
          "type": "string",
          "title": "represents position in page\nuniquely identifies object"
        },
        "service_provider": {
          "$ref": "#/definitions/argonServiceProvider",
          "title": "service provider data"
        }
      }
    },
    "argonSessionStatus": {
      "type": "string",
      "enum": [
        "SESSION_BOOKED",
        "SESSION_CANCELLED",
        "SESSION_WAIT_LIST_AVAILABLE",
        "SESSION_UNAVAILABLE"
      ],
      "default": "SESSION_BOOKED"
    },
    "argonSettings": {
      "type": "object",
      "properties": {
        "program_id": {
          "type": "string",
          "title": "unique identifier of program(fitness/massage...) to which settings belongs to\nif location_id = \"\" (empty), represents global/program settings"
        },
        "location_id": {
          "type": "string",
          "title": "unique identifier of location(NewYork/London...) to which settings belongs to\noptional\nif present will partially/completely override the program level settings based on not null condition"
        },
        "location_code": {
          "type": "string",
          "title": "unique location code provided by Google for each location\noptional\nonly filled in if location_id field is not empty"
        },
        "cancellation_appointment": {
          "$ref": "#/definitions/argonAppointmentCancellationAndLeadPolicySettings",
          "title": "Lead and Cancellation Policy settings for appointment/service bookings\nfor location-level settings overrides global settings if not null"
        },
        "cancellation_class": {
          "$ref": "#/definitions/argonClassCancellationAndLeadPolicySettings",
          "title": "Lead and Cancellation Policy settings for class bookings\nfor location-level setting it overrides global settings if not null"
        },
        "max_group_capacity": {
          "type": "integer",
          "format": "int64",
          "description": "maximum number of people allowed in a group session\nfor location-level setting it overrides global settings if not set 0 (zero-value)."
        },
        "regular_class_booking_restriction": {
          "$ref": "#/definitions/argonRegularClassBookingRestriction",
          "title": "future booking restriction on booking of regular/recurring classes\nfor location-level setting it overrides global settings if not null"
        },
        "service_booking_restriction": {
          "$ref": "#/definitions/argonServiceBookingRestriction",
          "title": "future booking restriction on booking of service/appointments\nfor location-level setting it overrides global settings if not null"
        },
        "timestamp": {
          "type": "string",
          "format": "date-time",
          "title": "represents time when the settings object was last modified"
        }
      },
      "title": "Settings represent main program/location settings used to configure functionality\nGlobal settings are defined at program level, and they are applied to all locations\n   this setting can be found using: program_id: \"\u003cid-value\u003e\" and location_id: \"\" (empty)\nLocation Settings: global settings can be partially/completed overridden at location level\n   this setting can be found using: program_id: \"\u003cid-value\u003e\" and location_id: \u003cid-value\u003e (not empty)\n   if in the location setting object, the field value is not null or non zero, then they override the\n   global level settings.\nwill also function as Pub/Sub object"
    },
    "argonValidateAppointmentSlotsRequest": {
      "type": "object",
      "properties": {
        "customer_email": {
          "type": "string"
        },
        "appointment_slot_ids": {
          "type": "array",
          "items": {
            "type": "string"
          }
        },
        "program_id": {
          "type": "string"
        }
      }
    },
    "argonValidateAppointmentSlotsResponse": {
      "type": "object",
      "properties": {
        "appointment_slots_booking_possibility": {
          "type": "array",
          "items": {
            "$ref": "#/definitions/argonAppointmentSlotBookingPossibility"
          }
        }
      }
    },
    "argonValidateClassSessionsRequest": {
      "type": "object",
      "properties": {
        "customer_email": {
          "type": "string"
        },
        "class_id": {
          "type": "string"
        },
        "class_session_ids": {
          "type": "array",
          "items": {
            "type": "string"
          }
        },
        "program_id": {
          "type": "string"
        }
      }
    },
    "argonValidateClassSessionsResponse": {
      "type": "object",
      "properties": {
        "class_booking_possibility": {
          "$ref": "#/definitions/argonClassBookingPossibility"
        },
        "class_sessions_booking_possibility": {
          "type": "array",
          "items": {
            "$ref": "#/definitions/argonClassSessionBookingPossibility"
          }
        }
      }
    }
  }
}
