<svg width="21" height="23" viewBox="0 0 21 23" fill="none" xmlns="http://www.w3.org/2000/svg">
<path d="M15.2149 0.250488C18.69 0.250488 20.625 2.25299 20.625 5.68424V17.3055C20.625 20.793 18.69 22.7505 15.2149 22.7505H5.78625C2.36625 22.7505 0.375 20.793 0.375 17.3055V5.68424C0.375 2.25299 2.36625 0.250488 5.78625 0.250488H15.2149ZM6.09 15.708C5.7525 15.6742 5.42625 15.8317 5.24625 16.1242C5.06625 16.4055 5.06625 16.7767 5.24625 17.0692C5.42625 17.3505 5.7525 17.5192 6.09 17.4742H14.91C15.3589 17.4292 15.6975 17.0456 15.6975 16.5967C15.6975 16.1355 15.3589 15.753 14.91 15.708H6.09ZM14.91 10.5769H6.09C5.60512 10.5769 5.2125 10.9717 5.2125 11.4555C5.2125 11.9392 5.60512 12.333 6.09 12.333H14.91C15.3938 12.333 15.7875 11.9392 15.7875 11.4555C15.7875 10.9717 15.3938 10.5769 14.91 10.5769ZM9.45263 5.48174H6.09V5.49299C5.60512 5.49299 5.2125 5.88674 5.2125 6.37049C5.2125 6.85424 5.60512 7.24799 6.09 7.24799H9.45263C9.9375 7.24799 10.3313 6.85424 10.3313 6.35811C10.3313 5.87549 9.9375 5.48174 9.45263 5.48174Z" fill="#252525"/>
</svg>
