module gitlab.com/shigeyuki.fujishima/1minute

go 1.12

require (
	cloud.google.com/go v0.43.0 // indirect
	github.com/coreos/bbolt v1.3.3 // indirect
	github.com/coreos/etcd v3.3.13+incompatible // indirect
	github.com/coreos/go-semver v0.3.0 // indirect
	github.com/coreos/go-systemd v0.0.0-20190719114852-fd7a80b32e1f // indirect
	github.com/go-kit/kit v0.9.0 // indirect
	github.com/golang/groupcache v0.0.0-20190702054246-869f871628b6 // indirect
	github.com/google/pprof v0.0.0-20190723021845-34ac40c74b70 // indirect
	github.com/grpc-ecosystem/grpc-gateway v1.9.5 // indirect
	github.com/hashicorp/golang-lru v0.5.3 // indirect
	github.com/jroimartin/gocui v0.4.0
	github.com/kisielk/errcheck v1.2.0 // indirect
	github.com/klauspost/compress v1.7.4 // indirect
	github.com/klauspost/cpuid v1.2.1 // indirect
	github.com/konsorten/go-windows-terminal-sequences v1.0.2 // indirect
	github.com/kr/pty v1.1.8 // indirect
	github.com/magiconair/properties v1.8.1 // indirect
	github.com/mattn/go-pipeline v0.0.0-20190323144519-32d779b32768
	github.com/mattn/go-runewidth v0.0.4 // indirect
	github.com/mwitkow/go-conntrack v0.0.0-20190716064945-2f068394615f // indirect
	github.com/nsf/termbox-go v0.0.0-20190624072549-eeb6cd0a1762 // indirect
	github.com/pelletier/go-toml v1.4.0 // indirect
	github.com/pkg/errors v0.8.1
	github.com/prometheus/client_golang v1.1.0 // indirect
	github.com/rogpeppe/fastuuid v1.2.0 // indirect
	github.com/russross/blackfriday v2.0.0+incompatible // indirect
	github.com/savsgio/atreugo v5.4.0+incompatible
	github.com/savsgio/atreugo/v8 v8.1.1 // indirect
	github.com/sirupsen/logrus v1.4.2 // indirect
	github.com/spf13/afero v1.2.2 // indirect
	github.com/spf13/cobra v0.0.5
	github.com/spf13/jwalterweatherman v1.1.0 // indirect
	github.com/spf13/viper v1.4.0
	github.com/stretchr/objx v0.2.0 // indirect
	github.com/ugorji/go v1.1.7 // indirect
	go.etcd.io/bbolt v1.3.3 // indirect
	go.uber.org/zap v1.10.0
	golang.org/x/crypto v0.0.0-20190701094942-4def268fd1a4 // indirect
	golang.org/x/exp v0.0.0-20190731235908-ec7cb31e5a56 // indirect
	golang.org/x/image v0.0.0-20190802002840-cff245a6509b // indirect
	golang.org/x/mobile v0.0.0-20190719004257-d2bd2a29d028 // indirect
	golang.org/x/net v0.0.0-20190724013045-ca1201d0de80 // indirect
	golang.org/x/sys v0.0.0-20190804053845-51ab0e2deafa // indirect
	golang.org/x/tools v0.0.0-20190802220118-1d1727260058 // indirect
	google.golang.org/genproto v0.0.0-20190801165951-fa694d86fc64 // indirect
	google.golang.org/grpc v1.22.1 // indirect
	honnef.co/go/tools v0.0.1-2019.2.2 // indirect
)
