// Jest Snapshot v1, https://goo.gl/fbAQLP

exports[`Mounted BaseChip renders correctly 1`] = `
<div>
  <v-icon
    class="pa-0"
    left=""
    size="small"
  >
    
    mdi-test-icon
  
  </v-icon>
   
  <span
    class="base-chip__label"
  >
    
      test-title:
    
  </span>
   
  <nuxtlink
    to="test-link"
  >
    test-item
  </nuxtlink>
</div>
`;
