// Jest Snapshot v1, https://goo.gl/fbAQLP

exports[`Mounted BaseAvatar renders correctly 1`] = `
<div
  class="base-avatar"
>
  <svg
    class="base-avatar__svg"
    viewBox="0 0 300 350"
  >
    <path
      d="M 152.073 324.087 C 46.273 326.287 34.473 201.387 38.273 139.687 C 45.373 24.687 149.773 -21.413 192.373 17.987 C 237.673 17.987 258.873 74.287 263.973 138.387 C 270.873 223.987 239.273 322.287 152.073 324.087"
    />
     
    <path
      d="M 149.673 27.587 C 209.806 27.644 239.673 78.613 239.673 125.687 C 243.873 122.587 248.473 121.287 252.173 122.887 C 259.573 125.987 261.073 138.887 255.473 151.587 C 249.973 164.287 239.673 172.087 232.273 168.887 C 231.773 168.687 231.273 168.287 230.773 167.987 C 220.132 193.025 202.043 213.433 184.595 226.372 L 184.139 339.919 C 183.938 340.193 113.839 339.919 113.839 339.919 L 114.296 226.166 C 97.11 213.372 79.359 193.381 68.773 168.887 C 61.373 171.887 51.073 164.087 45.673 151.487 C 40.173 138.787 41.673 125.987 49.073 122.787 C 52.273 121.487 55.973 122.087 59.573 124.287 C 60.173 77.613 89.94 27.643 149.573 27.587 C 149.59 27.587 149.606 27.587 149.623 27.587 C 149.64 27.587 149.656 27.587 149.673 27.587 Z"
    />
     
    <path
      d="M 114.232 226.127 C 114.232 226.127 136.797 240.345 149.244 240.366 C 161.619 240.387 184.744 226.314 184.744 226.314 L 184.538 239.74 C 171.238 250.14 158.278 254.907 149.278 254.907 C 140.278 254.907 127.582 250.187 114.282 239.787 L 114.139 236.178"
      style="fill: rgb(0, 0, 0); opacity: 0.14;"
    />
     
    <path
      d="M -19.292 402.374 C 33.477 403.031 258.82 403.912 315.654 401.493 C 312.054 399.293 301.47 331.283 278.331 324.104 C 241.835 312.781 204.629 300.188 184.329 268.288 C 184.283 268.36 187.148 303.974 149.212 304.523 C 113.226 305.044 114.044 268.993 114.021 268.922 C 93.721 300.822 56.062 314.76 19.57 326.422 C -0.479 332.829 -15.692 400.274 -19.292 402.374 Z"
      style="fill: rgb(115, 0, 29);"
    />
     
    <path
      d="M 113.873 142.087 C 118.673 142.087 122.673 146.587 122.673 152.087 C 122.673 157.587 118.673 162.087 113.873 162.087 C 108.973 162.087 105.073 157.587 105.073 152.087 C 105.073 146.587 108.973 142.087 113.873 142.087 Z M 185.273 142.087 C 190.073 142.087 194.073 146.587 194.073 152.087 C 194.073 157.587 190.073 162.087 185.273 162.087 C 180.373 162.087 176.473 157.587 176.473 152.087 C 176.573 146.587 180.473 142.087 185.273 142.087 Z"
      style="fill: rgb(255, 255, 255);"
    />
     
    <path
      d="M 158.973 204.187 C 158.973 204.187 159.273 208.82 149.173 208.82 C 146.273 208.82 139.573 208.787 139.573 204.287 C 145.301 204.84 151.72 204.833 158.973 204.187"
      style="fill: #D43329;"
    />
     
    <path
      d="M 242.673 153.287 C 270.373 34.787 186.973 14.587 138.173 14.587 C 83.273 14.587 59.706 84.12 51.173 155.487 C 117.485 114.534 206.035 103.856 208.973 67.987 C 216.973 99.187 228.273 133.287 242.673 153.287"
    />
     
    <path
      d="M 113.554 147.844 C 116.1 147.844 118.223 150.231 118.223 153.151 C 118.223 156.071 116.1 158.459 113.554 158.459 C 110.952 158.459 108.882 156.071 108.882 153.151 C 108.936 150.231 111.005 147.844 113.554 147.844 Z M 185.001 147.529 C 187.565 147.529 189.703 149.934 189.703 152.874 C 189.703 155.815 187.565 158.218 185.001 158.218 C 182.381 158.218 180.296 155.815 180.296 152.874 C 180.35 149.934 182.433 147.529 185.001 147.529 Z"
    />
  </svg>
</div>
`;
