%YAML 1.1
%TAG !u! tag:unity3d.com,2011:
--- !u!74 &7400000
AnimationClip:
  m_ObjectHideFlags: 0
  m_PrefabParentObject: {fileID: 0}
  m_PrefabInternal: {fileID: 0}
  m_Name: ScoutBoatSplash
  serializedVersion: 6
  m_Legacy: 0
  m_Compressed: 0
  m_UseHighQualityCurve: 1
  m_RotationCurves: []
  m_CompressedRotationCurves: []
  m_EulerCurves: []
  m_PositionCurves: []
  m_ScaleCurves: []
  m_FloatCurves: []
  m_PPtrCurves:
  - curve:
    - time: 0
      value: {fileID: 21300000, guid: 4b5eb9fc92080ee4b9cc30b51f181719, type: 3}
    - time: 0.04
      value: {fileID: 21300000, guid: b4f691fb5196055419a3884d7ec7f728, type: 3}
    - time: 0.08
      value: {fileID: 21300000, guid: 3f5f8b15170e10242bd569e1decae0c1, type: 3}
    - time: 0.12
      value: {fileID: 21300000, guid: 3f5f8b15170e10242bd569e1decae0c1, type: 3}
    - time: 0.16
      value: {fileID: 21300000, guid: 5f88989f38ecc864ab27c37e60110fba, type: 3}
    - time: 0.2
      value: {fileID: 21300000, guid: 1ed6c6bc95a78ab43b658e3bd4c79155, type: 3}
    attribute: m_Sprite
    path: View/Splash
    classID: 212
    script: {fileID: 0}
  m_SampleRate: 300
  m_WrapMode: 0
  m_Bounds:
    m_Center: {x: 0, y: 0, z: 0}
    m_Extent: {x: 0, y: 0, z: 0}
  m_ClipBindingConstant:
    genericBindings:
    - serializedVersion: 2
      path: 1404841027
      attribute: 0
      script: {fileID: 0}
      typeID: 212
      customType: 23
      isPPtrCurve: 1
    pptrCurveMapping:
    - {fileID: 21300000, guid: 4b5eb9fc92080ee4b9cc30b51f181719, type: 3}
    - {fileID: 21300000, guid: b4f691fb5196055419a3884d7ec7f728, type: 3}
    - {fileID: 21300000, guid: 3f5f8b15170e10242bd569e1decae0c1, type: 3}
    - {fileID: 21300000, guid: 3f5f8b15170e10242bd569e1decae0c1, type: 3}
    - {fileID: 21300000, guid: 5f88989f38ecc864ab27c37e60110fba, type: 3}
    - {fileID: 21300000, guid: 1ed6c6bc95a78ab43b658e3bd4c79155, type: 3}
  m_AnimationClipSettings:
    serializedVersion: 2
    m_AdditiveReferencePoseClip: {fileID: 0}
    m_AdditiveReferencePoseTime: 0
    m_StartTime: 0
    m_StopTime: 0.20333333
    m_OrientationOffsetY: 0
    m_Level: 0
    m_CycleOffset: 0
    m_HasAdditiveReferencePose: 0
    m_LoopTime: 1
    m_LoopBlend: 0
    m_LoopBlendOrientation: 0
    m_LoopBlendPositionY: 0
    m_LoopBlendPositionXZ: 0
    m_KeepOriginalOrientation: 0
    m_KeepOriginalPositionY: 1
    m_KeepOriginalPositionXZ: 0
    m_HeightFromFeet: 0
    m_Mirror: 0
  m_EditorCurves: []
  m_EulerEditorCurves: []
  m_HasGenericRootTransform: 0
  m_HasMotionFloatCurves: 0
  m_GenerateMotionCurves: 0
  m_Events: []
