%YAML 1.1
%TAG !u! tag:unity3d.com,2011:
--- !u!1001 &100100000
Prefab:
  m_ObjectHideFlags: 1
  serializedVersion: 2
  m_Modification:
    m_TransformParent: {fileID: 0}
    m_Modifications: []
    m_RemovedComponents: []
  m_ParentPrefab: {fileID: 0}
  m_RootGameObject: {fileID: 1802065805259480}
  m_IsPrefabParent: 1
--- !u!1 &1802065805259480
GameObject:
  m_ObjectHideFlags: 0
  m_PrefabParentObject: {fileID: 0}
  m_PrefabInternal: {fileID: 100100000}
  serializedVersion: 5
  m_Component:
  - component: {fileID: 4300270051651142}
  - component: {fileID: 114891507790082832}
  m_Layer: 0
  m_Name: AchievementsLoader
  m_TagString: Untagged
  m_Icon: {fileID: 0}
  m_NavMeshLayer: 0
  m_StaticEditorFlags: 0
  m_IsActive: 1
--- !u!4 &4300270051651142
Transform:
  m_ObjectHideFlags: 1
  m_PrefabParentObject: {fileID: 0}
  m_PrefabInternal: {fileID: 100100000}
  m_GameObject: {fileID: 1802065805259480}
  m_LocalRotation: {x: -0, y: -0, z: -0, w: 1}
  m_LocalPosition: {x: 0, y: 0, z: 0}
  m_LocalScale: {x: 1, y: 1, z: 1}
  m_Children: []
  m_Father: {fileID: 0}
  m_RootOrder: 0
  m_LocalEulerAnglesHint: {x: 0, y: 0, z: 0}
--- !u!114 &114891507790082832
MonoBehaviour:
  m_ObjectHideFlags: 1
  m_PrefabParentObject: {fileID: 0}
  m_PrefabInternal: {fileID: 100100000}
  m_GameObject: {fileID: 1802065805259480}
  m_Enabled: 1
  m_EditorHideFlags: 0
  m_Script: {fileID: 11500000, guid: fa1c853d44341e446887eec74c1279cb, type: 3}
  m_Name: 
  m_EditorClassIdentifier: 
  achievementList:
  - _name: Level Progression
    _maxLevel: 4
    _currentLevel: -1
    _payOut:
    - _megaBomb: 0
      _shields: 0
      _coins: 500
      _odFrags: 0
      _powerGems: 1
      _evoStones: 0
    - _megaBomb: 0
      _shields: 0
      _coins: 500
      _odFrags: 0
      _powerGems: 1
      _evoStones: 0
    - _megaBomb: 0
      _shields: 0
      _coins: 0
      _odFrags: 0
      _powerGems: 1
      _evoStones: 0
    - _megaBomb: 0
      _shields: 0
      _coins: 500
      _odFrags: 2
      _powerGems: 1
      _evoStones: 0
    - _megaBomb: 0
      _shields: 0
      _coins: 0
      _odFrags: 1
      _powerGems: 1
      _evoStones: 0
    _limits:
    - {x: 1, y: 1}
    - {x: 2, y: 2}
    - {x: 3, y: 3}
    - {x: 4, y: 4}
    - {x: 5, y: 5}
    _stat: 4
  - _name: Bosses Defeated
    _maxLevel: 4
    _currentLevel: -1
    _payOut:
    - _megaBomb: 0
      _shields: 0
      _coins: 0
      _odFrags: 0
      _powerGems: 1
      _evoStones: 0
    - _megaBomb: 0
      _shields: 0
      _coins: 500
      _odFrags: 0
      _powerGems: 0
      _evoStones: 1
    - _megaBomb: 0
      _shields: 0
      _coins: 0
      _odFrags: 0
      _powerGems: 1
      _evoStones: 0
    - _megaBomb: 0
      _shields: 0
      _coins: 500
      _odFrags: 0
      _powerGems: 1
      _evoStones: 1
    - _megaBomb: 0
      _shields: 0
      _coins: 0
      _odFrags: 1
      _powerGems: 1
      _evoStones: 0
    _limits:
    - {x: 1, y: 1}
    - {x: 2, y: 2}
    - {x: 3, y: 3}
    - {x: 4, y: 4}
    - {x: 5, y: 5}
    _stat: 5
