%YAML 1.1
%TAG !u! tag:unity3d.com,2011:
--- !u!74 &7400000
AnimationClip:
  m_ObjectHideFlags: 0
  m_PrefabParentObject: {fileID: 0}
  m_PrefabInternal: {fileID: 0}
  m_Name: rocket-smoke
  serializedVersion: 6
  m_Legacy: 0
  m_Compressed: 0
  m_UseHighQualityCurve: 1
  m_RotationCurves: []
  m_CompressedRotationCurves: []
  m_EulerCurves: []
  m_PositionCurves: []
  m_ScaleCurves: []
  m_FloatCurves: []
  m_PPtrCurves:
  - curve:
    - time: 0
      value: {fileID: 21300000, guid: 65eddaec879244ed786da625673a5043, type: 3}
    - time: 0.083333336
      value: {fileID: 21300000, guid: ece74fe04dccd4af1bba3393b8ebcd0e, type: 3}
    - time: 0.16666667
      value: {fileID: 21300000, guid: 17e1633b2794a43a780aec88811305a4, type: 3}
    - time: 0.25
      value: {fileID: 21300000, guid: d757c55a5efad4ab99d5c65a1a6a8b5d, type: 3}
    - time: 0.33333334
      value: {fileID: 21300000, guid: 898673e67d688410fa1ce8ee3484cf90, type: 3}
    - time: 0.41666666
      value: {fileID: 21300000, guid: db0ad695605d8407184031100999422a, type: 3}
    - time: 0.5
      value: {fileID: 21300000, guid: 4dfc287d629214c779fd39330b8de3a6, type: 3}
    - time: 0.5833333
      value: {fileID: 21300000, guid: 65eddaec879244ed786da625673a5043, type: 3}
    - time: 0.6666667
      value: {fileID: 21300000, guid: e66c87af84c414fac833bb3f15ce4453, type: 3}
    - time: 0.75
      value: {fileID: 21300000, guid: 9327f947d4c234de2bb0659d4c9f159d, type: 3}
    - time: 0.8333333
      value: {fileID: 21300000, guid: b9a5ae304e0b941f0a788e80d2e35bc7, type: 3}
    - time: 0.9166667
      value: {fileID: 21300000, guid: 0a8dd241e83674e0987d0f0d537801a8, type: 3}
    attribute: m_Sprite
    path: 
    classID: 212
    script: {fileID: 0}
  m_SampleRate: 12
  m_WrapMode: 0
  m_Bounds:
    m_Center: {x: 0, y: 0, z: 0}
    m_Extent: {x: 0, y: 0, z: 0}
  m_ClipBindingConstant:
    genericBindings:
    - serializedVersion: 2
      path: 0
      attribute: 0
      script: {fileID: 0}
      typeID: 212
      customType: 23
      isPPtrCurve: 1
    pptrCurveMapping:
    - {fileID: 21300000, guid: 65eddaec879244ed786da625673a5043, type: 3}
    - {fileID: 21300000, guid: ece74fe04dccd4af1bba3393b8ebcd0e, type: 3}
    - {fileID: 21300000, guid: 17e1633b2794a43a780aec88811305a4, type: 3}
    - {fileID: 21300000, guid: d757c55a5efad4ab99d5c65a1a6a8b5d, type: 3}
    - {fileID: 21300000, guid: 898673e67d688410fa1ce8ee3484cf90, type: 3}
    - {fileID: 21300000, guid: db0ad695605d8407184031100999422a, type: 3}
    - {fileID: 21300000, guid: 4dfc287d629214c779fd39330b8de3a6, type: 3}
    - {fileID: 21300000, guid: 65eddaec879244ed786da625673a5043, type: 3}
    - {fileID: 21300000, guid: e66c87af84c414fac833bb3f15ce4453, type: 3}
    - {fileID: 21300000, guid: 9327f947d4c234de2bb0659d4c9f159d, type: 3}
    - {fileID: 21300000, guid: b9a5ae304e0b941f0a788e80d2e35bc7, type: 3}
    - {fileID: 21300000, guid: 0a8dd241e83674e0987d0f0d537801a8, type: 3}
  m_AnimationClipSettings:
    serializedVersion: 2
    m_AdditiveReferencePoseClip: {fileID: 0}
    m_AdditiveReferencePoseTime: 0
    m_StartTime: 0
    m_StopTime: 1
    m_OrientationOffsetY: 0
    m_Level: 0
    m_CycleOffset: 0
    m_HasAdditiveReferencePose: 0
    m_LoopTime: 1
    m_LoopBlend: 0
    m_LoopBlendOrientation: 0
    m_LoopBlendPositionY: 0
    m_LoopBlendPositionXZ: 0
    m_KeepOriginalOrientation: 0
    m_KeepOriginalPositionY: 1
    m_KeepOriginalPositionXZ: 0
    m_HeightFromFeet: 0
    m_Mirror: 0
  m_EditorCurves: []
  m_EulerEditorCurves: []
  m_HasGenericRootTransform: 0
  m_HasMotionFloatCurves: 0
  m_GenerateMotionCurves: 0
  m_Events: []
