%YAML 1.1
%TAG !u! tag:unity3d.com,2011:
--- !u!78 &1
TagManager:
  serializedVersion: 2
  tags:
  - EnemyFire
  - PlayerFire
  - Background
  - Wave1
  - Enemy
  - PlayerLaserFire
  - EnemyLaserFire
  - Boss
  - Wave
  - Magnet
  - Collectible
  - Megabomb
  - Chest
  - BezierPath
  - ScoutBoat-1-Gun-tag
  - ScoutBoat-2-gun-tag
  - AssaultBoat-2-Gun-tag
  - AssaultBoat-1-Gun-tag
  - canvas
  layers:
  - Default
  - TransparentFX
  - Ignore Raycast
  - 
  - Water
  - UI
  - 
  - 
  - Clouds
  - Flying Enemy
  - 
  - 
  - 
  - 
  - 
  - 
  - 
  - 
  - 
  - 
  - 
  - 
  - 
  - 
  - 
  - 
  - 
  - 
  - 
  - 
  - 
  - 
  m_SortingLayers:
  - name: Default
    uniqueID: 0
    locked: 0
  - name: GroundEnemy
    uniqueID: 1945304541
    locked: 0
  - name: Clouds
    uniqueID: 1910913323
    locked: 0
  - name: Enemies
    uniqueID: 3674332493
    locked: 0
  - name: Player
    uniqueID: 1481769149
    locked: 0
  - name: FX
    uniqueID: 804714965
    locked: 0
