<?xml version="1.0" encoding="UTF-8"?><!DOCTYPE svg PUBLIC "-//W3C//DTD SVG 1.1//EN"
        "http://www.w3.org/Graphics/SVG/1.1/DTD/svg11.dtd">
<svg xmlns="http://www.w3.org/2000/svg">
    <symbol id="arrow_expand" viewBox="-4 -4 30 30">
        <path fill="#8C96A9"
              d="M11 15.623l1.25-1.247 6.492-6.494a.88.88 0 1 0-1.247-1.247L11 13.131 4.503 6.635a.882.882 0 0 0-1.247 1.247l6.492 6.494L11 15.623z"/>
    </symbol>
    <symbol id="arrow_expand_active" viewBox="0 0 30 30">
        <path fill="#8C96A9"
              d="M13.749 11.624l-6.492 6.494a.882.882 0 0 0 1.247 1.247L15 12.869l6.496 6.496a.881.881 0 1 0 1.246-1.247l-6.492-6.494L15 10.377l-1.251 1.247z"/>
    </symbol>
    <symbol id="arrow_select" viewBox="0 0 30 30">
        <path fill="#8C96A9"
              d="M15 15.886l-3.403-3.403a.642.642 0 1 0-.908.908l3.401 3.404.91.91.909-.91 3.403-3.404a.642.642 0 1 0-.909-.908L15 15.886z"/>
    </symbol>
    <symbol id="arrow_select_active" viewBox="0 0 30 30">
        <path fill="#8C96A9"
              d="M15 14.114l-3.403 3.403a.642.642 0 1 1-.908-.908l3.401-3.404.91-.91.909.91 3.403 3.404a.642.642 0 1 1-.909.908L15 14.114z"/>
    </symbol>
    <symbol id="cancel" viewBox="-4 -4 30 30">
        <path fill="#8C96A9"
              d="M12.313 11l4.915-4.915a.93.93 0 0 0-1.313-1.313L11 9.687 6.085 4.772a.93.93 0 0 0-1.313 1.313L9.687 11l-4.915 4.915a.93.93 0 0 0 1.313 1.313L11 12.313l4.915 4.915a.93.93 0 0 0 1.313-1.313L12.313 11z"/>
    </symbol>
    <symbol id="checkmark" viewBox="-4 -4 30 30">
        <path fill="#39D16E" d="M15.9 4.691l-6.951 8.518-2.981-3.153L4 11.918l5.1 5.391L18 6.404z"/>
    </symbol>
    <symbol id="contacted" viewBox="-4 -4 30 30">
        <g fill="#19AA4C">
            <path d="M20.702 6.331A1.553 1.553 0 0 0 19.741 6H9.028c-.371 0-.712.129-.98.346l6.317 4.835 6.337-4.85zM21.278 7.278l-4.858 3.719 4.86 3.711c.016-.088.024-.179.024-.271V7.562a1.493 1.493 0 0 0-.026-.284zM7.486 7.305c-.014.084-.021.17-.021.258v6.875c0 .093.009.184.024.271l4.83-3.706-4.833-3.698zM14.7 12.312a.552.552 0 0 1-.67 0l-.804-.615-5.168 3.965c.267.212.603.338.97.338h10.713c.367 0 .705-.127.972-.339l-5.201-3.97-.812.621zM5.63 6.597H1.247a.552.552 0 1 0 0 1.103H5.63a.552.552 0 1 0 0-1.103zM5.63 14.3H4.555a.552.552 0 0 0 0 1.104H5.63a.552.552 0 1 0 0-1.104zM5.63 10.448H2.901a.552.552 0 1 0 0 1.104H5.63a.552.552 0 1 0 0-1.104z"/>
        </g>
    </symbol>
    <symbol id="download" viewBox="-4 -4 30 30">
        <g fill="#8C96A9">
            <path d="M17.731 14.032a.64.64 0 0 0-.641.641v2.084a.965.965 0 0 1-.962.961H5.871a.961.961 0 0 1-.961-.961v-2.084a.641.641 0 0 0-1.283 0v2.084A2.245 2.245 0 0 0 5.871 19h10.258a2.241 2.241 0 0 0 2.243-2.244v-2.084a.64.64 0 0 0-.641-.64z"/>
            <path d="M10.547 15.955c.25.25.656.25.906 0l5.913-5.913a.643.643 0 0 0-.453-1.095h-2.315V3.641A.645.645 0 0 0 13.956 3H8.044a.65.65 0 0 0-.454.188.649.649 0 0 0-.188.453v5.306H5.087a.64.64 0 0 0-.453 1.095l5.913 5.913z"/>
        </g>
    </symbol>
    <symbol id="e-mail" viewBox="0 0 30 30">
        <path fill="#8C96A9"
              d="M18.798 19.338c-.397 0-.726-.056-.985-.167a1.858 1.858 0 0 1-.649-.444 4.744 4.744 0 0 1-.983.383 4.377 4.377 0 0 1-1.151.156 4.633 4.633 0 0 1-1.625-.276 3.526 3.526 0 0 1-1.271-.828 3.762 3.762 0 0 1-.836-1.345c-.201-.533-.298-1.153-.298-1.858 0-.593.091-1.155.277-1.68.186-.525.461-.984.827-1.375.363-.39.811-.696 1.336-.918.526-.223 1.124-.335 1.791-.335.632 0 1.21.049 1.735.149.527.099.933.198 1.218.297v5.682c0 .396.068.675.203.835a.669.669 0 0 0 .538.241c.322 0 .604-.11.845-.334s.439-.514.597-.873c.152-.357.269-.765.342-1.215.075-.452.111-.912.111-1.383 0-.779-.135-1.513-.407-2.2a5.426 5.426 0 0 0-1.169-1.811 5.438 5.438 0 0 0-1.849-1.225c-.724-.297-1.537-.446-2.442-.446-.903 0-1.732.152-2.488.455a5.553 5.553 0 0 0-1.948 1.301c-.544.563-.967 1.251-1.271 2.069-.306.817-.456 1.745-.456 2.786 0 1.089.16 2.044.482 2.867.321.823.77 1.512 1.346 2.062a5.601 5.601 0 0 0 2.042 1.245c.786.279 1.648.418 2.589.418.729 0 1.333-.045 1.812-.129.478-.088.781-.156.918-.203l.188 1.373c-.211.072-.593.156-1.143.242-.551.086-1.143.127-1.773.127-1.101 0-2.141-.156-3.118-.474a7.02 7.02 0 0 1-2.562-1.446c-.73-.65-1.31-1.479-1.737-2.487-.427-1.012-.64-2.207-.64-3.592 0-1.336.21-2.506.632-3.509.419-1.002.986-1.835 1.699-2.496a7.092 7.092 0 0 1 2.469-1.494 8.695 8.695 0 0 1 2.959-.501c1.014 0 1.977.165 2.878.493a6.973 6.973 0 0 1 2.376 1.429 6.761 6.761 0 0 1 1.614 2.265c.397.885.596 1.885.596 2.998 0 .842-.096 1.585-.287 2.229-.191.645-.451 1.186-.771 1.625-.321.438-.705.77-1.15.991a3.194 3.194 0 0 1-1.411.326zm-3.714-1.503c.259 0 .521-.028.789-.084a2.75 2.75 0 0 0 .715-.25c-.037-.161-.062-.321-.074-.481s-.019-.316-.019-.463v-4.364a2.684 2.684 0 0 0-.429-.074 6.2 6.2 0 0 0-.706-.038c-.878 0-1.536.272-1.968.816-.433.545-.65 1.232-.65 2.062 0 .879.211 1.579.632 2.098.42.518.99.778 1.71.778z"/>
    </symbol>
    <symbol id="e-mail_rounded" viewBox="-4 -4 30 30">
        <g fill="#4E99E3">
            <path d="M19.839 2.162A12.46 12.46 0 0 0 11.001-1.5c-3.451 0-6.579 1.4-8.84 3.662C-.1 4.422-1.5 7.55-1.5 11s1.4 6.578 3.661 8.838a12.463 12.463 0 0 0 8.84 3.661c3.45 0 6.578-1.399 8.838-3.661A12.456 12.456 0 0 0 23.5 11a12.454 12.454 0 0 0-3.661-8.838zm-.688 16.989a11.485 11.485 0 0 1-8.15 3.376 11.488 11.488 0 0 1-8.152-3.376C.763 17.064-.527 14.186-.527 11s1.29-6.064 3.376-8.151a11.49 11.49 0 0 1 8.152-3.376c3.185 0 6.063 1.29 8.15 3.376A11.49 11.49 0 0 1 22.528 11a11.489 11.489 0 0 1-3.377 8.151z"/>
            <path d="M16.008 5.205a6.498 6.498 0 0 0-2.203-1.325 7.756 7.756 0 0 0-2.667-.456c-.963 0-1.878.155-2.744.465s-1.629.771-2.289 1.385c-.66.614-1.184 1.385-1.575 2.314-.39.929-.585 2.013-.585 3.252 0 1.285.198 2.395.594 3.33.396.935.932 1.703 1.609 2.305a6.553 6.553 0 0 0 2.374 1.343 9.37 9.37 0 0 0 2.891.438c.585 0 1.133-.04 1.644-.12.511-.081.863-.155 1.059-.224l-.173-1.273c-.126.045-.41.109-.852.189s-1.001.12-1.678.12c-.871 0-1.672-.129-2.4-.388a5.25 5.25 0 0 1-1.893-1.152c-.533-.51-.949-1.146-1.247-1.91-.299-.762-.447-1.648-.447-2.658 0-.963.14-1.824.421-2.581.281-.757.674-1.396 1.178-1.919a5.171 5.171 0 0 1 1.807-1.204 6.137 6.137 0 0 1 2.306-.422c.838 0 1.592.138 2.263.413s1.242.654 1.713 1.136c.47.482.831 1.041 1.084 1.678.252.636.378 1.316.378 2.039 0 .436-.034.863-.104 1.282-.068.418-.175.795-.318 1.127s-.326.602-.55.809-.485.31-.783.31a.62.62 0 0 1-.499-.224c-.126-.148-.189-.406-.189-.774V7.244c-.264-.091-.64-.183-1.127-.275s-1.023-.138-1.608-.138c-.62 0-1.173.103-1.66.31a3.542 3.542 0 0 0-2.007 2.125 4.646 4.646 0 0 0-.259 1.557c0 .654.092 1.228.275 1.72.184.494.442.91.774 1.248.333.338.726.594 1.179.766s.955.258 1.506.258c.355 0 .711-.049 1.066-.146s.66-.215.912-.353c.16.173.361.31.603.413.24.104.545.154.912.154.458 0 .895-.103 1.308-.309a2.97 2.97 0 0 0 1.066-.921c.298-.407.536-.909.714-1.506s.267-1.284.267-2.064c0-1.033-.184-1.958-.551-2.779s-.864-1.52-1.495-2.099zm-4.018 8.207a3.544 3.544 0 0 1-.731.078c-.666 0-1.193-.241-1.583-.723-.391-.482-.585-1.131-.585-1.945 0-.769.2-1.405.602-1.91s1.01-.757 1.824-.757c.241 0 .459.012.654.034.194.023.326.046.396.069v4.043c0 .137.006.281.017.43.012.149.035.299.069.447a2.45 2.45 0 0 1-.663.234z"/>
        </g>
    </symbol>
    <symbol id="edit" viewBox="-4 -4 30 30">
        <g fill="#8C96A9">
            <path d="M16.718 9.155l1.573-1.573a2.425 2.425 0 0 0 0-3.427l-.445-.446A2.427 2.427 0 0 0 16.134 3h-.007c-.616 0-1.241.238-1.711.71l-1.572 1.572 3.874 3.873zM4.976 13.422l-1.903 4.354a.884.884 0 0 0 .183.972.886.886 0 0 0 .967.179l4.354-1.905-3.601-3.6zM5.805 12.32l6.074-6.072 3.875 3.876-6.074 6.073z"/>
        </g>
    </symbol>
    <symbol id="facebook" viewBox="0 0 30 30">
        <path fill="#8C96A9"
              d="M19.158 7.186l-.084-.09c-.271-.012-.545-.023-.814-.051-.561-.06-1.121-.048-1.683-.031-.224.008-.448.063-.671.111a2.801 2.801 0 0 0-.462.14 4.62 4.62 0 0 0-.563.27 2.852 2.852 0 0 0-.928.881 2.945 2.945 0 0 0-.38.753c-.056.172-.118.343-.153.518a3.438 3.438 0 0 0-.092.661c-.015.805-.012 1.612-.016 2.418 0 .13-.005.134-.13.134h-2.237l-.103.105v2.616l.099.1h2.253c.105 0 .119.016.119.127V23h2.912v-2.612-4.492c0-.173.002-.173.178-.173.727-.002 1.452-.002 2.179-.002.12 0 .122-.006.133-.121.016-.165.034-.333.057-.499.024-.191.053-.38.076-.569l.119-.873c.023-.181.039-.363.063-.547l.028-.155-.051-.058H16.355c-.12 0-.126-.006-.126-.131 0-.621-.007-1.243.003-1.867.003-.293.046-.584.229-.832.139-.187.33-.292.549-.358.254-.077.51-.082.771-.08.431.002.865 0 1.299.002l.08-.085c-.003-.765-.003-1.529-.003-2.292l.001-.07z"/>
    </symbol>
    <symbol id="facebook_rounded" viewBox="-4 -4 30 30">
        <g fill="#4E99E3">
            <path d="M11-2.006C3.817-2.005-2.005 3.817-2.006 11c0 7.184 5.823 13.006 13.006 13.006S24.006 18.184 24.006 11c0-7.183-5.823-13.005-13.006-13.006zm8.481 21.487c-2.173 2.171-5.168 3.513-8.481 3.513s-6.309-1.342-8.481-3.513A11.952 11.952 0 0 1-.994 11c0-3.313 1.342-6.309 3.513-8.481A11.955 11.955 0 0 1 11-.994c3.313 0 6.309 1.342 8.481 3.513A11.954 11.954 0 0 1 22.994 11c0 3.314-1.342 6.31-3.513 8.481z"/>
            <path d="M14.422 4.568l-.069-.074c-.224-.01-.448-.018-.671-.042-.461-.049-.923-.039-1.384-.025-.185.006-.369.052-.552.092-.13.028-.259.065-.381.115a3.714 3.714 0 0 0-.463.222c-.31.182-.562.427-.764.725-.131.193-.24.397-.312.62-.046.142-.097.282-.127.426a2.955 2.955 0 0 0-.075.544c-.012.663-.01 1.327-.013 1.99 0 .106-.004.11-.107.11H7.662l-.085.087v2.153l.082.083h1.854c.088 0 .098.013.098.104V17.585h2.398v-2.151-3.696c0-.143.001-.143.144-.143l1.796-.001c.098 0 .1-.006.108-.101.013-.137.03-.274.048-.411l.063-.468c.032-.239.065-.478.096-.718.02-.149.034-.3.052-.45l.024-.127-.04-.048h-2.185c-.099 0-.104-.005-.104-.107 0-.512-.005-1.024.002-1.537.003-.242.038-.481.19-.685a.839.839 0 0 1 .45-.295c.208-.063.42-.067.634-.066.356.002.714 0 1.07.002l.066-.07c-.002-.629-.002-1.258-.002-1.887l.001-.058z"/>
        </g>
    </symbol>
    <symbol id="fast_contact" viewBox="-4 -4 30 30">
        <path fill="#FFF"
              d="M10.975 14.164l8.216-6.289h.023l-.013-.01.013-.01a1.483 1.483 0 0 0-.224-.15l-8.016-6.137-8.216 6.288h.025l-.025.02 8.217 6.288zM19.966 9.088l-6.319 4.837 6.322 4.826c.02-.114.031-.231.031-.353v-8.94c0-.125-.014-.25-.034-.37zM2.028 9.123A2.056 2.056 0 0 0 2 9.458v8.94c0 .121.011.24.031.354l6.282-4.818-6.285-4.811zM11.41 15.637a.716.716 0 0 1-.871 0l-1.046-.801-6.722 5.156c.347.275.785.439 1.261.439h13.934c.478 0 .916-.164 1.263-.439l-6.764-5.164-1.055.809z"/>
    </symbol>
    <symbol id="github_rounded" viewBox="-4 -4 30 30">
        <g fill-rule="evenodd" clip-rule="evenodd" fill="#4E99E3">
            <path d="M19.839 2.162A12.46 12.46 0 0 0 11.001-1.5a12.46 12.46 0 0 0-8.839 3.662C-.1 4.422-1.5 7.55-1.5 11s1.4 6.578 3.662 8.838a12.46 12.46 0 0 0 8.839 3.661c3.45 0 6.578-1.399 8.838-3.661A12.456 12.456 0 0 0 23.5 11a12.454 12.454 0 0 0-3.661-8.838zm-.688 16.989a11.485 11.485 0 0 1-8.15 3.376c-3.186 0-6.064-1.289-8.151-3.376S-.526 14.186-.527 11A11.49 11.49 0 0 1 2.85 2.849a11.485 11.485 0 0 1 8.151-3.376c3.185 0 6.063 1.29 8.15 3.376A11.49 11.49 0 0 1 22.528 11a11.489 11.489 0 0 1-3.377 8.151z"/>
            <path d="M16.996 7.762a4.44 4.44 0 0 0-.372-1.236 3.744 3.744 0 0 0-.517-.805c.031-.191.048-.386.048-.582l-.001-.086a5.415 5.415 0 0 0-.155-1.173c-.035-.142-.075-.265-.106-.376a.489.489 0 0 0-.489-.351c-.055.003-.121.002-.215.011-.127.013-.251.029-.374.045a3.357 3.357 0 0 0-1.025.299h.001c-.291.14-.581.297-.862.479a10.281 10.281 0 0 0-1.544-.195 9.621 9.621 0 0 0-1.492.045c-.354.039-.705.1-1.053.184a5.63 5.63 0 0 0-.438-.279h.001a4.629 4.629 0 0 0-1.704-.562c-.12-.015-.221-.02-.303-.028a.49.49 0 0 0-.497.308l-.013.034c-.006.015-.015.036-.024.063v.002a5.178 5.178 0 0 0-.253 1.235 3.492 3.492 0 0 0 .082 1.073 3.8 3.8 0 0 0-.562.924c-.199.467-.271.941-.306 1.391-.011.13-.016.259-.016.387 0 .206.012.408.031.606.025.278.069.558.143.837.035.132.076.264.125.396.164.442.404.867.76 1.227.398.403.867.683 1.354.891.374.16.754.271 1.134.353-.058.08-.109.16-.154.233-.067.108-.124.206-.164.269a.905.905 0 0 0-.065.127 1.751 1.751 0 0 0-.073.225 3.617 3.617 0 0 0-.106.697l-.066.015c-.101.021-.188.03-.269.03a1.007 1.007 0 0 1-.223-.027 1.192 1.192 0 0 1-.253-.094 2.995 2.995 0 0 1-.673-.453 3.12 3.12 0 0 1-.58-.723c-.07-.115-.131-.225-.193-.328a2.08 2.08 0 0 0-.102-.156.98.98 0 0 0-.139-.162c-.128-.12-.253-.228-.369-.33a.487.487 0 0 0-.645.729c.123.108.24.209.346.308.003.004.022.029.049.07.049.077.118.204.208.353.136.225.321.504.589.783a3.87 3.87 0 0 0 1.077.781c.15.074.301.131.453.168.151.037.304.055.452.054.112 0 .223-.01.33-.026.006.175.014.357.021.52l.01.265.005.163-.001.013a.328.328 0 0 1-.032.143.446.446 0 0 1-.105.127c-.038.032-.106.078-.198.146v.001c-.053.04-.11.085-.17.138a.486.486 0 1 0 .643.73c.033-.028.073-.061.118-.096v.001c.052-.041.134-.094.233-.177a1.307 1.307 0 0 0 .485-.992v-.034c0-.071-.003-.165-.007-.282-.007-.174-.017-.395-.024-.604s-.015-.413-.014-.544a1.262 1.262 0 0 1 .002-.102v-.014-.016c0-.293.027-.531.06-.697a1.74 1.74 0 0 1 .058-.224l.104-.17c.057-.096.114-.189.169-.264a.722.722 0 0 1 .126-.143c.03-.023.089-.057.17-.095h.001c.046-.022.098-.044.154-.067-.008.15-.017.382-.026.66a217.57 217.57 0 0 0-.066 2.729c0 .033.004.066.01.098a16.707 16.707 0 0 1-.012.287l-.001.022a1.365 1.365 0 0 1-.05.211.755.755 0 0 1-.079.169c-.069.107-.124.205-.176.294a.485.485 0 1 0 .835.497c.062-.104.111-.192.158-.265.082-.127.141-.259.184-.388.044-.129.07-.256.09-.377v.002a.697.697 0 0 0 .009-.09c.004-.066.009-.17.014-.309.017-.482.041-1.378.061-2.165l.024-1.032.007-.33.002-.057a18.792 18.792 0 0 0 .93-.004l.016.672a371.943 371.943 0 0 0 .076 2.86l.011.275.005.092.003.037a2.34 2.34 0 0 0 .095.426c.043.129.103.261.185.388.047.072.096.161.157.265a.487.487 0 0 0 .836-.497c-.053-.089-.106-.187-.176-.294a.734.734 0 0 1-.079-.169 1.365 1.365 0 0 1-.05-.211l-.004-.067-.009-.241a.462.462 0 0 0 .009-.099 175.59 175.59 0 0 0-.061-2.59l-.024-.685-.005-.107.121.062c.093.047.173.092.211.118.127.087.251.189.339.29.045.049.08.098.105.143a.467.467 0 0 1 .046.109l.004.037.014.219c.018.326.034.855.049 1.349.014.493.024.953.029 1.15a.777.777 0 0 0 .142.429c.174.253.4.456.657.607l.011.006.008.004a.485.485 0 0 0 .475-.847 1.11 1.11 0 0 1-.322-.285c-.007-.286-.021-.898-.04-1.479-.01-.314-.021-.619-.031-.86a15.286 15.286 0 0 0-.028-.425l-.006-.051a1.393 1.393 0 0 0-.164-.446 1.898 1.898 0 0 0-.309-.396 4.619 4.619 0 0 0 1.752-.827c.23-.175.443-.372.63-.597.187-.225.347-.477.47-.758.26-.589.365-1.199.399-1.799a5.65 5.65 0 0 0-.057-1.146zM4.63 13.24zm11.357-7.657s-.001 0 0 0zm-2.914-1.566zm-4.121.08zm-.256-.043zm.158 9.853zm.64 3.046zm-.292-4.914a5.995 5.995 0 0 1-1.071-.232 2.942 2.942 0 0 1-.606-.275 1.824 1.824 0 0 1-.333-.258 1.395 1.395 0 0 1-.32-.487 1.896 1.896 0 0 1-.118-.696c-.002-.498.053-.871.138-1.139.064-.202.142-.343.229-.448a.885.885 0 0 1 .219-.192c.124-.078.279-.135.477-.173s.433-.054.698-.054c.334 0 .715.025 1.128.051s.858.052 1.327.053c.468 0 .913-.027 1.326-.053s.794-.051 1.128-.051c.314 0 .588.023.804.077.162.04.292.096.398.167.08.054.149.118.213.202.096.125.182.299.245.554.063.254.102.586.102 1.004 0 .221-.027.409-.075.571-.042.143-.1.266-.173.378a1.62 1.62 0 0 1-.537.502 3.069 3.069 0 0 1-.627.276c-.36.116-.788.198-1.263.248-.474.05-.994.071-1.541.071a13.469 13.469 0 0 1-1.768-.096z"/>
            <ellipse cx="8.792" cy="9.95" rx=".516" ry=".769"/>
            <ellipse cx="13.146" cy="9.95" rx=".516" ry=".769"/>
            <path d="M10.97 10.74a.49.49 0 0 0-.487.487c0 .128.052.253.142.344.091.09.216.143.345.143a.494.494 0 0 0 .344-.143c.09-.091.143-.216.143-.344s-.053-.253-.143-.344a.49.49 0 0 0-.344-.143z"/>
        </g>
    </symbol>
    <symbol id="help" viewBox="-4 -4 30 30">
        <path fill="#8C96A9"
              d="M11 3a8 8 0 1 0 0 16 8 8 0 0 0 0-16zm.615 13.135a1.48 1.48 0 0 1-.981.365c-.366 0-.693-.122-.983-.365-.289-.244-.435-.59-.435-1.037 0-.445.146-.791.435-1.035.29-.244.617-.363.983-.363s.693.119.981.363c.289.244.437.59.437 1.035 0 .447-.148.793-.437 1.037zm2.379-7.169a3.06 3.06 0 0 1-.329.663 3.944 3.944 0 0 1-.455.578c-.173.184-.342.356-.504.519l-.382.388a3.72 3.72 0 0 0-.357.434 2.654 2.654 0 0 0-.267.479 1.333 1.333 0 0 0-.106.511v.183c0 .082.006.152.016.213H9.598a2.224 2.224 0 0 1-.037-.342 7.24 7.24 0 0 1-.01-.326c0-.285.037-.541.107-.771a3.15 3.15 0 0 1 .283-.64c.116-.198.252-.383.403-.557.152-.172.31-.34.473-.502.233-.234.447-.465.64-.693a1.19 1.19 0 0 0 .289-.785.824.824 0 0 0-.28-.625c-.19-.172-.466-.258-.832-.258a3.78 3.78 0 0 0-1.036.137 5.85 5.85 0 0 0-1.081.442l-.64-1.721c.395-.255.863-.45 1.4-.588a6.416 6.416 0 0 1 1.585-.205c.65 0 1.188.086 1.609.258.42.173.754.392.997.655.243.264.413.554.511.869.099.314.146.614.146.899a2.325 2.325 0 0 1-.131.785z"/>
    </symbol>
    <symbol id="in_favorites" viewBox="-4 -4 30 30">
        <g fill="#F84343">
            <path d="M1.5 8.418v-.004zM20.497 8.412v.006zM20.499 8.26c0-.002 0-.002 0 0 0-.726-.146-1.419-.41-2.048A5.298 5.298 0 0 0 18.188 3.9a5.228 5.228 0 0 0-2.935-.896 5.24 5.24 0 0 0-3.591 1.419c-.242.23-.465.483-.661.755a5.325 5.325 0 0 0-1.262-1.24 5.215 5.215 0 0 0-2.991-.936 5.228 5.228 0 0 0-4.35 2.317A5.213 5.213 0 0 0 1.5 8.258v.001l.002.157c.011.6.087 1.177.219 1.73a8.264 8.264 0 0 0 1.209 2.683c.415.611.907 1.189 1.459 1.734.831.818 1.795 1.57 2.857 2.285a45.635 45.635 0 0 0 3.425 2.065.688.688 0 0 0 .659 0c1.227-.683 2.4-1.371 3.475-2.101a21.189 21.189 0 0 0 2.231-1.715c.508-.451.974-.925 1.39-1.421.622-.743 1.135-1.55 1.492-2.426a7.832 7.832 0 0 0 .579-2.839c.003-.038.003-.079.003-.12l-.001-.031z"/>
        </g>
    </symbol>
    <symbol id="linkedin" viewBox="0 0 30 30">
        <g fill="#8C96A9">
            <path d="M23.129 15.718a6.446 6.446 0 0 0-.293-1.708c-.366-1.165-1.125-1.919-2.327-2.201a5.147 5.147 0 0 0-1.898-.102c-1.075.155-1.946.654-2.528 1.596-.021.026-.039.051-.061.077a19.726 19.726 0 0 1-.023-1.304c0-.112-.026-.148-.145-.148-.965.004-1.931.004-2.896 0-.13 0-.157.042-.157.163.004 3.458.004 6.92 0 10.375 0 .127.035.162.159.159.995-.004 1.987-.003 2.983-.003.18 0 .186 0 .186-.177 0-1.653-.008-3.305.002-4.96.001-.376.022-.753.069-1.126.049-.434.186-.836.467-1.187.498-.616 1.585-.689 2.181-.437.482.2.719.594.847 1.068.109.411.135.825.136 1.245v5.368c0 .065.006.129.009.206H22.996c.167 0 .167 0 .167-.166 0-1.484.005-2.968-.001-4.452a67.06 67.06 0 0 0-.033-2.286zM10.554 11.93H7.557c-.166 0-.167 0-.167.162 0 3.461.001 6.922-.003 10.379 0 .132.04.157.163.154 1.001-.002 2.005-.002 3.007-.002.173 0 .173 0 .173-.175v-5.161-5.182c.001-.175.001-.175-.176-.175zM9.059 6.625a1.92 1.92 0 0 0-1.925 1.93c0 1.071.856 1.932 1.919 1.932a1.934 1.934 0 0 0 1.943-1.929 1.932 1.932 0 0 0-1.937-1.933z"/>
        </g>
    </symbol>
    <symbol id="linkedin_rounded" viewBox="-4 -4 30 30">
        <g fill-rule="evenodd" clip-rule="evenodd" fill="#4E99E3">
            <path d="M19.839 2.161A12.467 12.467 0 0 0 11-1.5c-3.45 0-6.578 1.4-8.839 3.661C-.101 4.422-1.5 7.55-1.5 11s1.399 6.578 3.661 8.839C4.422 22.101 7.55 23.5 11 23.5s6.578-1.399 8.839-3.661C22.1 17.578 23.5 14.45 23.5 11s-1.4-6.578-3.661-8.839zm-.688 16.99c-2.088 2.087-4.967 3.376-8.151 3.376s-6.063-1.289-8.151-3.376C.762 17.063-.527 14.185-.527 11S.762 4.937 2.849 2.849C4.937.762 7.815-.527 11-.527s6.063 1.29 8.151 3.376c2.087 2.088 3.376 4.967 3.376 8.151s-1.289 6.063-3.376 8.151z"/>
            <path d="M16.639 11.377a4.475 4.475 0 0 0-.202-1.175c-.254-.801-.775-1.32-1.601-1.514a3.51 3.51 0 0 0-1.307-.07c-.74.106-1.337.45-1.739 1.097-.012.019-.027.036-.041.053a12.872 12.872 0 0 1-.015-.897c.001-.077-.02-.102-.1-.102-.664.003-1.328.003-1.992 0-.09 0-.108.029-.108.112.002 2.379.002 4.759 0 7.139 0 .087.023.11.109.109.685-.004 1.368-.003 2.053-.003.125 0 .126 0 .126-.123 0-1.137-.003-2.273.002-3.411.001-.259.018-.519.048-.775.034-.298.128-.576.321-.816.342-.424 1.089-.474 1.501-.301.33.138.493.409.581.736.075.28.093.567.094.855v3.694c0 .044.004.089.007.141h2.171c.115 0 .115 0 .115-.115 0-1.021.003-2.041-.001-3.062a48.512 48.512 0 0 0-.022-1.572zM7.988 8.771H5.927c-.114 0-.115 0-.115.111 0 2.38.001 4.761-.002 7.14 0 .09.028.108.112.107.689-.002 1.379-.002 2.068-.002.119 0 .119 0 .119-.121v-3.549-3.566c.001-.12.001-.12-.121-.12zM6.96 5.122c-.736.001-1.324.59-1.324 1.327s.589 1.33 1.32 1.33c.738 0 1.335-.592 1.337-1.327a1.33 1.33 0 0 0-1.333-1.33z"/>
        </g>
    </symbol>
    <symbol id="lupe" viewBox="-4 -4 30 30">
        <path fill="#8C96A9"
              d="M18.512 16.152l-2.375-2.376a1.668 1.668 0 0 0-1.505-.456l-1.091-1.091.106-.152a5.834 5.834 0 0 0 .537-5.52 5.847 5.847 0 0 0-3.63-3.294 5.835 5.835 0 0 0-6.558 2.302 5.826 5.826 0 0 0-.538 5.523 5.847 5.847 0 0 0 3.631 3.294 5.835 5.835 0 0 0 3.997-.196c.406-.172.789-.39 1.142-.646l1.091 1.092a1.668 1.668 0 0 0 .456 1.505l2.375 2.375a1.67 1.67 0 0 0 2.362-2.36zm-7.47-4.041a3.964 3.964 0 0 1-6.188-3.29c0-.551.111-1.068.312-1.545a3.986 3.986 0 0 1 2.475-2.244 3.99 3.99 0 0 1 1.181-.18c.55 0 1.069.111 1.544.312A3.997 3.997 0 0 1 12.61 7.64c.116.372.179.769.179 1.182a3.958 3.958 0 0 1-1.747 3.289z"/>
    </symbol>
    <symbol id="minus" viewBox="0 0 30 30">
        <path fill="#4E99E3" d="M15.611 14.389H19.5a.61.61 0 1 1 0 1.222h-9a.61.61 0 1 1 0-1.222h3.889"/>
    </symbol>
    <symbol id="more_options" viewBox="-4 -4 30 30">
        <g fill="#8C96A9">
            <circle cx="5.24" cy="11" r="2.24"/>
            <circle cx="11" cy="11" r="2.24"/>
            <circle cx="16.76" cy="11" r="2.24"/>
        </g>
    </symbol>
    <symbol id="navigation_other" viewBox="0 0 30 30">
        <g fill="#8C96A9">
            <path d="M15 16.471a1.48 1.48 0 0 0 1.04-.431c.273-.274.431-.652.431-1.04s-.157-.766-.431-1.04c-.274-.273-.652-.431-1.04-.431s-.766.157-1.04.431c-.273.274-.431.652-.431 1.04s.157.766.431 1.04c.274.273.652.431 1.04.431M15 8.941a1.48 1.48 0 0 0 1.04-.431c.273-.273.431-.652.431-1.04s-.157-.766-.431-1.04C15.766 6.157 15.388 6 15 6s-.766.157-1.04.431c-.273.274-.431.653-.431 1.04s.157.766.431 1.04c.274.273.652.43 1.04.43M15 24a1.48 1.48 0 0 0 1.04-.431c.273-.273.431-.652.431-1.04a1.48 1.48 0 0 0-.431-1.04c-.274-.273-.652-.431-1.04-.431s-.766.157-1.04.431a1.485 1.485 0 0 0-.431 1.04c0 .388.157.767.431 1.04A1.48 1.48 0 0 0 15 24"/>
        </g>
    </symbol>
    <symbol id="next" viewBox="-4 -4 30 30">
        <path fill="#8C96A9"
              d="M15.623 11l-1.247-1.25-6.494-6.493a.882.882 0 0 0-1.247 1.247L13.131 11l-6.496 6.497a.882.882 0 0 0 1.247 1.247l6.494-6.492L15.623 11z"/>
    </symbol>
    <symbol id="notifications" viewBox="-4 -4 30 30">
        <g fill="#8C96A9">
            <path d="M16.021 12.721c-.369-3.312-.908-7.458-3.762-8.383.002-.025.014-.044.014-.068A1.27 1.27 0 0 0 11 3c-.702 0-1.271.566-1.271 1.27 0 .024.012.044.014.068-2.853.924-3.392 5.07-3.763 8.383-.127 1.146-2.88 2.86-1.399 2.86h12.835c1.485 0-1.269-1.717-1.395-2.86zM11 19c1.242 0 2.27-.891 2.495-2.066H8.504A2.544 2.544 0 0 0 11 19z"/>
        </g>
    </symbol>
    <symbol id="plus" viewBox="0 0 30 30">
        <path fill="#4E99E3"
              d="M19.5 14.389h-3.889V10.5a.61.61 0 1 0-1.222 0v3.889H10.5a.61.61 0 1 0 0 1.222h3.889V19.5a.61.61 0 1 0 1.222 0v-3.889H19.5a.61.61 0 1 0 0-1.222z"/>
    </symbol>
    <symbol id="previous" viewBox="-4 -4 30 30">
        <path fill="#8C96A9"
              d="M6.377 11l1.247-1.25 6.494-6.493a.882.882 0 0 1 1.247 1.247L8.869 11l6.496 6.497a.882.882 0 0 1-1.247 1.247l-6.494-6.492L6.377 11z"/>
    </symbol>
    <symbol id="to_favorites" viewBox="0 0 30 30">
        <path fill="#8C96A9" d="M5.5 12.414v.004-.004zM24.495 12.414h.004v.002h-.004z"/>
        <path fill="#8C96A9"
              d="M10.748 8.353c.408 0 .805.061 1.18.182.372.119.723.292 1.041.513.358.249.674.561.941.927.254.349.66.555 1.091.555h.003a1.35 1.35 0 0 0 1.092-.56c.146-.201.312-.392.486-.558a3.885 3.885 0 0 1 2.671-1.057 3.877 3.877 0 0 1 2.177.663 3.938 3.938 0 0 1 1.415 1.718c.202.48.305.993.305 1.524v.002l.001.054v.002a6.508 6.508 0 0 1-.482 2.421c-.287.705-.717 1.401-1.276 2.069-.366.437-.788.867-1.254 1.281a19.749 19.749 0 0 1-2.092 1.605c-.838.569-1.789 1.149-3.046 1.855a42.36 42.36 0 0 1-3-1.823c-1.067-.718-1.938-1.413-2.662-2.125a10.354 10.354 0 0 1-1.289-1.528c-.494-.733-.827-1.468-1.015-2.241a6.836 6.836 0 0 1-.182-1.417l-.001-.102v-.056a3.888 3.888 0 0 1 .668-2.184 3.875 3.875 0 0 1 3.228-1.72m0-1.351a5.228 5.228 0 0 0-4.35 2.317 5.213 5.213 0 0 0-.898 2.939v.002l.002.156c.012.601.087 1.178.219 1.73a8.273 8.273 0 0 0 1.209 2.683c.416.611.907 1.189 1.459 1.734.832.817 1.795 1.569 2.857 2.284a45.635 45.635 0 0 0 3.425 2.065.689.689 0 0 0 .66 0c1.227-.683 2.4-1.371 3.475-2.101a21.189 21.189 0 0 0 2.231-1.715 13.57 13.57 0 0 0 1.39-1.422c.622-.742 1.135-1.55 1.492-2.426a7.822 7.822 0 0 0 .579-2.838c.003-.039.003-.08.003-.121l-.001-.031v-.001.001c0-.725-.146-1.418-.41-2.047a5.298 5.298 0 0 0-1.901-2.312 5.228 5.228 0 0 0-2.935-.896 5.24 5.24 0 0 0-3.591 1.419c-.242.23-.465.483-.661.755a5.325 5.325 0 0 0-1.262-1.24 5.22 5.22 0 0 0-2.992-.935z"/>
    </symbol>
    <symbol id="trash" viewBox="-4 -4 30 30">
        <g fill="#8C96A9">
            <path d="M17.72 5.448h-3.952v-.816a1.604 1.604 0 0 0-.125-.623 1.645 1.645 0 0 0-.568-.704 1.677 1.677 0 0 0-.867-.304L12.168 3H9.832l-.039.001a1.661 1.661 0 0 0-1.489 1.156c-.047.15-.071.311-.071.475v.816H4.279a.64.64 0 1 0 0 1.28h13.44a.64.64 0 0 0 .001-1.28zm-8.208-.816a.32.32 0 0 1 .025-.125.355.355 0 0 1 .127-.155.398.398 0 0 1 .194-.072h2.282a.396.396 0 0 1 .291.169.332.332 0 0 1 .057.183v.816H9.512v-.816zM16.44 7.896H5.56c-.185 0-.358.079-.48.218s-.179.321-.155.505l1.28 9.825A.642.642 0 0 0 6.84 19h8.32c.32 0 .593-.239.635-.557l1.279-9.825a.636.636 0 0 0-.634-.722z"/>
        </g>
    </symbol>
    <symbol id="twitter" viewBox="0 0 30 30">
        <path fill="#8C96A9"
              d="M11.907 23H10.8l-.054-.018a11.406 11.406 0 0 1-5.509-1.744l-.054-.04c1.062.104 2.104.021 3.126-.264s1.952-.76 2.81-1.421c-.876-.031-1.649-.294-2.334-.808a3.993 3.993 0 0 1-1.432-2.002 3.957 3.957 0 0 0 1.771-.064c-2.344-.545-3.279-2.702-3.168-3.978.281.104.568.221.857.316.291.095.595.139.907.139-.853-.618-1.421-1.427-1.648-2.453-.229-1.025-.076-2 .444-2.92 2.188 2.577 4.947 3.986 8.313 4.22l.001-.042-.008-.051a4.005 4.005 0 0 1 .366-2.683 4.028 4.028 0 0 1 4.408-2.103 3.96 3.96 0 0 1 2.069 1.127l.133.048a8.023 8.023 0 0 0 2.046-.722c.141-.074.281-.152.422-.227l.021.012c-.053.132-.1.268-.156.396a4.115 4.115 0 0 1-1.567 1.795 6.029 6.029 0 0 0 1.151-.227c.373-.115.737-.244 1.104-.368l-.069.105a8.254 8.254 0 0 1-1.835 1.895l-.091.177a11.07 11.07 0 0 1-.253 2.795c-.561 2.485-1.753 4.608-3.649 6.317a10.658 10.658 0 0 1-3.985 2.261c-.969.303-1.962.468-2.976.515l-.054.017z"/>
    </symbol>
    <symbol id="twitter_rounded" viewBox="-4 -4 30 30">
        <g fill="#4E99E3">
            <path d="M23.5 11h-.506c0 3.313-1.342 6.309-3.513 8.481-2.173 2.171-5.168 3.513-8.481 3.513s-6.309-1.342-8.481-3.513C.348 17.309-.994 14.313-.994 11S.348 4.691 2.519 2.519A11.955 11.955 0 0 1 11-.994c3.313 0 6.309 1.342 8.481 3.513A11.954 11.954 0 0 1 22.994 11h1.012c0-7.183-5.823-13.005-13.006-13.006C3.817-2.005-2.006 3.817-2.006 11S3.817 24.006 11 24.006 24.006 18.183 24.006 11H23.5z"/>
            <path d="M8.845 16.574h-.771l-.037-.012a7.958 7.958 0 0 1-3.839-1.215l-.038-.029c.74.072 1.466.017 2.179-.183a5.625 5.625 0 0 0 1.957-.991 2.785 2.785 0 0 1-1.625-.561 2.789 2.789 0 0 1-.998-1.396 2.73 2.73 0 0 0 1.234-.045c-1.633-.378-2.284-1.881-2.207-2.771.196.073.395.155.598.221.203.066.415.096.632.096-.594-.43-.99-.993-1.149-1.709a2.777 2.777 0 0 1 .308-2.035c1.524 1.795 3.447 2.778 5.792 2.941l.001-.03-.006-.035a2.786 2.786 0 0 1 .255-1.87 2.807 2.807 0 0 1 3.072-1.465c.56.115 1.039.38 1.44.786l.094.034a5.675 5.675 0 0 0 1.425-.503c.099-.051.196-.105.294-.158l.015.009c-.037.092-.07.186-.11.276a2.865 2.865 0 0 1-1.092 1.25c.273-.028.542-.078.802-.157.259-.079.514-.171.77-.257l-.048.071a5.649 5.649 0 0 1-1.28 1.32l-.063.124a7.63 7.63 0 0 1-.177 1.947c-.389 1.731-1.219 3.21-2.54 4.402a7.407 7.407 0 0 1-2.777 1.574 8.2 8.2 0 0 1-2.073.359l-.038.012z"/>
        </g>
    </symbol>
    <symbol id="video" viewBox="0 0 30 30">
        <path fill="#8C96A9"
              d="M21.704 13.909c1.06.577 1.062 1.525.004 2.107l-12.287 6.76c-1.056.58-1.921-.005-1.921-1.297V8.527c0-1.295.866-1.882 1.925-1.307l12.279 6.689z"/>
    </symbol>
    <symbol id="web_rounded" viewBox="-4 -4 30 30">
        <g fill="#4E99E3">
            <path d="M23.014 11h-.486c0 3.185-1.29 6.063-3.376 8.151a11.489 11.489 0 0 1-8.151 3.376 11.484 11.484 0 0 1-8.151-3.376C.762 17.063-.527 14.185-.527 11S.762 4.937 2.849 2.849A11.484 11.484 0 0 1 11-.527c3.185 0 6.063 1.29 8.151 3.376A11.493 11.493 0 0 1 22.527 11h.973c0-3.45-1.4-6.578-3.661-8.839A12.467 12.467 0 0 0 11-1.5c-3.451 0-6.578 1.4-8.839 3.661C-.101 4.422-1.5 7.55-1.5 11s1.399 6.578 3.661 8.839A12.46 12.46 0 0 0 11 23.5c3.45 0 6.578-1.399 8.839-3.661A12.467 12.467 0 0 0 23.5 11h-.486z"/>
            <path fill-rule="evenodd" clip-rule="evenodd"
                  d="M18.42 10.789c-.087-3.874-3.276-7.202-7.417-7.21h-.024a7.427 7.427 0 0 0-7.398 7.627c.086 3.76 3.151 7.215 7.457 7.215.059 0 .119 0 .178-.002a7.412 7.412 0 0 0 7.204-7.63zm-3.769 5.651c-.119-.09-.232-.194-.366-.251-.357-.151-.739-.194-1.127-.189l-.008-.039c-.314.059-.637.09-.942.181-.518.153-1.021.355-1.536.517-.255.079-.525.104-.786.169a1.715 1.715 0 0 0-.433.159c-.127.07-.23.182-.342.276l-.008.008a6.456 6.456 0 0 1-2.755-1.66 6.584 6.584 0 0 1-1.37-2.036 6.372 6.372 0 0 1-.525-2.389A6.64 6.64 0 0 1 4.91 8.59c.024.019.076.026.166.038.392.052.785.098 1.174.164.387.066.523.347.366.701-.146.327-.317.646-.419.985-.117.392-.042.769.295 1.047.16.134.338.245.505.371.205.155.396.313.386.613-.005.202.02.406.053.606.045.274.132.543.162.818.041.371.172.694.404.982.267.33.52.675.889.902.213.132.352.058.363-.196a5.63 5.63 0 0 0 .002-.581c-.016-.322-.084-.647-.057-.966.037-.437.131-.87.221-1.301.07-.343.252-.634.533-.843.219-.16.457-.293.69-.433.247-.148.511-.286.616-.575.133-.369.257-.741.16-1.151a1.409 1.409 0 0 0-.244-.558c-.37-.483-.908-.662-1.465-.803-.242-.059-.493-.09-.733-.158a2.628 2.628 0 0 0-1.3-.052c-.04.009-.096.016-.127-.004-.141-.087-.298-.164-.407-.283-.204-.222-.258-.448-.039-.703.059-.069.117-.139.18-.205.285-.299.598-.576.85-.9.219-.278.447-.521.748-.71.334-.21.645-.455.963-.688.084-.061.163-.127.243-.193.294-.041.591-.062.892-.062h.023a6.622 6.622 0 0 1 2.095.342c-.096.127-.184.353-.165.443.034.165.071.329.122.489.098.309.374.473.662.39.184-.053.363-.119.54-.193.116-.049.228-.088.333 0 .137.115.212.356.146.482-.064.125-.14.25-.23.357-.15.178-.326.335-.477.514-.202.241-.361.498-.365.836-.005.376.134.689.326.997.291.464.681.751 1.247.761.353.006.619.155.79.475.229.433.355.899.367 1.38.012.458-.03.92-.082 1.376a2.545 2.545 0 0 1-.193.733 1.12 1.12 0 0 0 .137 1.085 6.537 6.537 0 0 1-1.605 1.521z"/>
        </g>
    </symbol>
    <symbol id="credit" viewBox="0 0 30 30">
        <circle fill="#FFC134" cx="15.202" cy="15.367" r="9.019"/>
        <path fill="#C68D26"
              d="M15 6.604c2.243 0 4.352.873 5.938 2.459s2.459 3.695 2.459 5.938-.873 4.352-2.459 5.938-3.694 2.46-5.938 2.46-4.352-.874-5.938-2.46S6.603 17.243 6.603 15c0-2.242.874-4.352 2.459-5.938S12.757 6.604 15 6.604M15 5C9.477 5 5 9.478 5 15c0 5.523 4.477 10 10 10 5.522 0 10-4.477 10-10 0-5.522-4.478-10-10-10z"/>
        <g fill="#C68D26">
            <path d="M20.502 18.953c-.642.245-1.269.314-1.382.165l-.003.001c-1.573-1.353-3.642-2.188-5.642-2.188-1.96 0-3.342.823-4.245 2.15h-.003c-.013.037-.112.075-.221.075-.122 0-.218-.024-.218-.082l.001-.011.001-.005c1.074-2.329 3.055-3.823 5.917-3.823 2.425 0 5.033 1.113 6.909 2.872l-.003.001a.103.103 0 0 1 .036.047c.062.176-.434.526-1.147.798z"/>
            <path d="M19.191 15.689c-.017-.01-.18-.089-.287-.144a8.66 8.66 0 0 0-.825-.345l-.131-.049-.239-.086a8.762 8.762 0 0 0-3.331-.489 7.114 7.114 0 0 0-.383.025c-.774.079-1.215.229-1.348.275-.08.028-.17.014-.181-.058-.02-.133.03-.423.055-.603.104-.787.154-1.667-.1-2.582-.252-.913-.891-1.773-1.067-2.043-.195-.3-.062-.404.164-.446.986-.186 3.063.363 4.101.842 1.232.568 3.529 2.386 3.705 5.502.01.198-.037.256-.133.201z"/>
        </g>
    </symbol>
    <symbol id="e-mail_company" viewBox="0 0 30 30">
        <path fill="#BCC5D6"
              d="M18.477 18.988c-.365 0-.666-.051-.906-.153a1.748 1.748 0 0 1-.598-.41 4.22 4.22 0 0 1-.904.353 4.014 4.014 0 0 1-1.059.144 4.207 4.207 0 0 1-1.495-.255 3.206 3.206 0 0 1-1.169-.762 3.467 3.467 0 0 1-.769-1.235c-.182-.489-.272-1.06-.272-1.708 0-.546.084-1.062.255-1.545s.425-.905.761-1.263a3.525 3.525 0 0 1 1.229-.845c.484-.206 1.033-.309 1.647-.309.581 0 1.112.046 1.596.137.484.091.857.183 1.119.273v5.225c0 .365.062.621.188.768a.616.616 0 0 0 .494.224c.297 0 .557-.103.777-.308s.402-.473.547-.803c.141-.33.247-.703.314-1.119.068-.416.104-.839.104-1.272 0-.717-.124-1.391-.376-2.023a4.982 4.982 0 0 0-1.074-1.665 4.98 4.98 0 0 0-1.7-1.127c-.665-.273-1.413-.41-2.246-.41-.83 0-1.593.139-2.288.418-.694.279-1.292.678-1.792 1.196s-.89 1.151-1.169 1.903c-.279.751-.418 1.605-.418 2.562 0 1.001.147 1.88.444 2.637.295.757.708 1.39 1.237 1.896a5.182 5.182 0 0 0 1.879 1.145c.722.257 1.516.384 2.381.384.671 0 1.226-.04 1.666-.118.438-.08.72-.145.845-.188l.172 1.263c-.194.067-.545.144-1.051.224-.507.078-1.051.118-1.631.118a9.257 9.257 0 0 1-2.868-.437 6.453 6.453 0 0 1-2.355-1.33c-.671-.6-1.204-1.361-1.597-2.287-.393-.93-.589-2.03-.589-3.304 0-1.229.193-2.305.581-3.227.386-.922.907-1.688 1.562-2.296a6.535 6.535 0 0 1 2.271-1.374 8.001 8.001 0 0 1 2.722-.461c.933 0 1.817.151 2.647.453a6.4 6.4 0 0 1 2.185 1.314 6.257 6.257 0 0 1 1.485 2.083c.365.814.548 1.733.548 2.757 0 .774-.089 1.458-.265 2.049-.178.592-.415 1.09-.71 1.494a2.943 2.943 0 0 1-1.059.912c-.41.201-.841.302-1.296.302zm-3.415-1.383c.238 0 .48-.025.726-.076.244-.051.464-.129.657-.23a2.845 2.845 0 0 1-.068-.443 5.258 5.258 0 0 1-.018-.426v-4.014a2.424 2.424 0 0 0-.394-.068 5.723 5.723 0 0 0-.649-.035c-.808 0-1.412.251-1.81.751-.398.501-.598 1.133-.598 1.896 0 .808.194 1.452.581 1.929.387.478.911.716 1.573.716z"/>
    </symbol>
    <symbol id="favorites_notification" viewBox="-4 -4 30 30">
        <g fill="#F84343">
            <path d="M1.5 8.418v-.004zM20.497 8.412v.006zM20.499 8.26c0-.002 0-.002 0 0 0-.726-.146-1.419-.41-2.048A5.298 5.298 0 0 0 18.188 3.9a5.228 5.228 0 0 0-2.935-.896 5.24 5.24 0 0 0-3.591 1.419c-.242.23-.465.483-.661.755a5.325 5.325 0 0 0-1.262-1.24 5.215 5.215 0 0 0-2.991-.936 5.228 5.228 0 0 0-4.35 2.317A5.213 5.213 0 0 0 1.5 8.258v.001l.002.157c.011.6.087 1.177.219 1.73a8.264 8.264 0 0 0 1.209 2.683c.415.611.907 1.189 1.459 1.734.831.818 1.795 1.57 2.857 2.285a45.635 45.635 0 0 0 3.425 2.065.688.688 0 0 0 .659 0c1.227-.683 2.4-1.371 3.475-2.101a21.189 21.189 0 0 0 2.231-1.715c.508-.451.974-.925 1.39-1.421.622-.743 1.135-1.55 1.492-2.426a7.832 7.832 0 0 0 .579-2.839c.003-.038.003-.079.003-.12l-.001-.031z"/>
        </g>
    </symbol>
    <symbol id="flash_caution" viewBox="-4 -4 30 30">
        <circle fill="#F08D3D" cx="11" cy="11" r="8"/>
        <path fill="#FFF"
              d="M12.152 14.547c0 .364-.117.645-.354.844-.236.197-.503.297-.8.297s-.564-.1-.799-.297c-.235-.199-.353-.479-.353-.844 0-.363.118-.645.353-.843.235-.198.502-.297.799-.297s.563.099.8.297.354.48.354.843zm-.088-6.163c0 .719-.027 1.39-.08 2.011a37.17 37.17 0 0 1-.213 1.893h-1.519a42.503 42.503 0 0 1-.22-1.893 22.44 22.44 0 0 1-.085-2.011V6h2.118v2.384h-.001z"/>
    </symbol>
    <symbol id="flash_error" viewBox="-4 -4 30 30">
        <circle fill="#F84343" cx="11" cy="11" r="8"/>
        <path fill="#FFF"
              d="M15.558 7.857l-1.414-1.414L11 9.587 7.858 6.443 6.444 7.857l3.142 3.144-3.142 3.142 1.414 1.414L11 12.415l3.141 3.142 1.414-1.414-3.141-3.142z"/>
    </symbol>
    <symbol id="flash_succes" viewBox="-4 -4 30 30">
        <circle fill="#19AA4C" cx="11" cy="11" r="8"/>
        <path fill="#FFF" d="M14.501 6.493l-4.966 6.083-2.13-2.251L6 11.656l3.642 3.852L16 7.717z"/>
    </symbol>
    <symbol id="job_offer" viewBox="0 0 30 30">
        <g fill="#BCC5D6">
            <path d="M8.969 14.835c1.213.748 2.844 1.19 4.278 1.187v-.803a.311.311 0 0 1 .311-.312h2.885a.308.308 0 0 1 .314.312v.803a8.672 8.672 0 0 0 3.302-.685c1.039-.44 1.92-1.078 2.426-1.8.33-.471.506-.966.518-1.509v-.074a2.06 2.06 0 0 0-2.062-2.063h-3.246V8.812a1.822 1.822 0 0 0-1.275-1.731A1.815 1.815 0 0 0 15.878 7h-1.756a1.81 1.81 0 0 0-1.813 1.812V9.89H9.063c-.284 0-.557.058-.804.163a2.044 2.044 0 0 0-.907.746A2.034 2.034 0 0 0 7 11.953v.03c.001.561.182 1.07.521 1.553.338.482.839.926 1.448 1.299zm4.584-6.023a.56.56 0 0 1 .568-.567h1.756a.563.563 0 0 1 .542.399c.017.054.026.11.026.169v1.079h-2.894v-1.08h.002z"/>
            <path d="M21.703 15.922c-1.449.887-3.262 1.373-4.947 1.376v.806a.304.304 0 0 1-.09.219.32.32 0 0 1-.221.091H13.56a.315.315 0 0 1-.221-.091.304.304 0 0 1-.09-.219v-.805l-.001-.001a9.911 9.911 0 0 1-3.799-.788c-.934-.397-1.785-.94-2.449-1.624v6.052A2.064 2.064 0 0 0 9.063 23h11.873a2.063 2.063 0 0 0 2.065-2.06v-6.05c-.38.39-.815.736-1.298 1.032z"/>
        </g>
    </symbol>
    <symbol id="job_offer_notification" viewBox="0 0 30 30">
        <g fill="#19AA4C">
            <path d="M8.969 14.835c1.213.748 2.844 1.19 4.278 1.187v-.803a.311.311 0 0 1 .311-.312h2.886a.313.313 0 0 1 .313.312v.803a8.663 8.663 0 0 0 3.301-.685c1.039-.44 1.921-1.078 2.426-1.8.33-.471.506-.966.518-1.509v-.074a2.06 2.06 0 0 0-2.063-2.063h-3.245V8.812a1.82 1.82 0 0 0-1.275-1.731A1.803 1.803 0 0 0 15.878 7h-1.756a1.81 1.81 0 0 0-1.813 1.812V9.89H9.063c-.284 0-.557.058-.804.163a2.044 2.044 0 0 0-.907.746A2.034 2.034 0 0 0 7 11.953v.03c.001.561.182 1.07.521 1.553.338.482.839.926 1.448 1.299zm4.584-6.023a.56.56 0 0 1 .568-.567h1.756a.568.568 0 0 1 .568.568v1.079h-2.893v-1.08z"/>
            <path d="M21.703 15.922c-1.449.887-3.262 1.373-4.947 1.376v.806a.305.305 0 0 1-.09.218.318.318 0 0 1-.22.091H13.56a.315.315 0 0 1-.221-.091.301.301 0 0 1-.09-.218v-.805l-.001-.001a9.911 9.911 0 0 1-3.799-.788c-.934-.397-1.785-.94-2.449-1.624v6.051a2.073 2.073 0 0 0 .91 1.712c.163.11.347.201.541.257.193.062.4.094.612.094h11.873a2.058 2.058 0 0 0 1.971-1.446c.061-.196.093-.4.093-.614v-6.05c-.379.39-.815.736-1.297 1.032z"/>
        </g>
    </symbol>
    <symbol id="logo" viewBox="329.858 605.441 38 38">
        <path fill="#2C659D"
              d="M364.456 638.15c-1.894.725-3.745.928-4.079.486l-.01.004c-4.646-3.996-10.754-6.465-16.664-6.465-5.788 0-9.871 2.433-12.537 6.352h-.013c-.038.109-.33.224-.651.224-.359 0-.644-.073-.644-.243 0-.011.001-.021.003-.031 0-.006 0-.011.003-.016 3.17-6.879 9.025-11.292 17.474-11.292 7.163 0 14.867 3.288 20.407 8.481l-.009.004a.295.295 0 0 1 .106.139c.186.519-1.28 1.551-3.386 2.357z"/>
        <path fill="#4E99E3"
              d="M360.587 629.458c-.05-.029-.53-.265-.848-.425-.578-.291-1.403-.632-2.438-1.019a93.878 93.878 0 0 0-1.093-.399 25.647 25.647 0 0 0-5.127-1.232 19.725 19.725 0 0 0-1.138-.122 24.44 24.44 0 0 0-3.574-.089c-.395.014-.776.038-1.13.074-2.29.232-3.591.676-3.981.812-.238.083-.501.042-.533-.17-.058-.391.09-1.25.161-1.781.309-2.323.456-4.921-.292-7.626s-2.635-5.241-3.158-6.042c-.577-.886-.18-1.193.486-1.318 2.913-.546 9.046 1.074 12.11 2.488 3.641 1.678 10.425 7.047 10.943 16.249.033.589-.104.761-.388.6z"/>
    </symbol>
    <symbol id="phone_company" viewBox="0 0 30 30">
        <path fill="#BCC5D6"
              d="M12.225 8.471l-3.801 3.8.001.002a1.609 1.609 0 0 0 .046 2.226l7.03 7.03a1.606 1.606 0 0 0 2.274 0l3.754-3.754a1.607 1.607 0 0 0 0-2.273l-7.031-7.03a1.606 1.606 0 0 0-2.273-.001zm6.822 10.576a.853.853 0 0 1-1.209 0 .854.854 0 1 1 1.209-1.209.855.855 0 0 1 0 1.209zm-4.022.392L9.35 13.765l4.415-4.415 5.676 5.675-4.416 4.414z"/>
    </symbol>
    <symbol id="web_company" viewBox="0 0 30 30">
        <path fill="#BCC5D6"
              d="M21.904 16.15l.011-.061.015-.095.01-.071.012-.089.009-.079.009-.084c.004-.029.006-.058.008-.086l.006-.08.007-.095.004-.072.005-.109.002-.06v-.17-.015.001A7.004 7.004 0 0 0 16.4 8.138l-.027-.005a4.336 4.336 0 0 0-.157-.03l-.053-.009a39.607 39.607 0 0 0-.134-.021l-.062-.009-.126-.017-.064-.007a5.461 5.461 0 0 0-.127-.013l-.064-.006a5.77 5.77 0 0 0-.131-.01l-.062-.004a3.442 3.442 0 0 0-.145-.006L15.198 8H15a6.989 6.989 0 0 0-1.997.289l-.015.005.005-.002-.038.012-.096.03-.052.017-.095.032-.049.017-.097.035-.031.013c-.078.028-.155.06-.231.091l-.006.003-.096.041-.045.021-.091.041-.049.022-.089.043-.047.023c-.03.015-.061.03-.09.046l-.028.015a7.706 7.706 0 0 0-.2.108l-.024.014c-.029.017-.058.033-.086.051a1.873 1.873 0 0 0-.046.027c-.027.016-.055.032-.082.05l-.049.03-.08.051-.046.03-.081.055-.029.02a10.05 10.05 0 0 0-.206.147l-.074.056-.048.037-.071.056-.049.04-.069.057-.048.04a.983.983 0 0 0-.071.057l-.04.035a6.824 6.824 0 0 0-.129.117l-.047.044-.062.06-.049.048-.06.06-.049.05-.057.06-.05.054-.055.06a4.525 4.525 0 0 0-.063.071l-.08.091-.051.061-.049.061c-.017.021-.033.04-.048.061l-.048.061-.048.062-.045.061-.05.068-.041.057a3.62 3.62 0 0 0-.083.12l-.035.053a3.302 3.302 0 0 0-.05.076l-.038.061-.045.072-.037.062-.044.074c-.011.021-.023.04-.035.06l-.048.086-.028.05-.07.133-.025.051-.045.09-.028.06-.04.084-.027.061-.038.087-.025.058-.042.104-.017.042-.055.144-.017.049-.036.102-.02.059c-.01.031-.021.062-.03.094l-.019.061-.029.098-.016.056a5.797 5.797 0 0 0-.034.125l-.008.029-.038.154a.704.704 0 0 1-.011.049l-.024.109-.012.059-.02.103-.011.06-.018.107-.008.054-.021.145a7.992 7.992 0 0 0-.021.18l-.005.05-.01.114-.004.061-.007.107a25.308 25.308 0 0 1-.007.175L8 14.844V15c0 .754.12 1.479.34 2.16v-.001.001l.055.162.001.003.059.159.001.002c.02.055.041.106.062.16l.001.002c.021.053.043.104.066.156l.001.002c.023.053.046.104.07.154l.001.003c.024.052.048.103.073.151l.002.004c.025.05.05.1.076.148l.002.004c.026.049.052.099.08.146l.003.005c.027.048.054.097.083.144l.003.006.086.141.003.006c.029.047.059.092.089.137l.004.008.092.135.004.006c.031.045.062.089.095.133l.004.006c.032.045.065.088.098.131l.004.006c.033.044.067.086.102.129l.004.005.105.126.002.003-.002-.003a6.997 6.997 0 0 0 3.564 2.237l-.002-.002.002.002.053.013c.032.008.063.017.095.022l.055.014c.043.01.086.02.13.027l.054.012.108.021c.013.003.027.007.041.009.046.008.092.016.139.022l.048.007c.048.008.096.016.144.021l.028.003.131.016.039.004.151.015c.01 0 .021 0 .031.002.047.002.094.007.142.009l.022.001.159.007h.032c.056-.003.11-.002.165-.002l.017-.001h-.001a7 7 0 0 0 6.888-5.849zM20.859 15c0 1.312-.43 2.561-1.223 3.582a1.247 1.247 0 0 1-.153-.588c0-.15.029-.303.091-.443.086-.195.143-.416.166-.631.041-.371.075-.743.075-1.109 0-.045 0-.092-.002-.138a2.699 2.699 0 0 0-.319-1.203.704.704 0 0 0-.175-.218.555.555 0 0 0-.225-.112.837.837 0 0 0-.193-.023 1.49 1.49 0 0 1-.403-.061 1.363 1.363 0 0 1-.349-.158 1.732 1.732 0 0 1-.527-.558 2.394 2.394 0 0 1-.23-.458 1.513 1.513 0 0 1-.096-.527l.001-.019c.002-.181.046-.343.115-.485a1.85 1.85 0 0 1 .258-.385c.074-.088.152-.168.228-.246.076-.077.147-.152.213-.229v-.001c.072-.085.137-.189.193-.3 0 0 .002-.003.002-.008.002-.006.002-.014.002-.023a.293.293 0 0 0-.029-.12.304.304 0 0 0-.071-.101.04.04 0 0 0-.017-.01.029.029 0 0 0-.012-.002.177.177 0 0 0-.044.008.654.654 0 0 0-.073.028c-.166.069-.34.133-.516.184a.618.618 0 0 1-.567-.11.723.723 0 0 1-.237-.353l-.001-.001a4.504 4.504 0 0 1-.115-.465v.002a.328.328 0 0 1-.006-.059c0-.033.005-.063.011-.094.007-.03.017-.061.025-.092a.921.921 0 0 1 .034-.087 5.812 5.812 0 0 1 2.451 1.469A5.816 5.816 0 0 1 20.859 15zm-9.397-3.088c.02.041.052.086.097.135a.67.67 0 0 0 .146.115c.053.034.114.068.176.106l.021-.004c.177-.039.353-.058.528-.058.251 0 .5.038.747.108.206.059.436.087.672.146.195.05.392.105.583.181.19.075.375.172.544.304.113.088.217.191.311.313.067.088.119.182.159.277.041.097.07.196.094.297.024.106.036.21.036.312 0 .153-.024.299-.061.438a4.476 4.476 0 0 1-.13.401.807.807 0 0 1-.121.218 1.007 1.007 0 0 1-.162.164c-.116.093-.24.162-.352.229-.218.131-.434.252-.623.393a1.082 1.082 0 0 0-.279.299 1.131 1.131 0 0 0-.152.384c-.083.397-.168.791-.201 1.181a1.864 1.864 0 0 0-.005.131c0 .113.011.232.024.356.013.123.028.251.034.382a5.048 5.048 0 0 1-.002.553v-.003a.585.585 0 0 1-.025.155.312.312 0 0 1-.158.202.33.33 0 0 1-.269.01.648.648 0 0 1-.121-.06 2.299 2.299 0 0 1-.479-.408c-.137-.149-.259-.31-.38-.459a1.873 1.873 0 0 1-.276-.463 1.945 1.945 0 0 1-.13-.524 3.379 3.379 0 0 0-.067-.358c-.028-.124-.06-.253-.082-.388-.028-.17-.05-.35-.05-.529v-.059-.015a.329.329 0 0 0-.044-.177.55.55 0 0 0-.125-.146 4.961 4.961 0 0 0-.125-.1c-.146-.11-.312-.215-.471-.346a.973.973 0 0 1-.376-.778c0-.117.019-.235.054-.353a3.66 3.66 0 0 1 .186-.479c.07-.153.143-.302.208-.448a.445.445 0 0 0 .045-.187.21.21 0 0 0-.032-.118.25.25 0 0 0-.104-.085.516.516 0 0 0-.13-.039c-.354-.06-.714-.102-1.077-.15l-.016-.002a5.843 5.843 0 0 1 1.355-2.109 5.814 5.814 0 0 1 3.317-1.658c-.074.036-.227.101-.697.422-.418.285-.588.516-.694.619a3.273 3.273 0 0 0-.302.343 5.15 5.15 0 0 1-.393.437c-.136.138-.273.271-.401.405a4.407 4.407 0 0 0-.16.182.445.445 0 0 0-.073.112.218.218 0 0 0 .008.193zm1.846 8.609c.055-.049.116-.098.188-.139a1.82 1.82 0 0 1 .438-.162c.127-.031.253-.053.373-.074a2.83 2.83 0 0 0 .343-.078c.468-.146.932-.332 1.418-.478.15-.044.302-.072.449-.099.148-.024.602-.037.602-.037.326.006.654.053.971.187a.994.994 0 0 1 .205.123c.02.016.039.028.057.043a5.809 5.809 0 0 1-3.353 1.053 5.838 5.838 0 0 1-1.768-.271l.077-.068zm2.894-12.418zm-.193-.031l-.006-.001.006.001zm-.197-.025l-.008-.001.008.001zm-.198-.02l-.007-.001.007.001zm-.202-.015h-.003.003zm-2.094 13.784l.031.007-.031-.007z"/>
    </symbol>
    <symbol id="next_small" viewBox="0 0 30 30">
        <path fill="#8C96A9"
              d="M15.886 15l-3.403-3.403a.642.642 0 1 1 .908-.908l3.405 3.401.91.91-.91.908-3.405 3.403a.642.642 0 1 1-.908-.909L15.886 15z"/>
    </symbol>
    <symbol id="previous_small" viewBox="0 0 30 30">
        <path fill="#8C96A9"
              d="M14.114 15l3.403-3.403a.642.642 0 1 0-.908-.908l-3.404 3.401-.91.91.91.908 3.404 3.403a.642.642 0 1 0 .908-.909L14.114 15z"/>
    </symbol>
</svg>