<?xml version="1.0" encoding="utf-8"?>
<!-- Generator: Adobe Illustrator 16.0.0, SVG Export Plug-In . SVG Version: 6.00 Build 0)  -->
<!DOCTYPE svg PUBLIC "-//W3C//DTD SVG 1.1//EN" "http://www.w3.org/Graphics/SVG/1.1/DTD/svg11.dtd">
<svg version="1.1" id="Layer_1" xmlns="http://www.w3.org/2000/svg" xmlns:xlink="http://www.w3.org/1999/xlink" x="0px" y="0px"
	 width="30px" height="30px" viewBox="0 0 30 30" enable-background="new 0 0 30 30" xml:space="preserve">
<path fill="#8C96A9" d="M15.001,23.088l2.187-2.182L28.546,9.544c0.605-0.603,0.605-1.577,0-2.182c-0.604-0.602-1.575-0.602-2.179,0
	L15.001,18.729L3.633,7.362c-0.605-0.602-1.577-0.602-2.183,0c-0.602,0.605-0.602,1.579,0,2.182l11.36,11.362L15.001,23.088z"/>
</svg>
