<?xml version="1.0" encoding="utf-8"?>
<!-- Generator: Adobe Illustrator 16.0.0, SVG Export Plug-In . SVG Version: 6.00 Build 0)  -->
<!DOCTYPE svg PUBLIC "-//W3C//DTD SVG 1.1//EN" "http://www.w3.org/Graphics/SVG/1.1/DTD/svg11.dtd">
<svg version="1.1" id="Layer_1" xmlns="http://www.w3.org/2000/svg" xmlns:xlink="http://www.w3.org/1999/xlink" x="0px" y="0px"
	 width="30px" height="30px" viewBox="0 0 30 30" enable-background="new 0 0 30 30" xml:space="preserve">
<g>
	<path fill="#BCC5D6" d="M9.45,1.942L1.847,9.541L1.85,9.545c-1.162,1.262-1.131,3.225,0.093,4.452l14.059,14.06
		c1.256,1.258,3.292,1.258,4.55,0l7.506-7.507c1.257-1.254,1.257-3.293,0-4.547L13.996,1.944C12.742,0.686,10.706,0.686,9.45,1.942z
		 M23.093,23.093c-0.667,0.67-1.75,0.67-2.417,0c-0.67-0.667-0.669-1.75,0-2.417c0.667-0.669,1.75-0.669,2.417,0
		C23.762,21.343,23.762,22.426,23.093,23.093z M15.049,23.879L3.7,12.53l8.83-8.83l11.351,11.349L15.049,23.879z"/>
</g>
</svg>
