<?xml version="1.0" encoding="utf-8"?>
<!-- Generator: Adobe Illustrator 16.0.0, SVG Export Plug-In . SVG Version: 6.00 Build 0)  -->
<!DOCTYPE svg PUBLIC "-//W3C//DTD SVG 1.1//EN" "http://www.w3.org/Graphics/SVG/1.1/DTD/svg11.dtd">
<svg version="1.1" id="Layer_1" xmlns="http://www.w3.org/2000/svg" xmlns:xlink="http://www.w3.org/1999/xlink" x="0px" y="0px"
	 width="30px" height="30px" viewBox="0 0 30 30" enable-background="new 0 0 30 30" xml:space="preserve">
<path fill="#8C96A9" d="M15,1C7.271,1,1,7.271,1,15c0,7.733,6.271,14,14,14c7.733,0,14-6.267,14-14C29,7.271,22.733,1,15,1z
	 M16.078,23.988c-0.505,0.422-1.078,0.637-1.72,0.637c-0.641,0-1.213-0.215-1.721-0.637c-0.506-0.43-0.759-1.033-0.759-1.818
	c0-0.775,0.253-1.381,0.759-1.81c0.507-0.428,1.08-0.634,1.721-0.634c0.642,0,1.215,0.206,1.72,0.634
	c0.505,0.429,0.764,1.034,0.764,1.81C16.842,22.955,16.583,23.559,16.078,23.988z M20.24,11.441
	c-0.151,0.417-0.342,0.802-0.577,1.157c-0.229,0.36-0.494,0.694-0.795,1.012c-0.302,0.324-0.6,0.625-0.884,0.911
	c-0.209,0.215-0.432,0.44-0.665,0.68c-0.237,0.239-0.438,0.494-0.626,0.757c-0.189,0.269-0.342,0.546-0.467,0.837
	c-0.121,0.294-0.188,0.597-0.188,0.897c0,0.07,0,0.179,0,0.318c0,0.146,0.012,0.269,0.027,0.376h-3.518
	c-0.037-0.178-0.06-0.379-0.066-0.6c-0.011-0.222-0.021-0.412-0.021-0.572c0-0.496,0.066-0.945,0.189-1.35
	c0.13-0.398,0.293-0.77,0.494-1.121c0.204-0.345,0.444-0.67,0.707-0.974c0.269-0.301,0.544-0.593,0.83-0.877
	c0.405-0.41,0.782-0.815,1.117-1.214c0.337-0.399,0.51-0.854,0.51-1.372c0-0.426-0.169-0.791-0.491-1.094
	C15.481,8.913,15,8.763,14.358,8.763c-0.641,0-1.245,0.076-1.81,0.237c-0.572,0.161-1.201,0.42-1.894,0.775L9.534,6.765
	c0.693-0.447,1.513-0.789,2.449-1.032c0.943-0.238,1.869-0.358,2.774-0.358c1.142,0,2.079,0.15,2.816,0.451
	c0.735,0.303,1.321,0.686,1.746,1.147c0.424,0.462,0.722,0.969,0.895,1.52c0.173,0.549,0.255,1.076,0.255,1.573
	C20.468,10.565,20.39,11.023,20.24,11.441z"/>
</svg>
