<?xml version="1.0" encoding="utf-8"?>
<!-- Generator: Adobe Illustrator 16.0.0, SVG Export Plug-In . SVG Version: 6.00 Build 0)  -->
<!DOCTYPE svg PUBLIC "-//W3C//DTD SVG 1.1//EN" "http://www.w3.org/Graphics/SVG/1.1/DTD/svg11.dtd">
<svg version="1.1" id="Layer_1" xmlns="http://www.w3.org/2000/svg" xmlns:xlink="http://www.w3.org/1999/xlink" x="0px" y="0px"
	 width="30px" height="30px" viewBox="0 0 30 30" enable-background="new 0 0 30 30" xml:space="preserve">
<g>
	<path fill="#8C96A9" d="M14.999,17.29c0.604,0,1.194-0.243,1.616-0.674c0.428-0.422,0.674-1.013,0.674-1.616
		c0-0.603-0.243-1.191-0.674-1.617c-0.422-0.424-1.013-0.67-1.616-0.67s-1.191,0.241-1.617,0.67c-0.424,0.426-0.67,1.014-0.67,1.617
		c0,0.604,0.245,1.194,0.67,1.616C13.808,17.044,14.396,17.29,14.999,17.29"/>
	<path fill="#8C96A9" d="M14.999,5.576c0.604,0,1.194-0.244,1.616-0.67c0.428-0.424,0.674-1.017,0.674-1.62
		c0-0.604-0.243-1.191-0.674-1.617C16.193,1.245,15.603,1,14.999,1s-1.191,0.245-1.617,0.67c-0.424,0.425-0.67,1.015-0.67,1.617
		c0,0.602,0.245,1.194,0.67,1.62C13.808,5.332,14.396,5.576,14.999,5.576"/>
	<path fill="#8C96A9" d="M14.999,29c0.604,0,1.194-0.245,1.616-0.675c0.428-0.42,0.674-1.013,0.674-1.615
		c0-0.602-0.243-1.187-0.674-1.617c-0.422-0.421-1.013-0.666-1.616-0.666s-1.191,0.244-1.617,0.666
		c-0.424,0.431-0.67,1.016-0.67,1.617c0,0.603,0.245,1.195,0.67,1.615C13.808,28.755,14.396,29,14.999,29"/>
</g>
</svg>
