<?xml version="1.0" encoding="utf-8"?>
<!-- Generator: Adobe Illustrator 16.0.0, SVG Export Plug-In . SVG Version: 6.00 Build 0)  -->
<!DOCTYPE svg PUBLIC "-//W3C//DTD SVG 1.1//EN" "http://www.w3.org/Graphics/SVG/1.1/DTD/svg11.dtd">
<svg version="1.1" id="Layer_1" xmlns="http://www.w3.org/2000/svg" xmlns:xlink="http://www.w3.org/1999/xlink" x="0px" y="0px"
	 width="30px" height="30px" viewBox="0 0 30 30" enable-background="new 0 0 30 30" xml:space="preserve">
<path fill="#F84343" d="M15,1C7.268,1,1,7.268,1,15c0,7.732,6.268,14,14,14c7.732,0,14-6.268,14-14C29,7.268,22.732,1,15,1z
	 M22.969,20.501l-2.473,2.474l-5.497-5.496L9.5,22.975l-2.475-2.474l5.499-5.498L7.025,9.501L9.5,7.026l5.499,5.502l5.503-5.502
	l2.473,2.475l-5.502,5.502L22.969,20.501z"/>
</svg>
