<?xml version="1.0" encoding="utf-8"?>
<!-- Generator: Adobe Illustrator 16.0.0, SVG Export Plug-In . SVG Version: 6.00 Build 0)  -->
<!DOCTYPE svg PUBLIC "-//W3C//DTD SVG 1.1//EN" "http://www.w3.org/Graphics/SVG/1.1/DTD/svg11.dtd">
<svg version="1.1" id="Layer_1" xmlns="http://www.w3.org/2000/svg" xmlns:xlink="http://www.w3.org/1999/xlink" x="0px" y="0px"
	 width="30px" height="30px" viewBox="0 0 30 30" enable-background="new 0 0 30 30" xml:space="preserve">
<path fill="#8C96A9" d="M17.828,15L28.416,4.413c0.778-0.779,0.778-2.048,0-2.828c-0.781-0.78-2.048-0.78-2.828,0L15,12.173
	L4.413,1.585c-0.779-0.78-2.048-0.78-2.828,0c-0.78,0.779-0.78,2.048,0,2.828L12.173,15L1.585,25.588c-0.78,0.78-0.78,2.047,0,2.828
	c0.779,0.778,2.048,0.778,2.828,0L15,17.828l10.587,10.588c0.78,0.778,2.047,0.778,2.828,0c0.778-0.781,0.778-2.048,0-2.828
	L17.828,15z"/>
</svg>
