<?xml version="1.0" encoding="utf-8"?>
<!-- Generator: Adobe Illustrator 16.0.0, SVG Export Plug-In . SVG Version: 6.00 Build 0)  -->
<!DOCTYPE svg PUBLIC "-//W3C//DTD SVG 1.1//EN" "http://www.w3.org/Graphics/SVG/1.1/DTD/svg11.dtd">
<svg version="1.1" id="Layer_1" xmlns="http://www.w3.org/2000/svg" xmlns:xlink="http://www.w3.org/1999/xlink" x="0px" y="0px"
	 width="30px" height="30px" viewBox="0 0 30 30" enable-background="new 0 0 30 30" xml:space="preserve">
<path fill="#8C96A9" d="M23.089,15l-2.181-2.188L9.544,1.451c-0.603-0.602-1.576-0.602-2.182,0c-0.602,0.604-0.602,1.58,0,2.183
	L18.729,15L7.362,26.369c-0.602,0.604-0.602,1.575,0,2.18c0.606,0.602,1.579,0.602,2.182,0L20.908,17.19L23.089,15z"/>
</svg>
