<?xml version="1.0" encoding="utf-8"?>
<!-- Generator: Adobe Illustrator 16.0.0, SVG Export Plug-In . SVG Version: 6.00 Build 0)  -->
<!DOCTYPE svg PUBLIC "-//W3C//DTD SVG 1.1//EN" "http://www.w3.org/Graphics/SVG/1.1/DTD/svg11.dtd">
<svg version="1.1" id="Layer_1" xmlns="http://www.w3.org/2000/svg" xmlns:xlink="http://www.w3.org/1999/xlink" x="0px" y="0px"
	 width="30px" height="30px" viewBox="0 0 30 30" enable-background="new 0 0 30 30" xml:space="preserve">
<g>
	<path fill="#BCC5D6" d="M4.446,14.711c2.124,1.309,4.977,2.082,7.486,2.076V16.69v-1.308c0-0.146,0.053-0.287,0.158-0.384
		c0.103-0.104,0.242-0.16,0.386-0.16h5.049c0.143,0,0.281,0.057,0.39,0.16c0.103,0.1,0.158,0.239,0.158,0.384v1.308v0.097
		c1.882,0.004,3.959-0.428,5.774-1.199c1.819-0.769,3.361-1.884,4.246-3.147c0.577-0.824,0.888-1.691,0.908-2.641V9.723V9.671
		c0-0.497-0.101-0.974-0.287-1.405c-0.271-0.651-0.73-1.199-1.305-1.588c-0.286-0.194-0.604-0.349-0.948-0.456
		c-0.337-0.105-0.695-0.161-1.068-0.161h-5.679V4.174c0-0.436-0.089-0.856-0.253-1.238c-0.241-0.568-0.639-1.051-1.144-1.393
		c-0.258-0.169-0.536-0.304-0.835-0.399c-0.301-0.095-0.622-0.141-0.948-0.141h-3.072c-0.436,0-0.856,0.086-1.235,0.248
		c-0.571,0.239-1.051,0.642-1.395,1.148c-0.172,0.25-0.307,0.534-0.401,0.833c-0.095,0.297-0.141,0.616-0.141,0.942V6.06H4.611
		c-0.497,0-0.975,0.102-1.407,0.286C2.555,6.616,2.007,7.072,1.618,7.65c-0.192,0.287-0.35,0.602-0.456,0.946
		c-0.102,0.339-0.16,0.703-0.16,1.073v0.052c0.002,0.981,0.318,1.873,0.911,2.717C2.504,13.283,3.381,14.059,4.446,14.711z
		 M12.467,4.174L12.467,4.174c0-0.143,0.027-0.269,0.08-0.387c0.073-0.178,0.198-0.331,0.36-0.44c0.08-0.052,0.167-0.096,0.26-0.122
		c0.092-0.031,0.19-0.043,0.294-0.043h3.072c0.14,0,0.267,0.03,0.386,0.08c0.182,0.075,0.333,0.203,0.438,0.362
		c0.055,0.078,0.1,0.166,0.125,0.257c0.029,0.095,0.047,0.192,0.047,0.296v1.888h-5.065V4.174H12.467z"/>
	<path fill="#BCC5D6" d="M26.727,16.613c-2.536,1.551-5.706,2.401-8.654,2.407v1.409c0,0.144-0.055,0.283-0.158,0.384
		c-0.107,0.103-0.244,0.16-0.386,0.16h-5.049c-0.146,0-0.284-0.058-0.387-0.16c-0.104-0.101-0.158-0.24-0.158-0.384v-1.407
		l-0.002-0.002l0,0c-2.212-0.003-4.545-0.486-6.646-1.38c-1.635-0.692-3.124-1.643-4.286-2.84v10.588
		c0,0.495,0.103,0.975,0.285,1.408c0.272,0.646,0.732,1.198,1.308,1.586c0.285,0.192,0.606,0.353,0.945,0.451
		c0.338,0.106,0.7,0.163,1.071,0.163h20.773c0.495,0,0.979-0.098,1.41-0.284c0.646-0.273,1.197-0.73,1.583-1.304
		c0.197-0.287,0.353-0.603,0.458-0.94c0.106-0.346,0.162-0.701,0.162-1.077V14.808C28.332,15.489,27.569,16.095,26.727,16.613z"/>
</g>
</svg>
