<?xml version="1.0" encoding="utf-8"?>
<!-- Generator: Adobe Illustrator 16.0.0, SVG Export Plug-In . SVG Version: 6.00 Build 0)  -->
<!DOCTYPE svg PUBLIC "-//W3C//DTD SVG 1.1//EN" "http://www.w3.org/Graphics/SVG/1.1/DTD/svg11.dtd">
<svg version="1.1" id="Layer_1" xmlns="http://www.w3.org/2000/svg" xmlns:xlink="http://www.w3.org/1999/xlink" x="0px" y="0px"
	 width="30px" height="30px" viewBox="4 4 30 30" enable-background="new 4 4 30 30" xml:space="preserve">
<g>
	<path fill="#2C659D" d="M30.494,29.104c-1.396,0.533-2.76,0.684-3.006,0.356l-0.008,0.003c-3.424-2.944-7.924-4.763-12.279-4.763
		c-4.265,0-7.274,1.792-9.239,4.681H5.954c-0.028,0.079-0.243,0.164-0.48,0.164C5.209,29.545,5,29.491,5,29.366
		c0-0.009,0-0.016,0.002-0.023c0-0.004,0-0.008,0.002-0.012c2.336-5.067,6.65-8.32,12.876-8.32c5.278,0,10.954,2.423,15.037,6.25
		l-0.007,0.003c0.038,0.028,0.065,0.063,0.078,0.102C33.126,27.748,32.046,28.508,30.494,29.104z"/>
	<path fill="#4E99E3" d="M27.643,22.697c-0.037-0.021-0.392-0.194-0.624-0.313c-0.428-0.214-1.034-0.466-1.797-0.75
		c-0.095-0.037-0.19-0.072-0.285-0.105c-0.167-0.062-0.342-0.125-0.521-0.189c-1.087-0.386-2.348-0.711-3.778-0.907
		c-0.241-0.034-0.527-0.065-0.838-0.09c-0.591-0.059-1.181-0.089-1.764-0.089c-0.294,0-0.584,0.01-0.87,0.022
		c-0.292,0.011-0.572,0.028-0.833,0.055c-1.688,0.172-2.646,0.498-2.934,0.599c-0.176,0.061-0.369,0.03-0.393-0.125
		c-0.042-0.287,0.067-0.921,0.119-1.312c0.228-1.712,0.336-3.627-0.215-5.619c-0.551-1.993-1.941-3.862-2.326-4.452
		c-0.425-0.654-0.133-0.879,0.357-0.972c2.146-0.402,6.666,0.792,8.923,1.834c2.683,1.236,7.683,5.193,8.064,11.974
		C27.953,22.689,27.852,22.816,27.643,22.697z"/>
</g>
</svg>
