<?xml version="1.0" encoding="utf-8"?>
<!-- Generator: Adobe Illustrator 16.0.0, SVG Export Plug-In . SVG Version: 6.00 Build 0)  -->
<!DOCTYPE svg PUBLIC "-//W3C//DTD SVG 1.1//EN" "http://www.w3.org/Graphics/SVG/1.1/DTD/svg11.dtd">
<svg version="1.1" id="Layer_1" xmlns="http://www.w3.org/2000/svg" xmlns:xlink="http://www.w3.org/1999/xlink" x="0px" y="0px"
	 width="30px" height="30px" viewBox="0 0 30 30" enable-background="new 0 0 30 30" xml:space="preserve">
<g>
	<path fill="#4E99E3" d="M27.911,15c0,3.564-1.445,6.79-3.782,9.129c-2.339,2.337-5.562,3.782-9.129,3.782
		c-3.566,0-6.792-1.445-9.129-3.782C3.534,21.79,2.089,18.564,2.089,15c0-3.566,1.444-6.792,3.781-9.129
		C8.208,3.534,11.434,2.089,15,2.089c3.564,0,6.79,1.444,9.129,3.781C26.466,8.208,27.911,11.432,27.911,15l0.544-0.001H29
		c0-7.732-6.268-13.999-14-14C7.268,1.001,1,7.268,1,15c0,7.732,6.268,14,14,14c7.732,0,14-6.268,14-14h-0.545H27.911z"/>
	<path fill="#4E99E3" d="M7.637,19.648l0.041,0.031c0.914,0.571,1.901,0.963,2.963,1.166c0.386,0.075,0.776,0.12,1.169,0.141
		L11.85,21c0.277,0,0.553,0,0.83,0l0.042-0.012c0.76-0.035,1.505-0.159,2.232-0.387c1.118-0.351,2.118-0.91,2.987-1.694
		c1.424-1.282,2.315-2.875,2.735-4.738c0.155-0.69,0.214-1.39,0.19-2.096l0.068-0.133c0.535-0.397,0.992-0.873,1.375-1.421
		l0.053-0.076c-0.275,0.092-0.551,0.191-0.829,0.276c-0.279,0.085-0.568,0.138-0.862,0.169c0.523-0.336,0.919-0.78,1.176-1.346
		c0.043-0.097,0.077-0.198,0.118-0.297l-0.017-0.01c-0.106,0.056-0.21,0.115-0.315,0.17c-0.487,0.25-0.999,0.429-1.536,0.542
		l-0.1-0.037c-0.432-0.437-0.947-0.722-1.55-0.846c-1.343-0.276-2.685,0.368-3.308,1.577c-0.329,0.637-0.413,1.311-0.274,2.012
		l0.007,0.038l-0.001,0.032c-2.525-0.174-4.594-1.233-6.235-3.165c-0.39,0.689-0.504,1.42-0.332,2.19
		c0.171,0.771,0.597,1.377,1.237,1.84c-0.234,0-0.462-0.032-0.681-0.104c-0.218-0.07-0.433-0.159-0.643-0.237
		c-0.083,0.958,0.617,2.576,2.376,2.983c-0.434,0.119-0.873,0.131-1.329,0.049c0.207,0.623,0.562,1.121,1.074,1.502
		c0.513,0.385,1.092,0.582,1.75,0.604c-0.644,0.498-1.34,0.852-2.107,1.066C9.215,19.667,8.433,19.727,7.637,19.648z"/>
</g>
</svg>
