114.446569950036 0 0 114.446569950036 68.7938664651644 0 0 -68.7938664651644 40.7193268510639 -28.2633249548154 -7.87414660443588 28.2355424412943 41.4216388184914 22.312750719454 -13.8281117352967 -32.0417952614582 33.4959237493247 18.7677332345044 -27.3386950748088 4.7270338126234 67.60354699632 -12.817158999143 49.0409534145413 44.7319224924116 3.31111019097e-08
110.919508610057 0 0 110.919508610057 63.6082460008114 0 0 -63.6082460008114 52.8701693761944 -25.1947457055816 22.3014390144662 40.781434704809 34.7331477660119 20.5436863673497 9.26067944707933 -26.430821408992 55.10698177129 -25.7739644212572 -39.6310106296982 28.3172243417643 31.8174556973719 30.4250237594891 8.06889216815263 4.643424971664 3.1913086181e-08
263.132521616822 0 0 263.132521616822 804.327391302528 0 0 -804.327391302528 325.351344458152 -173.284931744701 -55.0037094949781 -269.815532749234 223.739967513846 -98.2182240936486 -111.584007006616 -167.217711081495 310.583809013803 310.42720849975 -9.76190094112273 -1.39854731463745 207.784791933548 -38.9240526614006 176.349617442717 -102.763078540339 -2.65865249365e-09
136.816945171219 0 0 136.816945171219 620.556342636622 0 0 -620.556342636622 307.711470640619 152.366757045189 49.9078953293402 -262.640291073439 10.1520627560061 -7.02304171040984 -7.14870523063032 -1.62396947671027 305.841617636617 -239.495606057592 45.5152784029003 -184.687057450152 133.668136774598 94.1518907228131 -88.2744685016102 -34.7880794651016 3.38495626474e-07
409.700546708478 0 0 409.700546708478 342.884755603765 0 0 -342.884755603765 229.014217341509 -54.4086378540746 -6.91031536413125 222.349858135723 182.743119889686 37.2488018844065 11.1783394890901 178.557047890748 305.326245995731 29.8781950104669 9.02212266152898 -303.726869505223 35.5017190853168 -12.7183590407989 -13.2901467864879 -30.3642454165368 0.0252170773076
230.985073711812 0 0 230.985073711812 159.903868833793 0 0 -159.903868833793 16.6459647276526 9.64678084115688 4.64813930117473 12.7445110598178 132.140634408186 -23.5336657603183 -84.5268132609434 -98.8055245299018 152.784641463858 56.5490425175537 112.933222757758 85.9734822787472 89.3177019459097 -42.6621575983922 -33.0545487979893 71.168736069356 3.2862705447e-07
953.760945201392 0 0 953.760945201391 678.49323182976 0 0 -678.49323182976 30.6426859328403 -12.4973969155551 -19.8442053444556 19.7230014389504 367.686285226909 54.2786961917007 -44.0750365020955 360.977033398293 601.572811858109 87.8321092276687 477.898312619929 354.666845575556 632.352394013292 -129.613408503814 -413.979070773378 -460.099167041167 2.1282072926e-07
888.296909002881 0 0 888.296909002881 756.116064448779 0 0 -756.116064448779 481.165849653672 240.219757746306 104.05535990645 -403.717134806025 96.1582788171965 19.982550552681 -1.5189893156475 -94.0468230720963 482.178430757765 -183.221021441549 -421.523473976578 145.753412572927 584.910414223026 -76.9812868574377 318.987103385776 484.191389859296 1.01971003976e-09
497.223712671407 0 0 497.223712671407 16.3389303619295 0 0 -16.3389303619295 127.18621767127 -41.2260193083263 34.52195846782 115.260503560671 303.848032221909 11.4254197747307 8.11095821456372 303.524791120823 19.7243365996905 11.8100725291989 -11.9409187167538 10.3434085945027 62.8040565404664 17.9905270043967 -30.6919979656299 51.756079033481 1.47407832577e-05
272.379358548361 0 0 272.379358548361 28.1183263790495 0 0 -28.1183263790495 100.88294564411 38.784378147583 38.1166768434718 84.97211118919 70.5583580466351 -46.8987698382284 14.7617516524774 50.6070940288869 96.9580375632871 15.6326819745558 -26.5487984621571 91.9328102617447 32.0983436733785 -7.51829028391039 -26.3296300337921 16.7490166894898 3.61393205287e-06
192.599572207013 0 0 192.599572207013 37.9396024996155 0 0 -37.9396024996154 32.2360893061476 9.19696714838936 23.4294509458885 20.1405580210572 106.580273226675 -45.2520119061295 -68.4475928392652 68.0186525449488 44.7889674540327 27.4890570165871 13.7213067455505 32.5903220470699 46.9338447197726 8.56598774115301 31.2968351478262 33.9104370943215 9.90847536512e-06
796.17142792171 0 0 796.17142792171 35.0474226557307 0 0 -35.0474226557307 131.25545627191 -0.18481116610365 6.44438950344671 131.097027006367 109.555463294161 -69.4960151388605 37.3480000654487 76.0120405496963 499.997931489336 5.4753163886444 -68.3198906731743 495.27804811284 90.4099995220337 64.2055099163197 24.5275011042789 58.736889597076 1.44093091681e-06
137.575710588119 0 0 137.575710588119 886.68676184758 0 0 -886.68676184758 166.500817987737 139.655290169522 -81.7318233853735 39.2279411179612 38.3890535221195 20.8152521187304 29.8492143702518 12.2257560517379 397.20296634674 -85.9285119715083 45.89818479673 -385.071219305439 422.169634579102 -74.5420303167445 5.98442421839173 -415.493529123721 3.01816258339e-07
532.680874066867 0 0 532.680874066867 44.6568065906407 0 0 -44.6568065906407 117.774060466212 37.2035667955252 -52.0765308933783 98.8668744651149 227.214311104107 -11.2466791081954 69.0428640506769 216.178024561312 178.192884823886 -78.3340357082088 -15.1202137940715 159.335690246553 54.1564242633027 52.3771480208791 -1.8461193632271 13.6434782032472 2.08831704838e-09
397.003612871315 0 0 397.003612871315 333.004801399176 0 0 -333.004801399176 333.255731349791 140.690170675592 -1.51590188349576 302.098262812345 30.4142151247355 6.60846879398835 -24.4309306810993 16.866601551821 177.626287276648 -163.22021649566 20.5068708255434 -67.0054259574598 188.712180519316 15.9215770260797 5.43996173905166 -187.960626934566 1.7303431198e-05
404.065962692499 0 0 404.065962692499 499.434588506603 0 0 -499.434588506603 4.96291152140491 -2.74653396783866 0.69286348972296 4.07516651407178 470.568470889302 45.9101727191763 -260.247974890543 -389.355792818551 234.487418536893 -0.208226155928385 207.890102423865 108.471246918984 193.481750251502 -42.9554125954092 51.6650089769557 181.440753571391 9.19430529397e-08
837.081198866915 0 0 837.081198866915 902.440561559857 0 0 -902.440561559857 194.435868734666 162.540339438186 106.701647388391 0.838779188523886 672.804090373914 626.724895521982 231.730523123027 78.6270564752283 854.840930840376 -773.763661461272 -336.537218818655 -137.060255332799 17.4408704778151 -15.5015734988964 -1.89495169276319 -7.76494302389442 1.72341836728e-06
5.28823345542006 0 0 5.28823345541997 804.252461542202 0 0 -804.252461542202 225.411788017353 -29.4165914915317 -1.72382662727283 -223.477441241749 219.912225429744 45.2131756590472 -2.43263402417255 -215.20045987867 308.540799491499 -14.2034361761773 -14.5469522001696 -307.870221900931 55.6758820590269 -1.59314799133815 18.703412851615 -52.4161050654321 1.17481085947e-07
70.9168927698984 0 0 70.9168927698984 342.862236497102 0 0 -342.862236497102 233.329516752397 -9.35923730407674 48.2641226712559 -228.091303051579 39.7606271161709 15.8764836866192 33.6577689719912 -13.9999757945422 65.3562389223993 8.91515490626161 -15.9336265397283 -62.7541036456705 75.3327464760333 -15.4324012888041 -65.9882651035188 32.9000387645876 1.68679512702e-06
739.597550763891 0 0 739.597550763891 94.9081192003569 0 0 -94.908119200357 373.012639723685 -33.500930831466 32.1841972369526 370.108490142106 341.40346664077 31.3418901438531 -34.1211383390068 338.245119513935 42.2886832862048 30.9244959453978 28.6295966829199 3.51489379318267 77.8008803135877 -28.7654552577849 -26.6926555808657 -67.179071885691 4.5795611689e-05
179.486720941693 0 0 179.486720941693 58.0520387821796 0 0 -58.0520387821796 92.253809226803 -54.2220588370432 -35.4192983263318 65.6978459190093 49.0354163249185 45.3717692519492 6.87660660777544 -17.279666972134 49.0606344210963 -11.6886814149925 36.0169727897353 31.1945227186238 47.1888997510545 20.5389710000866 -7.474281071179 41.821980494014 6.67421923453e-09
785.355826825339 0 0 785.355826825339 995.142502588751 0 0 -995.142502588751 285.830779965578 52.5836156903359 114.018531881371 -256.776113617055 689.468820600661 231.507363194403 341.210879474007 -552.581877277763 709.257444300052 -254.189532122389 -407.47664814044 521.916262703774 95.9412845477986 -29.90144676235 -47.7527632149378 77.6550524276309 2.73582685818e-06
309.072084111143 0 0 309.072084111143 37.5693525529564 0 0 -37.5693525529564 118.144973012731 -64.3913193295716 4.27689602114486 98.9631285055221 127.820049997234 59.1238840038504 13.5205235997534 112.514563338188 76.1630862486202 27.584988010832 -14.2889382412441 69.5392722660723 24.513327405514 -22.3175526851109 -3.50848137965412 -9.5142325515958 3.39932275278e-08
557.401338527206 0 0 557.401338527206 590.548060810182 0 0 -590.548060810183 33.7478936890935 -13.4113656720687 8.47820186189473 29.7854946651785 525.838058878938 31.9476741127311 -128.40647555893 508.917269621389 93.3709390819988 20.9726882438073 22.6502082596493 -88.1206370759819 494.992507687358 -39.5089966844697 97.2780654373856 -483.728849493563 0.000232291990786
357.191888187143 0 0 357.191888187143 110.578211342864 0 0 -110.578211342864 29.3103496660803 18.3971021906732 9.1468395241412 20.9040320334004 307.016156264029 -91.6841984875243 41.2969578387421 290.081866424125 90.2088752220998 46.0743496445098 -67.3679354856466 -38.4233879567329 41.2347183777981 27.2127466523413 16.9241381227632 -25.9488336565142 3.9075733898e-06
504.506945200366 0 0 504.506945200366 60.2524684641886 0 0 -60.2524684641886 152.952932782276 -34.643070720607 -65.4197689844498 133.845848362091 203.085956356824 37.3489747140746 -18.6527408483015 198.748672991845 47.1729803379067 -42.5635008978388 -19.5169975072182 -5.72060080616088 161.547544187548 39.8575969043712 103.58950733997 117.380556188403 6.73305413843e-07
778.191822815546 0 0 778.191822815546 97.7022019175619 0 0 -97.7022019175618 298.099900324953 -17.7175591753096 158.641052155463 251.75912146658 138.080107475127 -48.580158392099 19.770741626065 127.730975360312 182.706651767932 -35.389631021814 22.9055127571491 177.776916672891 257.007365165096 101.687348589223 -201.317306538677 123.2226073982 1.13739328881e-07
125.757111615926 0 0 125.757111615926 478.633877804449 0 0 -478.633877804449 141.642484823311 25.1979220035793 -11.5211773190301 -138.90615791536 276.447466221822 -69.1900066725723 -85.1852596346541 -253.730991599551 81.5874064818644 -42.0172622084218 68.716747878146 -13.0024280039159 104.713631893379 86.0093468774148 27.9896890755382 52.7628113303036 2.15478925119e-08
321.823755179826 0 0 321.823755179826 11.8079465063588 0 0 -11.8079465063589 225.427195539242 28.5893496988979 -10.6240316807088 223.354425797496 33.4341377336627 -25.85852491568 9.08780871225001 19.1465398437482 42.0750875973391 6.62613028443359 14.4304418839093 38.9636977302282 32.6952808159405 -9.35695506765151 -12.8942189154505 28.5511453019944 7.96872417418e-05
628.158576780283 0 0 628.158576780283 406.543207704421 0 0 -406.543207704422 93.7092624943721 -26.698901506682 -26.6475933506856 85.7817014531196 466.08488967069 2.89095526156232 11.9087257152745 465.923758794133 396.538009965369 -13.323929985502 40.0858606723023 -394.281612570505 78.369622354273 37.1318762306217 -25.3469930368912 64.1915213991143 0.027355214366
701.208369891968 0 0 701.208369891968 468.200122878647 0 0 -468.200122878647 37.5646280865531 -31.7379608662638 -10.4310755467968 -17.1754413704447 200.130250230306 -174.015700391683 73.5223297167377 66.0690555968534 329.256973876484 -296.865958852722 88.9992174600834 -111.175071901243 602.456640577273 502.619620110669 -152.090471630024 295.289704688155 2.51507311191e-08
381.141334249749 0 0 381.141334249749 521.404872746711 0 0 -521.404872746711 83.3588837805523 51.8448219945397 -28.1698683918456 58.8835838946665 340.901299547134 311.974714598958 -128.345223142944 49.1220640874436 157.981565142812 -144.561721982084 16.2187029418042 -61.620103354609 320.304458525962 -219.257814611414 140.296388592986 -186.649083124462 3.91013186163e-09
33.7138638262238 0 0 33.7138638262238 342.639646664951 0 0 -342.639646664951 176.464710394087 -89.8860340787843 -17.8508331260614 -150.803324395592 25.1862004053261 16.1239167782826 14.9695141679503 -12.258778249067 50.0561344258878 41.5393511972606 10.8877712336074 -25.7207179786613 124.646465265874 32.2227661032411 -8.00645227549628 -120.142962215407 1.54681391028e-06
509.867421527422 0 0 509.867421527422 527.014319436989 0 0 -527.014319436989 132.242395475225 15.6124984752588 -116.335172634352 60.9132880455594 150.506489484055 -59.4025540057671 -137.577135198138 14.0025649464319 435.647787181319 -239.365655568367 277.12655593446 -235.995655481642 318.485068823813 283.155711098875 -23.2142481019693 143.932904580084 6.55408193797e-08
847.308017627527 0 0 847.308017627526 897.903993940595 0 0 -897.903993940595 314.407619126612 -196.985021288895 244.010515339796 -22.5370973349689 550.020565861885 -303.422021363729 432.484320131507 -153.019647963799 514.706071818565 321.835922091113 -361.036108284544 176.059388086555 366.077754761059 178.571120561511 -315.458727186759 -51.0986191008553 4.51164488029e-08
108.974011089636 0 0 108.974011089636 199.230033637457 0 0 -199.230033637457 95.6154887038921 6.69530453927706 51.5672923140045 80.2390736525071 31.6498208172884 25.2594081903436 -18.7826455474474 -3.29934567437497 18.2541469943102 6.34308564298841 -13.7178931429862 -10.2371165243544 162.684588211603 -38.2977983726091 -19.0667536235709 -156.958634001599 0.000123924195234
289.199044833362 0 0 289.199044833362 90.78033312928 0 0 -90.7803331292801 85.903805370898 -45.6447003851311 -64.0827677454737 34.4880266474091 31.4039586997502 -6.31171201118006 16.9905363726795 -25.6455178788067 52.3450774192522 -50.7699981637091 -1.65851010862553 12.6358126253941 210.326536472741 102.72641056002 48.7507414814198 176.940390310085 5.72245256295e-07
69.4780681811433 0 0 69.4780681811433 579.437584363472 0 0 -579.437584363473 141.645521309228 -113.897437644819 -47.1103994617149 -69.7956851636634 15.0799955072252 9.18563484204093 0.999786556350408 11.9176677201689 383.070002672142 30.3369055495066 8.2564332613926 -381.777592871446 109.12013305602 74.3748972532718 37.8541796439719 -70.3039058673884 4.39920422563e-05
30.8409520075348 0 0 30.8409520075348 570.022271658914 0 0 -570.022271658914 107.92944553376 -6.46680563887445 65.7677274795996 -85.3320084155008 19.2509527913235 -8.48477083519956 -17.2524478146098 0.980250810801628 298.301739090944 36.8828456660584 -82.7196729557386 -284.220053737155 175.381086250421 -21.9312691919844 34.2043932907489 -170.609508309525 3.56721672447e-08
86.0607409438682 0 0 86.0607409438682 336.047352172161 0 0 -336.047352172161 62.4336680273775 58.6352443401391 16.5140806058482 -13.6805031438362 160.847844921379 45.4509432697095 92.0279847485559 -123.843009471125 89.1487128384257 -19.5919205764945 -65.1075121280403 -57.6598778473342 109.677867328847 -84.4942670333541 -43.4345532263638 -54.8032207659976 1.28646295254e-06
452.066821883767 0 0 452.066821883767 149.5529676213 0 0 -149.5529676213 134.181576267303 -33.2081384713587 -82.4339944657271 100.531345884106 140.802390989795 -86.4633572083552 -6.75241702628341 110.922522658866 221.281880874253 209.128669560303 54.5082612952359 47.5365104078408 105.353941373716 -89.4571738805895 34.6781501967746 43.5234753116544 3.30268276833e-07
60.9598341078527 0 0 60.9598341078527 417.311364360244 0 0 -417.311364360244 19.5384158305308 10.1485238486722 15.3017854413712 -6.67926037566359 193.220910568441 40.5317571060975 -116.117742413433 -149.024047870125 50.4194816454883 -48.4619250016635 -4.55412592634067 -13.1463261628449 215.092390423636 -2.21835595310617 105.370082898402 -187.501895843757 2.0245121705e-06
918.944042317838 0 0 918.944042317838 805.959189050034 0 0 -805.959189050034 179.44351527182 26.4680792693902 -17.4416797919782 -176.621640120715 280.590845128142 -6.05266725964332 74.7675463357208 -270.378256529079 911.75150710521 -26.6615368620592 -20.5781171356198 911.129252222717 353.117363862699 6.24612485231231 -36.7477494081227 -351.144502305118 0.000335776428786
13.3864905650107 0 0 13.3864905650108 812.158356982332 0 0 -812.158356982332 41.2018209914233 -7.32638272784658 -28.0783102333958 -29.2493190274848 244.057461621844 -62.8454912428145 25.7935090073768 -234.412422232342 225.79572436188 19.5004233868028 -6.57872466657217 -224.855871636929 314.489840572195 50.6714505838582 8.86352589259112 -310.254253520566 -3.86497264687e-05
625.363316394323 0 0 625.363316394323 776.933551538838 0 0 -776.933551538838 321.789599970616 64.912083179828 -70.0788668446805 307.284754793123 305.596765933104 -17.8312469233841 -29.9013473903753 303.607212375085 208.768622072179 -37.1321224988992 -0.728968904523541 -205.438583632625 566.141879957262 -9.94871375754469 100.709183139579 -557.023618680099 0.000179612838863
529.252376529917 0 0 529.252376529917 192.407014744595 0 0 -192.407014744595 19.8135930248257 -6.37231790950909 -18.3629046911435 -3.84392563892077 404.05398201936 -150.471935981677 -192.492641414673 321.814231923993 240.561642765105 180.046850583593 158.552515361281 17.7238663216007 57.2301734652217 -23.2025966924068 52.3030307445355 1.1511891786498 1.93112218043e-08
667.317982925439 0 0 667.317982925439 46.2154088557869 0 0 -46.2154088557869 298.12005568603 -78.7090974068871 5.9581715616081 287.480339813485 284.921161801737 -18.3325697752902 -26.8207228042528 283.06295087161 99.0055219565217 72.7769080918097 40.7329054522213 53.3520893677088 31.4866523369371 24.2647590903677 -19.8703542095766 -2.79280598315182 7.03190361163e-09
694.3325220723 0 0 694.332522072301 21.9266811834777 0 0 -21.9266811834779 92.3534805581908 18.7296678021838 49.3620992668933 75.7743232975217 310.062357685649 -16.5062933754308 -44.5308573552758 306.403672751799 61.2257089978065 -25.1526967355066 -38.0377460833857 40.8541205034646 252.617656014132 22.9293223087536 33.2065041717682 249.373724336037 3.35217375668e-09
828.510306316648 0 0 828.510306316648 777.845563996086 0 0 -777.845563996086 90.734410670182 59.5815697717189 -61.3266956567323 -30.3612618813771 695.778665152558 438.385675795803 -323.495744711547 -432.754495403635 28.916214726276 1.50500347397619 19.9841187202368 20.845081856757 790.926579763718 -499.472249041498 364.838321648042 492.935417748816 4.55888231693e-06
238.955092398639 0 0 238.955092398639 215.415867251557 0 0 -215.415867251557 202.834382235112 -138.152317761842 -148.348216085799 -6.96638341550003 27.1736013561473 -16.232276953243 8.80390025571799 19.935123171513 117.007049415259 70.2696505202262 87.9967014716423 -31.7711560812746 107.355926643679 84.1149441948585 51.5476143584383 42.3416414723432 4.46010237031e-08
745.528154050329 0 0 745.528154050329 4.78378610340124 0 0 -4.78378610340119 326.446577368839 27.7437912870831 -13.2629378149831 324.994991348119 157.762158725947 -32.5516461899772 -1.73077675159819 154.357680301401 153.705327653534 -15.6258133194005 23.0538554665111 151.161110922475 112.39787640541 20.4336682222946 -8.06014089992979 110.230585374933 3.66473153279e-08
472.37674281755 0 0 472.37674281755 18.4743416202017 0 0 -18.4743416202017 295.636602123609 43.6841493572817 11.5080538975789 292.164782794939 22.2901266143261 -18.5125584083783 -5.09770192071093 11.3202632825676 22.6246569653253 11.6661480233415 18.1576239278419 6.78798839061964 150.299698734491 -36.8377389722449 -24.56797590471 143.629366729222 2.54432853457e-05
174.213478942093 0 0 174.213478942093 59.8512759572002 0 0 -59.8512759572002 82.2058260250337 31.3735591841918 14.8194649142158 74.5243656546666 91.4658388497939 -57.1376033601176 33.4458881423473 63.1083712761464 37.1958230258084 19.2004600960261 -26.8972907377815 -17.0706570944244 23.1972669986567 6.56358407989959 -21.3680623187817 -6.1998768514962 9.53947125025e-05
598.91063430205 0 0 598.91063430205 13.3659377888221 0 0 -13.3659377888219 37.174880645181 -14.2281588201795 -26.4667186305612 21.8870750101952 414.223773289185 -3.64140868438085 -1.0849653153953 414.206346343206 47.7933211578585 1.69324294397037 29.5221658186429 37.5469865769205 113.084596998647 16.17632456059 -1.97048187268646 111.904288582906 7.81298926792e-08
995.637726331039 0 0 995.637726331039 731.886207696893 0 0 -731.886207696893 140.395011323154 77.319291452579 -49.6564716032179 106.144812410303 373.474204507779 145.00216931907 -21.5439116453643 343.50140057429 706.204191531028 -135.199155062694 374.746867645437 -583.104050574389 507.450526665972 -87.1223057089549 -303.546484396855 397.209356223942 3.8925313136e-07
136.35728714987 0 0 136.35728714987 340.514906491352 0 0 -340.514906491352 57.9940859167778 -34.0852583330763 37.1299916442357 28.6857610355564 91.6833748388257 -64.2713206385263 -57.210182027679 31.6549149039479 162.702910180204 124.259469609886 -8.8621541663175 -104.657935279221 164.491822705415 -25.9028906382834 28.9423445497608 -159.840360001764 4.96324170494e-07
438.426803760843 0 0 438.426803760844 445.483735680777 0 0 -445.483735680777 327.818560633764 -100.433922430343 -52.336891548175 307.634337654826 114.201031916618 1.82292277711186 -59.2901964350315 97.5870137367902 29.1378215839877 -0.249225000093029 18.4996407317392 -22.5103048925643 412.75312530725 98.860224653324 93.1274472514673 -389.767978418985 1.98720316434e-05
85.069606946023 0 0 85.069606946023 107.700534619608 0 0 -107.700534619608 68.7638358406796 -3.22489082146242 -56.8829260269667 -38.5019210601785 78.3577914545821 35.9325594933345 69.514028527418 4.07363324159851 25.5592689310864 -16.9384552361159 -19.1050344573717 1.16731353471841 20.0892453392832 -15.7692134357562 6.47393195692035 10.6300466102762 8.13244809024e-09
123.062390904781 0 0 123.062390904781 205.357578439446 0 0 -205.357578439446 40.8668568800843 -34.0931870850035 -19.0637056019876 -12.0137302435584 39.1937677988003 31.3053255705566 23.4652224997714 -2.3476282124638 103.583181495814 52.3906165629898 -75.2690452967248 48.1587957185822 144.776163169528 -49.6027550485428 70.867528398941 -116.092624797226 2.36214557139e-08
493.809541133651 0 0 493.809541133651 20.365873116405 0 0 -20.365873116405 27.0826674473515 19.9839553452083 -15.3873069814147 9.86626518416472 284.619827100921 -17.1286274635038 22.9002172972924 283.179512231926 131.86341143986 25.59450451056 27.8666688762586 126.318365177664 70.6095082619234 -28.4498323922645 -35.3795791921363 54.0795254234913 3.6425418153e-08
938.859113428187 0 0 938.859113428187 747.61482517189 0 0 -747.61482517189 174.799415430262 -161.914980122096 64.2564345820644 14.4736125975234 420.045975845616 -405.383463070073 74.0371362635179 -81.3718142068113 809.354697530529 569.47281125047 -269.633166055149 507.989861536918 282.27384979367 -2.17436805830039 131.339595209566 -249.847371671333 4.19777125204e-08
54.6141438274744 0 0 54.6141438274743 235.555218718459 0 0 -235.555218718459 30.9528153314396 -3.74168278866321 30.2177656589232 5.56446092929221 191.346773159073 34.6566739295308 -13.313375328675 -187.710565999599 18.5567541689176 16.0377956149602 -3.74258891148454 8.55191588698343 49.313019886503 -46.9527867558278 -13.1618014187637 -7.34688570766127 4.00667856685e-08
15.3007654612219 0 0 15.300765461222 776.239179097828 0 0 -776.239179097828 309.019770559954 47.9263760905062 54.3784229789374 -300.398515618972 260.590257708991 -46.1187132561634 -56.8835047614163 -250.089211255688 31.984763672977 21.9735156250189 7.313107841265 -22.0614635052906 189.945152617128 -23.7811784593616 -4.80802605878606 -188.389223256656 1.99632476254e-08
220.232466098836 0 0 220.232466098836 181.316445057695 0 0 -181.316445057695 104.337285715737 -12.0662294518142 94.1535243286576 43.3103815942133 116.39830072305 -17.2675285466311 30.5986542282564 110.969001205402 15.4758495648608 11.1156170829104 -10.428459386265 2.68182986957289 165.337475152883 18.218140915535 -114.323719170649 -118.045191628047 1.8448003204e-05
60.4420388975733 0 0 60.4420388975735 378.67407966923 0 0 -378.67407966923 139.699056608565 -36.0629717629874 -79.2175233904325 -109.269723495721 74.306833557933 -42.1699442502647 40.6267342831591 -45.745707742055 163.901577692806 61.2129279888859 84.4542664057606 -126.428562845123 61.208650707499 17.0199880243663 -45.8634772984873 -36.7880466887572 7.52311714496e-10
87.8101752243318 0 0 87.8101752243317 594.825097720531 0 0 -594.825097720531 40.3458586655771 -1.3032643659884 -32.30106475984 -24.1398224690177 184.245590041169 149.378390625656 -34.7892961056125 -102.089366440307 76.8116752001573 8.87227288278301 68.6169226051232 -33.362166493656 381.23214903796 -156.947399142451 -1.52656173967068 -347.423567093219 5.3590015023e-07
483.689414957495 0 0 483.689414957496 179.838512265103 0 0 -179.838512265103 189.661230501937 45.6051168029257 44.591498802314 178.614540033738 286.761687676325 -30.2816651277746 17.7887440146795 284.602963551759 97.7910972071496 -44.8766016149951 -30.2098063478212 -81.4650656471493 89.3139118371866 29.553149939844 -32.1704364691723 -77.9015352459552 5.82379687687e-05
216.060563541601 0 0 216.060563541601 130.151569726701 0 0 -130.151569726702 25.5219078800535 -6.38153685824933 -23.0885865677113 -8.80686888003001 113.92077276222 23.2005845134875 2.7974209260767 111.498205282131 88.1664907717651 65.2554318666038 -46.2422142285211 37.1041282090598 118.602961854264 -82.074479521842 66.5333798701557 -53.8864707962611 1.0571014502e-06
732.681954401376 0 0 732.681954401376 92.5641063535465 0 0 -92.5641063535467 60.6078694982572 59.3336050677001 9.69440861718313 -7.6717401123253 36.5135637578968 -33.1142136472592 -8.31549211605157 -12.9437932497993 660.138298152463 -92.5603441844648 11.6170690188168 653.513732892811 67.9863293463049 66.3409527640239 -12.9959855199484 7.21964851714282 1.54603772633e-06
188.775703810117 0 0 188.775703810117 719.02543577534 0 0 -719.02543577534 17.3379470293523 -3.68587142855213 1.44339785696041 -16.8800284843164 294.064457064151 -26.9739045240887 -282.82024249158 -75.888232422186 552.006385803608 7.01827619968753 315.70260579532 -452.762253794628 44.3923496883459 23.6414997529533 -34.3257611607008 15.2807827359073 3.86641869187e-07
296.396731398728 0 0 296.396731398728 430.630191455072 0 0 -430.630191455072 136.93601286386 129.160949223599 -39.2422487689514 -22.9992766465836 57.8205576867181 21.2058897149047 7.79684160156735 -53.2234571748441 343.973348369492 -274.39834858179 85.7494406080516 -188.86567745229 188.29700393373 124.031509643287 -54.3040334406675 130.854951217374 2.04665309572e-08
716.758635462765 0 0 716.758635462764 228.929063393399 0 0 -228.929063393398 189.02092162833 17.8991519627763 8.39794286055698 187.984051791496 502.34709450267 116.133823676971 -109.313978173027 476.357001134052 208.464400463791 -106.247808343341 65.732601330724 -166.877304044799 45.8552822613725 -27.7851672964059 35.1834339817463 -9.63417681138267 1.29031653644e-05
375.89883598518 0 0 375.89883598518 17.6452007677319 0 0 -17.6452007677318 229.517257638782 -26.4638529700193 4.53157436285791 227.94144176477 26.1732157396033 24.4980653692696 -3.06300759504635 8.68907358626338 61.3249260698928 19.1941333510271 25.7929666499635 52.2212090416784 76.5286373046342 -17.2283457502774 -27.261533417775 69.4019108247366 7.19206130523e-07
668.102154571803 0 0 668.102154571803 24.6813388501125 0 0 -24.6813388501126 33.1606896574673 -5.01767577610127 -31.3256017497747 9.65199167940445 231.829983555002 -49.2605920886623 -35.0712129047506 223.804703631485 379.398705322904 25.8045442405001 47.9087136485317 375.476042183491 48.3941148865418 28.4737236242634 18.4881010059936 34.4880782273099 2.70459545602e-06
197.194382885008 0 0 197.194382885008 123.78456098814 0 0 -123.78456098814 61.0752912649248 -14.8551807538701 -59.1650382183376 -3.00217595885071 89.6848129779742 35.5556000025177 -27.3085066941406 77.6750310556182 77.6588744844118 -8.59372849362259 30.0388816676367 71.0965133105783 92.5599651458372 -12.106690755025 56.4346632448415 -72.3595465104787 3.61608630205e-07
608.485176694162 0 0 608.485176694162 257.634031611238 0 0 -257.634031611238 156.891408733588 154.04070473973 -21.6119442872571 20.476798622379 177.639072217678 139.322902050312 -0.152658986792137 -110.203201577224 253.926003106208 -155.049655579646 22.6002331562902 199.818039274257 277.662724247926 -138.313951210396 -0.835629882240994 240.759508763513 1.71575050469e-09
111.134802661532 0 0 111.134802661532 40.1459578868704 0 0 -40.1459578868704 34.5822216267014 -32.255139999328 11.9677108091404 3.50854588837432 70.3049866073308 52.3737881666877 -20.8190748205096 42.0278904841288 17.343025655729 -12.3245687035414 -10.8519191347363 5.57865541686419 29.0505266586408 -7.79407946381832 19.7032831461055 19.873752985294 2.2225168713e-05
274.577185949212 0 0 274.577185949212 409.326903781117 0 0 -409.326903781117 256.031455745792 250.914366186024 39.6197925205243 32.005612217322 59.5755490069397 50.592560914562 -22.4077114260879 -22.0801559829132 56.3145114969815 -44.8798086214687 -9.77261860436698 32.5825552843478 311.982573480617 -256.627118479117 -7.43946249006948 -177.257729350661 3.12078407486e-06
459.251489918011 0 0 459.251489918011 175.508428224908 0 0 -175.508428224908 206.582977066359 15.0308865669204 -15.4236422629384 205.457319465521 204.071611185916 86.6760032987387 -63.3470517982959 173.550119483211 103.840831718069 -90.3545369800243 47.0296009744809 20.1790141287157 120.264498172574 -11.3523528856349 31.7410930867534 -115.443391384345 3.12245388217e-06
68.6534198667912 0 0 68.6534198667912 215.542096818713 0 0 -215.542096818713 81.8016075847002 20.0408117210938 68.5750539668655 -39.8413207918917 25.7892133714184 -10.9479139373417 -14.2755087586089 18.4780019596271 60.2444507789172 25.0013136994148 25.8282712625052 -48.3448918350975 116.360244950469 -34.0942114831669 -80.1278164707618 -77.1804662845597 2.45065794439e-06
16.987124689361 0 0 16.987124689361 345.754981416111 0 0 -345.754981416111 84.1622380334228 -28.4199194179344 -26.8019585307058 -74.5469349469913 97.6741749083817 27.1990780223367 23.2911402939798 -90.8734140580959 57.4242021931611 -17.972116942523 31.3954835209282 -44.5966997053869 123.481490970506 19.1929583381207 -27.8846652842022 -118.750808016276 2.69204071328e-08
34.9572161843495 0 0 34.9572161843495 391.144996950489 0 0 -391.144996950489 205.800269620806 -14.8653978837372 -12.9848191467281 -204.851569175053 14.8164439393731 -13.2501387158663 1.52446019917444 6.45266271550117 169.825067608875 26.6733723313064 -23.1864066298927 -166.106819078651 35.6604319657847 1.44216426829714 34.6467655774464 8.31794477206287 9.0016977116e-06
603.00926889369 0 0 603.00926889369 498.208985143591 0 0 -498.208985143591 260.22730896783 -9.75057656913843 156.036867046901 -208.028062317072 101.535644049103 -54.4014838343168 63.3779873286382 -57.7338400876098 559.840981448649 -60.9665539726842 -256.036079408899 494.115907300101 179.6143195717 125.118614376139 36.6212250333605 -123.55372114532 7.3553440899e-08
689.58259563833 0 0 689.58259563833 677.455763299313 0 0 -677.455763299312 51.6526109250176 46.5083483199719 1.27266849918891 22.4353753436528 125.693221922169 21.4419796568213 111.83120088154 53.2241491708864 587.607037850528 -127.335545090244 323.818192158557 -473.507622235594 602.085488239928 59.3852171134507 -436.922061539286 409.974930060073 2.11678400404e-06
165.964310054358 0 0 165.964310054358 36.1800028646033 0 0 -36.1800028646033 58.3598361579128 -42.8224080377462 -2.73003267076664 39.5557678201769 81.2509590040368 34.0653505674162 27.6763629713527 68.376086188613 39.6545300385649 19.9034361997588 -8.51740009273359 33.2233182521234 22.8789877184469 -11.1463787294289 -16.4289302078525 -11.3708650711585 8.46355526657e-07
270.702362485785 0 0 270.702362485785 65.0151198273362 0 0 -65.0151198273361 49.0854559559221 7.728859039849 39.3517672297823 28.3034474973622 200.161666909883 27.8983924583589 -1.05709759941758 198.205083544918 24.3755420192935 -12.0223653094554 18.2553211943936 -10.7876331597749 62.0948174280224 -23.6048861887525 -56.5499908247583 -10.0336552240559 1.5336746163e-05
357.005633041619 0 0 357.005633041619 18.5216784303921 0 0 -18.5216784303921 180.488830551571 6.50633533899768 -31.935905280687 177.521783193593 35.5746721035394 12.4675287772554 26.9780213215973 19.5526056328586 68.4943683079948 -19.4522698509532 35.0258308304448 55.5542875230526 90.9694405089062 0.478405734700136 -30.067946871355 85.8552782617226 4.78427377035e-07
348.098418332508 0 0 348.098418332508 226.868569607329 0 0 -226.868569607329 286.02975519102 -112.15893146717 -86.3268529965514 248.557979953348 43.3670437057073 18.3689485954723 -16.9752818728044 35.4277012041208 90.8555079911634 12.9683659548177 83.9401480027814 -32.2582759933855 154.714681051946 80.8216169168805 19.3619868665744 -130.497556438905 3.04284588301e-06
44.5953238560383 0 0 44.5953238560386 916.961647689149 0 0 -916.961647689149 82.9480414351056 -3.36479933240476 -74.94301708295 -35.3920880123977 78.7240598811173 -63.2837391253733 -7.32581310406395 -46.2490911136832 151.691387956569 34.8676379202304 11.8159520126471 -147.156067778698 648.193482272395 31.7809005375476 70.4528781743668 -643.569076928331 2.54300644344e-05
137.252844901946 0 0 137.252844901946 49.1328024051047 0 0 -49.1328024051047 63.754107109736 -29.7473082359221 8.23980165358367 55.7834159476303 31.8572101702063 31.4548964538278 -3.16458811123646 -3.93150238380751 48.508334345244 5.6499071602751 36.2924615790615 31.6858688150189 42.2659956818644 -7.35749537818086 -41.3676751214088 4.58226011799961 3.86670687537e-08
5.83087380328937 0 0 5.83087380328945 484.775470987597 0 0 -484.775470987597 159.959268971133 24.2751808873207 28.7091618385134 -155.478189303828 142.708510950718 -18.0586138043066 -23.0853503544896 -139.666288574762 66.2563957843551 7.56173220233477 13.5043420593636 -64.4233104860111 121.68216908468 -13.7782992853488 -19.1281535433874 -119.376808819706 1.28394186723e-07
152.026429772092 0 0 152.026429772092 46.9401984279914 0 0 -46.9401984279914 83.2079697338607 -20.7441688446722 -34.4725038672063 72.8346906583687 42.1453768122397 20.7140523752389 36.4947192127422 -3.91104722863786 49.4681500364548 -15.2932393397488 14.5500587189142 44.7382441519837 24.1451316175283 15.3233558091822 -16.57227406445 -8.57565623761391 2.87052930209e-07
965.153259975268 0 0 965.153259975268 327.722036657427 0 0 -327.722036657427 142.311238364944 58.6992658911977 112.003504278965 -65.2847591557942 184.530995159684 44.3748510681237 100.471922672692 -148.283355511527 920.652140627523 -94.6799547855157 -243.831620229489 882.712983466379 45.3809224805445 -8.39416217380574 31.3561932778315 -31.7136454812169 8.67341833497e-09
232.448954435143 0 0 232.448954435142 214.54319058916 0 0 -214.54319058916 31.5564184124259 -28.582340952472 11.4314590971287 -6.94111457961958 104.223119103498 17.8195060754974 -72.7156751031756 -72.5076158287989 169.02009521349 140.308151947408 83.7527274436107 43.2075887875806 142.192512294888 -129.545317070434 -22.4685114375639 54.1469054668203 2.94481543133e-07
17.8184350796269 0 0 17.818435079627 698.476998652032 0 0 -698.476998652032 23.8209310773391 -6.24142409225021 17.9640419779376 -14.3448450150886 300.863337901316 -8.52402146585773 -67.060161569762 -293.170639528259 89.0021194954197 45.4936494980183 21.732553714813 -73.3444015522738 302.609045257585 -30.7282039399104 27.3635658770114 -299.798677476784 3.8761029382e-06
480.085634559276 0 0 480.085634559276 258.580391659573 0 0 -258.580391659573 192.260045301645 -77.3757453944699 170.958198974403 -41.8355500438231 100.845027864515 -6.25659759763354 82.4589132811623 57.7157019535059 227.612542824214 25.5383886691443 -43.9819111535335 221.857728840739 217.948410228474 58.0939543229591 -209.435201102032 -16.2326378507196 4.92054520713e-09
674.047468858573 0 0 674.047468858573 807.62468484223 0 0 -807.62468484223 68.4341498356192 23.0541459610409 44.0826387980443 46.9942568228519 475.046420378662 156.705696247254 431.281747037496 122.916560928659 760.126597583007 -291.614672005239 -599.064212760736 -365.889869241763 178.064985903515 111.854829796945 123.699826925196 62.4018355065945 -8.11008080282e-07
919.404102312819 0 0 919.404102312819 911.6452573375 0 0 -911.6452573375 106.808467098663 81.0290205376332 -43.1993851664596 -54.5541895358897 792.516817575261 423.218205255856 -439.863464038697 -505.459582838736 905.097816703684 -499.098884237906 507.643736710265 558.927721743244 26.6262582727118 -5.1483415555835 -24.5808875051081 8.84489560670063 2.68360765945e-08
47.789358979289 0 0 47.789358979289 646.247995788802 0 0 -646.247995788802 63.9526452201906 19.1543144376404 14.5631672024708 -59.2534153455854 548.808829872944 -72.6113560331202 18.5537742524103 -543.667619214656 39.0665421370832 19.6822443469731 -20.7954011094912 26.5773449522318 42.2093375378732 33.7747972485068 -12.32154034539 -22.1149472015037 3.54878799661e-06
69.1975150618354 0 0 69.1975150618354 639.6766844202 0 0 -639.6766844202 43.5500521844089 -11.5983986083382 19.7289387581725 -37.0520332837905 52.1391190234982 -12.2771722108629 -30.3788253264258 40.5571910619786 562.41151691195 -22.2436738763052 27.6737089818506 -561.289674908485 50.7735113621784 46.1192446955062 -17.0238224135973 -12.6946522280676 0.000947101319766
383.57469862941 0 0 383.57469862941 632.804418170877 0 0 -632.804418170877 148.813460779308 -80.0511006209626 96.6638567391944 -79.9585279929023 102.173348036829 8.77842792665868 45.9888223860862 -90.8149793136162 328.00767065486 -35.2248620573129 -14.0657103466958 325.8073002465 437.38463732929 106.497534751617 -128.586968778585 -404.263512481448 1.97413525536e-05
672.825437783691 0 0 672.825437783691 858.320688186634 0 0 -858.320688186635 708.871810007753 -98.8986191756548 -372.729220100651 -594.803526075608 127.68307405271 -31.9485567825301 -92.075923944246 -82.488067918195 117.43627703798 -9.16745709614276 85.8144382327426 79.6437008540555 577.154964871884 140.014633054328 378.990705812155 412.152642736804 5.53791521133e-07
11.976197489918 0 0 11.976197489918 585.568134675419 0 0 -585.568134675419 235.309614046865 49.8891590048017 32.6197502250809 -227.63487907597 83.1379937400395 -18.1086650966667 -8.02714347827649 -80.743837034877 155.545918189688 18.5741808432689 -3.41291201339721 -154.395221762409 123.550806188745 -50.354674751404 -21.1796947334072 -110.817999312245 4.19975684068e-08
91.9642228171243 0 0 91.9642228171243 66.2066275822548 0 0 -66.2066275822548 50.6502205330051 45.3703433900439 15.7483752648817 -16.0924037119384 42.7114504945638 -34.792781698711 12.565324732312 21.3504791371755 21.0656682146371 -19.06458206168 8.92282592693999 -0.829014849184788 43.7435111571732 8.48702037034707 -37.2365259241337 21.3285346588173 8.59407341913e-07
45.8459028899496 0 0 45.8459028899496 152.168062485387 0 0 -152.168062485387 33.8709452079991 2.23746250176754 33.5639176644533 -3.96208554302619 76.6264952334729 -12.5435233809282 -44.1582068974344 -61.3541567993638 26.301415111633 -14.3840432754916 -21.4604505363748 4.93080102002032 61.2151098222318 24.6901041546522 32.0547397693558 -45.9367182730678 9.81034689698e-07
221.357306754477 0 0 221.357306754477 65.8365661157571 0 0 -65.8365661157571 73.9193185604521 -21.3785561097153 34.9710063776189 61.5146462888464 125.646090707822 31.8305747564095 -91.6763126902194 79.8073199171604 58.6328463519995 17.8666746423181 55.2474781423027 8.14301955533179 28.9956172499602 -28.3186932890123 1.45782817029779 6.05575487738111 5.162423542e-09
80.0580988427467 0 0 80.0580988427468 696.274264871698 0 0 -696.274264871698 338.230429390807 46.64121451551 221.350083056002 -251.45290057088 9.65257293096445 -6.70219889961862 -6.14716340516807 -3.23497699647146 26.6717662543336 1.80804796675871 -24.5107548975097 -10.3603557868402 401.77759513834 -41.7470635826501 -190.692164753325 -351.16793267476 1.57282099575e-05
147.349995186609 0 0 147.349995186609 26.5856828614073 0 0 -26.5856828614073 45.640206144402 7.39027647206842 -27.6549078475559 35.5474092236423 43.7942995798501 4.50776435478881 38.0277764930183 21.2487399910772 15.880742166304 1.56647861232463 15.68473929403 1.93211536613877 68.6204301574599 -13.4645194391819 -26.0576079394923 62.0360477443433 6.98950774798e-08
619.579990898835 0 0 619.579990898835 174.372904546869 0 0 -174.372904546869 39.5410539136824 8.05521444312047 -21.0867833016251 32.4646890462605 571.664003236019 -1.34495773123307 66.4578892618675 567.786291345071 26.2322886488239 -23.9725993896366 -10.0429139117186 -3.54786223253095 156.515549647179 17.2623426777492 -35.3281920485239 -151.496031806834 2.44623939957e-06
840.544040902525 0 0 840.544040902525 513.009274074686 0 0 -513.009274074686 300.147767938595 176.179621751324 190.106710730079 151.356737588623 370.319291626358 287.316264353488 199.900043557997 120.936820588748 610.969104771328 -481.647546940158 -375.67029259179 -13.0659395224445 72.1171506409307 18.1516608353466 -14.3364616962849 68.3071481729123 9.29295473249e-08
537.48973165991 0 0 537.48973165991 825.732919354754 0 0 -825.732919354755 470.130532038672 404.910523889514 238.747462386119 -8.35667413939335 190.133740131656 118.576950155378 146.607297213034 -24.4263470905994 621.265823372702 -471.717285837247 -349.316011503302 -203.549378875806 81.6925554716352 -51.7701882076446 -36.0387480958503 -51.9107875890465 1.22632685804e-09
155.826408629635 0 0 155.826408629635 260.996573376917 0 0 -260.996573376917 122.483177704265 10.5578372828775 -16.1686868897365 -120.951372281196 138.728572807349 -34.5350065625616 62.6979515999816 -118.835672674724 89.7918277368952 3.48025988700225 -52.9904077996949 72.4049501116686 65.8194037580435 20.4969093926818 6.46114308944992 62.2119300969693 4.17401184464e-07
107.425208989067 0 0 107.425208989067 86.0567074710414 0 0 -86.0567074710414 48.3223309253833 -4.98355607089667 22.7091380791677 42.3616203969086 67.4097056226732 -2.82551034138117 -65.8712304637248 14.0380162644535 21.5270085089437 20.3445901068454 5.31513473036136 4.61075823771854 56.2228714031084 -12.5355236945675 37.8469576541958 -39.6418933810548 1.7125190376e-05
643.610108312487 0 0 643.610108312487 114.89819530227 0 0 -114.898195302271 71.6651663206957 -20.2934192670029 -37.6805114983399 57.4826256485392 355.459479439289 32.9789616669341 -35.5656265680698 352.134797794029 144.283948778716 49.7755748976282 126.198499660552 -49.1343942896987 187.099709076057 -62.4611172975594 -52.952361594142 168.228883857347 1.85515544616e-06
250.493421755594 0 0 250.493421755594 87.8523986250025 0 0 -87.8523986250026 134.95448191439 10.0913978376996 16.914819346042 133.509418263108 66.3910059266088 -53.0539787799953 -0.940676729207864 39.9018311716384 49.8034474193353 -43.8492223953648 -22.7798358281753 -6.22158740304464 87.1968851202623 86.8118033376605 6.80569321134114 -4.54863890111011 5.92212879224e-06
384.992739028872 0 0 384.992739028872 169.293047821778 0 0 -169.293047821779 85.9484578437611 17.6619597724547 -4.46069342248233 83.9958022576581 24.6226665585384 -9.76809555838676 -3.90698376614852 -22.2619742041501 145.549250087697 -23.583818602903 -1.71795793125463 -143.615585232741 298.165412360655 15.689954388835 10.0856351198855 297.581448386327 0.000847652161191
209.951288472853 0 0 209.951288472853 60.4906054474096 0 0 -60.4906054474096 90.6956076577743 66.1537206146685 12.5651901340315 60.7576702494833 78.4539105349874 -13.4694961516616 58.9738768022639 49.9566873057409 28.5935004512172 -17.9602495341833 -22.177276587433 -1.78496719525118 72.6988752762833 -34.7239749288235 -49.3617903488625 40.53129266547 1.9141017079e-05
789.986681243983 0 0 789.986681243983 5.2268484439949 0 0 -5.22684844399487 442.714379747507 1.72022407346177 22.9074927508918 442.117981584356 199.00232638649 3.57492481654552 -34.667847736208 195.926736698007 53.1994192407161 -13.5202322754449 -12.8300812210135 49.8274075447408 100.297404313265 8.22508338543756 24.5904362063297 96.8877069728845 9.90861164945e-08
414.881731441511 0 0 414.881731441511 140.84111365633 0 0 -140.84111365633 166.258456996852 66.2003427407005 143.182113660023 -52.5192485840797 17.543088213116 -13.959694803415 -5.43049409974066 -9.13217383109636 74.7555755609218 8.86156223299739 -12.7041269930257 73.1332615817213 297.165724326951 -61.102210170283 -125.047492567256 262.558778618636 1.22119279771e-05
625.957343771673 0 0 625.957343771673 504.735081263549 0 0 -504.735081263549 492.55510036181 -175.474252964282 -440.708728010035 -132.646637706488 55.6775073087477 -34.848752276969 -42.0063903698453 11.0005660286303 134.21897016149 68.8775109712381 105.266745287538 46.7924435158772 448.240847203174 141.445494270013 377.448373092343 196.075890670105 2.69840212456e-06
540.304927621754 0 0 540.304927621754 939.207168337567 0 0 -939.207168337567 243.788163219852 54.5109934435179 79.8893746086177 223.783171718862 196.244751544963 -15.6391648163082 112.916124561643 159.741565807938 856.883515225924 -206.548143151629 -131.740144411906 -821.116165701833 182.595665968583 167.676314524419 -61.0653547583554 38.6891874592195 8.75644836448e-06
603.674736909358 0 0 603.674736909358 34.3893247128903 0 0 -34.3893247128903 45.6373727370502 15.0337739942543 -24.7026254366259 35.3063128401693 251.412823889533 -94.5073550703165 -7.50857530744586 232.852719869395 234.182200821068 12.4339250956361 -15.9477343527505 233.307459068777 106.831664174597 67.039655980426 48.1589350968223 67.8189204181264 1.78517098986e-06
570.320502478013 0 0 570.320502478013 300.530653091884 0 0 -300.530653091884 132.616901841004 94.8233563871675 -92.0918805826513 -10.7172416287666 211.345520649419 116.614562950122 -124.275022497357 -124.994766249661 64.707782835104 -23.8110907574442 58.5884108371257 13.6940582719626 462.18095024437 -187.626828579845 157.778492242883 391.807798992594 1.62912924091e-06
497.581133458022 0 0 497.581133458022 151.003668059592 0 0 -151.003668059592 37.8501710419239 4.85696605871581 36.7235214971219 -7.77356401258764 61.0221443609851 -19.6190010379729 -31.7500686191404 48.2776350224905 194.657680487246 -144.200374434627 129.450109951722 18.4535530203519 355.054805627459 158.962409413885 -134.423562829704 287.619841368175 2.454660756e-07
53.8610083170977 0 0 53.8610083170977 318.241289311076 0 0 -318.241289311076 176.182972500274 13.7901275649393 87.7345223775919 -152.160854900171 43.0111197810086 -22.5474588019459 -16.1190183630496 -32.8899038217276 57.2884152911663 27.1475641439685 16.6938031025874 -47.6055587677983 95.6197900557242 -18.3902329069619 -88.3093071171297 -31.7239635042809 2.55759243822e-06
56.9656619757995 0 0 56.9656619757994 472.3489291844 0 0 -472.3489291844 86.3451476868702 -29.4410535439636 80.2731015118303 -12.0390227576947 24.017546843547 19.4590991101262 -13.7602876714726 2.97329806823677 54.930189786908 5.70064595412942 16.8048212462034 -51.9848667269096 364.021706842874 4.28130847970792 -83.3176350865612 -354.332675792233 4.84123411773e-06
964.915218959529 0 0 964.915218959529 669.883797040865 0 0 -669.883797040866 369.490249991011 241.318726938239 -153.254928285928 -234.09665487444 351.33947073294 283.625144987955 -142.052206901393 -151.054200007508 619.155059554852 -355.206782192094 243.746558895334 444.711979469627 294.814235721591 -169.7370897341 51.5605762919869 235.470297330984 1.59147534158e-07
801.080517486344 0 0 801.080517486344 142.845562864828 0 0 -142.845562864828 545.48523014209 -81.1010851704376 -124.400623472266 524.882115495526 155.628401560009 -19.4756423053888 -90.6882957371559 124.966122390054 29.4452989816788 14.0588236339109 21.4018564226531 -14.5373880671593 213.367149667393 86.5179038419155 193.687062786769 22.9241048030947 2.17174436137e-07
769.414717270756 0 0 769.414717270756 18.2559350911627 0 0 -18.2559350911626 482.280524518154 14.9180557777464 -23.6231944664265 481.470560496194 55.1375892528447 6.74804704757502 -31.2788993243309 44.9026509987718 193.111239201182 17.9503566740922 56.9207775704801 183.656637456589 57.1412993897378 -39.6164594994137 -2.01868377972274 41.1289332280386 4.23080160619e-06
89.5124071447965 0 0 89.5124071447965 118.155896636954 0 0 -118.155896636954 62.5869591044387 35.5748459292845 23.031409215083 46.0555314442874 39.3836212928122 10.086967794304 -7.80884970428078 -37.2604961473714 69.4742802281708 -21.3076196668336 -15.6411249247171 -64.2496394421429 36.2234431563292 -24.3541940567549 0.41856541391493 26.811114653069 8.46494475891e-06
224.787039033459 0 0 224.787039033459 211.27307318638 0 0 -211.27307318638 81.9451904253551 80.3987858002691 -11.7166941774194 -10.6662342578339 96.0431354770637 23.9250907768136 92.4475759556367 10.2625339713754 139.398598836903 -129.081361376799 16.066897109362 -50.1181236687997 118.673187480517 24.7574847997167 -96.7977788875793 64.0357898023371 6.18392057289e-10
727.789245785424 0 0 727.789245785424 693.760332363628 0 0 -693.760332363628 89.2603556208084 56.155927731753 -17.3877464742136 67.1683641209743 482.54983488612 188.283014814955 66.0395395121278 439.366166997232 344.97956157097 -86.4485659478378 301.05092900073 -144.588663093129 504.759826071153 -157.990376598871 -349.702722038644 -327.916954603281 4.0744989324e-07
944.809874716797 0 0 944.809874716797 421.435952966088 0 0 -421.435952966088 281.052857031037 162.878265819027 -227.406307198796 -27.3450254214883 237.90549266283 136.250056729496 -164.98828762118 -103.989472679612 715.78711394283 -318.871263796363 294.495143217 569.16159413045 131.500364046188 19.7429412478399 97.8994516029765 85.5468257213596 2.06988060048e-08
752.175032656624 0 0 752.175032656624 165.489113105703 0 0 -165.489113105703 207.579421118535 -163.807534335877 114.862858265032 55.3428546236416 67.4888578673296 -23.0057018075923 59.9687813189566 -20.7178398414487 512.74668726461 100.662665006765 -204.174711381975 459.444099327279 129.849179511853 86.1505711367047 29.3430717979862 92.6168054414492 1.48064887227e-08
53.9217398109581 0 0 53.9217398109581 202.77757749743 0 0 -202.77757749743 59.2460204381619 -41.3417408702684 34.0153874595223 -25.3752796152722 106.658447164034 18.9501411868285 10.2167406562235 -104.463078218123 52.0533808796346 0.795694682689273 -50.5174417038211 12.5263488165264 38.7414688265582 21.5959050007506 6.28531358807529 -31.5438286696033 2.79790538176e-06
669.741301855465 0 0 669.741301855465 776.742539831083 0 0 -776.742539831083 452.908507619813 430.293003121749 -118.233810157459 77.4261833911655 203.261211469591 165.446415523293 -100.082293504448 62.6589036408184 490.890083408363 -453.94116468148 186.266034910339 14.678461604404 299.42403918878 -141.798253963562 32.0500687515683 -261.764786612006 3.15733102486e-08
34.6635291448649 0 0 34.6635291448649 967.329430587823 0 0 -967.329430587823 89.529483773088 -37.5638031314889 7.97784440307153 -80.8754793349304 48.9501351211602 13.1167415988768 -45.5400766873663 -12.2543148938213 48.7645566421913 26.4337285498774 -30.2729633277831 -27.618610950147 814.748784196249 -1.98666701726538 67.8351956120778 -811.91749626406 3.26121162783e-05
339.158962645645 0 0 339.158962645644 576.826527015098 0 0 -576.826527015098 103.545756351184 -64.3842994836289 -54.817682317083 59.7612528627407 46.0400405747854 -35.7696195318108 28.741903125374 -3.75801269409834 429.575647357305 364.553866761969 -145.340319689443 -174.676576861109 336.824045377468 -264.399947746529 171.416098881152 -118.994227676987 5.1740965174e-07
755.706175981522 0 0 755.706175981522 871.080626925646 0 0 -871.080626925646 184.98675669899 5.68894891324458 -84.0369228046958 164.698304847959 333.766252858792 -54.3909443392471 -53.2831243444304 324.965298734158 303.348588274791 -230.021908760623 -181.136470271748 79.3716992127558 804.685205074594 278.723904186626 318.456517420875 -684.409753738997 1.26840769814e-05
334.916241972521 0 0 334.916241972521 179.63574152473 0 0 -179.63574152473 66.9752665665101 -10.8425450508411 -17.5861627915628 63.7091235753892 225.694177699999 -22.0521361912272 108.845197930259 196.479739476123 58.655682937141 -18.4625745487192 -38.0785996779473 40.6157940759754 163.226856293601 51.3572557907875 -53.1804354607488 -145.524156679696 1.05328092159e-05
579.210447975795 0 0 579.210447975795 48.130418468032 0 0 -48.1304184680321 137.025712947558 -31.0107541394666 -14.5494568972473 132.675138743034 361.023519962522 57.3707547869067 16.3505581657728 356.060721940764 87.4429435890449 -51.0049658530368 -25.8029250309222 66.1737931638806 41.8486899447013 24.6449652055967 24.0018237623968 -23.8296243399159 1.93445458596e-05
9.12394413132422 0 0 9.12394413132425 730.702607743848 0 0 -730.702607743848 262.634845493808 -17.2024369003775 -33.4292200177398 -259.930039589983 125.392992921846 12.7172281414029 40.6292015883861 -117.944659737472 113.498222174168 9.29750191684499 -36.078841066789 -107.208768867478 238.300491285351 -4.81229315787038 28.8788594961427 -236.49519541759 9.45342211972e-07
169.349050809543 0 0 169.349050809542 981.940699043778 0 0 -981.940699043778 368.93247112591 91.8682074196673 103.794080782 -341.903772297392 408.320508464326 193.035017359645 85.8349768127331 -349.421631358284 245.099415303557 -163.026713283548 -154.70766593128 -97.7831899674201 128.937354959528 -121.876511495765 -34.9213916634524 -23.483054611139 5.60534097568e-08
332.901682644819 0 0 332.901682644819 142.310135773148 0 0 -142.310135773148 54.2740252194763 -41.9201824732314 -2.0871897542638 34.4094718626286 69.1001243395933 48.7762550309716 -14.1474381110815 46.8567404307427 230.225927437006 9.73059952940138 11.7812326481701 229.71829629857 121.611741421892 -16.5866720871416 4.45339521717522 -120.39296172027 0.00165339431001
602.538045515996 0 0 602.538045515996 520.28646040437 0 0 -520.28646040437 84.6485281279079 49.3876140929141 -65.9494724827252 -19.4140147234128 326.993123014835 294.290372195645 -112.69460620379 -87.2788924340607 516.774124627161 -490.809039694944 147.815960888093 65.6690501273253 194.408730150463 147.131053406384 30.8281177984221 123.275442141774 3.11595388889e-08
943.666618719076 0 0 943.666618719076 30.632894620907 0 0 -30.632894620907 196.284169991262 -31.2891957225708 -81.2061473773107 175.937554968596 153.611883874072 22.6592320758732 2.22414253781702 151.915184425535 368.91802574216 64.3224961025734 126.713638882516 340.450848043854 255.485433732489 -55.6925324558758 -47.7316340430223 244.730136660183 1.14097845467e-07
603.442118626266 0 0 603.442118626267 677.918770323458 0 0 -677.918770323459 223.590919830776 216.557959545468 -36.7599450828736 -41.7642912759263 65.2125389204314 53.6766375383954 36.6894180236796 5.03789838168534 625.579203104555 -621.188713392457 41.7600718815159 61.0738741787698 366.978227093962 350.954116308594 -41.689544822322 -98.8241329817209 2.97537965984e-08
51.8749004616185 0 0 51.8749004616184 420.712201770507 0 0 -420.712201770507 128.695114224049 31.705456176102 2.68247789582815 -124.699642285553 158.273809916964 77.2748745991163 71.8079647042891 -117.994952715571 114.401053513556 -78.7494787194555 -49.1915328805511 -66.8304851043826 71.2171245775564 -30.2308520557629 -25.2989097195662 -59.3122212033827 1.67081951279e-08
475.942388865587 0 0 475.942388865587 64.4351679542828 0 0 -64.4351679542828 117.74587556516 -20.9614236871932 -95.3781854995563 65.7853453318005 97.1518924749513 -32.4812699799668 50.6198293168525 76.2960693082266 63.5125349098564 59.755163217816 19.6668699438612 8.7393813338899 261.967253869902 -6.3124695506561 25.0914862388426 260.686424937387 1.2470914357e-09
72.6443204794885 0 0 72.6443204794885 235.725408515421 0 0 -235.725408515421 60.7936789859126 -9.00867905004827 55.7114957938375 -22.60407801324 99.9562352870899 81.5127401699835 26.7620177783052 -51.2905114732004 81.0759720063054 -37.8843359838831 -31.2910987840462 -64.489979537247 66.5438427156018 -34.6197251360522 -51.1824147880965 -24.6965190122451 4.28670842164e-06
33.1280286729322 0 0 33.1280286729322 476.232839326177 0 0 -476.232839326177 105.482044831014 -48.2731533501896 -42.2533516808244 -83.7306319043255 39.7444181544786 -2.38166222522615 36.2194241084693 -16.1894958764569 334.267323177704 74.8034113243966 3.66919139312994 -325.769289579514 29.8670818359123 -24.1485957489809 2.36473617922517 -17.4153932929478 5.02643673684e-06
184.347748341142 0 0 184.347748341142 358.250470181747 0 0 -358.250470181747 44.2661104619603 8.8215393292279 -24.7547038875512 35.6212522903535 188.044117218949 -17.0175411754977 -186.989782335667 -10.2866231122761 191.380821540986 20.6536727047336 99.4382232876498 -162.210000946009 118.907169300993 -12.4576708584638 112.306262935568 -37.0273500726735 9.65871856697e-07
717.842153558697 0 0 717.842153558696 759.882920513058 0 0 -759.882920513058 626.939839671408 250.171930585425 139.385489397276 557.708932203757 95.5616326775711 66.8459784604258 8.71588243260447 67.7323718549138 723.097895664001 -306.730496039844 -132.703563761468 -641.230640002381 32.1257060587745 -10.2874130060068 -15.3978080684128 -26.2514310106506 1.09925259576e-05
82.9848304501322 0 0 82.9848304501323 311.803466441037 0 0 -311.803466441037 137.45049233295 15.5932837672951 -77.0589606228544 -112.74486210754 68.3007360152811 -44.8397796744428 -1.81958247425032 -51.4885794967772 42.6721298867388 4.88663503645097 -33.6123217835526 25.8310528513677 146.364938656199 24.3598608706967 112.490864880657 -90.4162472379544 3.4743319427e-06
358.861618766484 0 0 358.861618766484 15.7049770714716 0 0 -15.7049770714715 102.442066124823 -16.5387985059301 49.9074269869355 87.9209519252752 195.192304911143 -10.3456108931681 -37.6472583308415 191.247714161353 27.9828449634819 21.6062948028923 2.47646386903538 17.6089398842219 48.9493798385073 5.27811459620598 -14.7366325251294 46.3790357241619 6.58503439082e-07
14.5928825590941 0 0 14.5928825590942 642.693303960968 0 0 -642.693303960968 93.5792969497369 17.5434491451757 -36.1629308591465 -84.5077194188451 281.251095648066 41.4716210001142 46.9242824908558 -274.190435952057 164.916643597505 -41.8916962134401 22.3566011008394 -157.932794286194 117.539150324753 -17.1233739318497 -33.1179527325487 -111.469471744777 3.43926069169e-06
748.664396464092 0 0 748.664396464092 312.797884442657 0 0 -312.797884442657 52.4110389943098 37.4678204022012 -7.80966374389016 35.8062647448575 438.539626349766 384.019100843317 -196.067619100152 80.0238889762351 491.573188446986 -374.023130131021 157.302517985177 277.501019029574 78.9384271156861 -47.4637911144968 46.5747648588651 42.5353392707679 4.40912785752e-07
499.750011266903 0 0 499.750011266903 72.1225218669021 0 0 -72.122521866902 277.225037612286 46.2023134340794 17.4828441972807 272.788228982202 17.8691535077452 3.40486667511609 -16.9816700517178 4.39731875836152 74.09025023396 -36.0380903532092 44.9046731141961 -46.628227029686 202.688091779814 -13.5690897559863 -45.405847259759 197.070168689124 1.67602117532e-05
855.874918827845 0 0 855.874918827845 412.066856214391 0 0 -412.066856214391 123.452993486162 -118.115686784793 -28.2366494624503 -22.1814734223334 34.0797792437849 6.17038256297934 -32.3288550651022 -8.84323823670998 792.043780034299 85.0237792099544 6.63099515696624 787.439100097974 318.36522227799 26.9215250118594 53.9345093705863 -312.606325825477 1.68665408031e-06
228.005426704863 0 0 228.005426704863 334.981646729696 0 0 -334.981646729696 233.886647825404 201.635134993209 -24.78563006428 -115.896112573251 17.2383809270768 -8.66090812863763 4.08341023798172 -14.3344413285851 83.2026062840817 6.80797740633277 -18.5355172951775 -80.8254893873148 228.659438397996 -199.782204270904 39.2377371214759 104.079823264318 1.38822196186e-05
363.606195704214 0 0 363.606195704214 655.266470194002 0 0 -655.266470194002 102.626134247605 99.3683601875381 13.4332333568265 -21.8540766409409 101.40149511924 65.5059641014065 -67.1614115207838 -38.4782624620514 540.246470598114 -341.948846665033 225.069365988021 -352.535126975912 274.598565933258 177.074522376089 -171.341187824064 121.207191589115 2.03008564745e-07
406.748757979606 0 0 406.748757979606 215.488041973484 0 0 -215.488041973484 240.600930886699 78.7324294514928 56.0247319526578 220.343463496979 99.6631448616208 79.900021479854 19.944815443506 56.1331751119761 233.897193442743 -193.325377281553 -62.7296497634129 -115.750536240213 48.0755307620266 34.6929263502061 -13.2398976327509 30.5346136373791 1.74478606487e-06
23.4527310821048 0 0 23.4527310821049 220.555424301652 0 0 -220.555424301652 58.5839227289286 -18.537632629404 -40.0942132548769 -38.4822847850642 73.9417353982118 24.4177803909423 43.0008127478112 -54.9734693966695 84.3545871151683 -21.542017230016 -3.12128515834737 -81.4978247562013 27.1279101414477 15.6618694684776 0.214685665413024 -22.1491142816117 1.04506149078e-05
838.599452910099 0 0 838.5994529101 294.490060864461 0 0 -294.490060864461 130.230853865213 -26.4443404803171 50.4362048368143 -117.119432190745 35.7481164637469 22.1640429909969 28.0129116806303 1.39993148834458 157.726561464836 67.1259322343394 26.3324093443942 -140.279655086939 809.383981980764 -62.8456347450192 -104.781525861839 800.108547834979 9.02044346411e-07
510.130342192693 0 0 510.130342192693 129.303514508445 0 0 -129.303514508445 324.750556013732 -108.263288570438 6.08212603602158 306.11271081421 111.073171152153 -38.8530320341849 -49.8687418652328 91.3279794823298 142.967912205551 142.237397158496 -10.5656417383313 9.83432685279547 60.642217329702 4.87892344612635 54.3522575675425 -26.4481894650876 2.01207338173e-06
823.229204251781 0 0 823.229204251782 823.099999604286 0 0 -823.099999604286 353.745783376564 59.80033871968 -13.6242317241657 348.388259066859 117.259497034666 64.7999155580849 -22.158511613881 95.1827765488345 369.066971295933 -64.9199641964724 -101.917662512698 348.724271621907 806.256952148905 -59.6802900812924 137.700405850745 -792.166102590104 1.09385846923e-05
16.2055310650578 0 0 16.2055310650578 629.963214200455 0 0 -629.963214200455 38.9236616051432 32.0613949613082 -6.56429147133268 -21.0719829006689 121.911280796335 -51.193592202206 19.1525586527679 -108.971354033477 178.096924297119 11.2138160296088 10.3848617554021 -177.439903687048 307.236878566916 7.91838121128906 -22.9731289368373 -306.274442514203 0.000245012048067
54.1318085065145 0 0 54.1318085065145 175.022773636775 0 0 -175.022773636775 76.9629622844465 -58.8346659496927 24.728725438318 -43.0147624006166 32.4028655518098 29.344435752837 13.742257172901 -0.0124141103915925 56.5128846961407 30.0973660713486 15.7063887868349 -45.1792435032207 63.2758696108925 -0.607135874492963 -54.1773713980539 -32.6845451160316 6.36016694684e-07
593.125540293728 0 0 593.125540293729 892.217694171151 0 0 -892.217694171151 559.91396119622 25.0016490959366 -12.4786426642307 559.21627744745 35.8707215173335 -18.5607103648083 -8.76568918039305 29.417195415616 379.279086997718 22.9194364560052 13.23754519366 -378.3544537383 510.279464753608 -29.3603751871334 8.00678665096374 -509.371173002189 0.0298629094951
152.49798546397 0 0 152.49798546397 55.1415637283217 0 0 -55.1415637283217 61.5456082900721 -55.1424265313145 -26.0697699091276 8.21838140504065 45.338974566042 2.75454051549032 1.13170362588219 45.2410694850585 62.9218834842859 16.0450609198343 31.7715384588812 51.8872699729392 37.8330828518914 36.3428250959899 -6.83347217563583 -7.99029912739045 1.87784463457e-08
476.100710448556 0 0 476.100710448557 60.1836693399728 0 0 -60.1836693399728 306.238294371905 -0.452149164614726 -51.9813987578489 301.794007038118 80.709155658763 -21.3134124099116 29.7655302754832 71.9285719725809 61.1449652158247 13.2331971385294 -59.0217141132099 8.94575474042059 88.1919645420368 8.53236443599698 81.2375825955755 33.2487073574638 9.33013454512e-07
43.7305834722861 0 0 43.7305834722861 104.833197160437 0 0 -104.833197160437 47.0140398358071 -36.9923575861472 -10.2434841155568 -27.1469419102007 41.6135276321387 34.2629314357488 22.4372907421244 -7.36920589842098 39.9746365271227 10.5641644931137 -30.3391701449349 -23.7887525724805 19.9615766376542 -7.83473834271529 18.1453635183673 -2.79771330704827 1.02819983141e-07
579.495198861368 0 0 579.495198861369 716.47155267892 0 0 -716.471552678921 61.0315042990372 44.5606644544036 22.70525276455 -34.9808976054552 65.6393510815131 -35.3346434186226 -17.9954173985783 -52.3082434949968 559.479092189256 115.452434671669 -21.765663213991 547.0044294429 609.816803970483 -124.67845570745 17.0558278480193 -596.691642160001 3.34366892659e-05
162.160269175992 0 0 162.160269175992 832.469443270763 0 0 -832.469443270763 7.36783759172672 2.16616972249333 -0.262387865642872 7.03732137388783 337.042513287369 -31.7872331255027 225.810765326782 -248.186876840465 222.69426661493 169.287329236192 51.641341383078 -135.158086711063 427.52509495273 -139.666265833182 -277.189718844217 -294.001531917131 -1.5900750476e-08
964.635064806202 0 0 964.635064806203 911.424473002958 0 0 -911.424473002958 124.150392811764 -92.0304317371949 83.1178758619832 5.92776364008057 515.072895902862 -469.928007053667 187.597257702023 96.3069321648742 905.873545191697 700.068294142228 -570.906704722787 -67.6520355756781 330.962703902837 -138.109855351366 300.191571158781 18.6279315739682 2.66483052185e-08
759.485000997612 0 0 759.485000997612 261.216877311009 0 0 -261.216877311009 89.3897395790766 37.5287219944685 -3.91819384724999 81.0355991182419 58.5300623636441 -40.0158410193618 19.6622281672445 37.9196182905952 476.31400639194 381.289532029451 48.2888862373474 281.356551222572 396.468069973961 -378.802413004557 -64.0329205573419 97.9563550551938 4.03197745416e-08
220.630435058101 0 0 220.630435058101 412.634608387469 0 0 -412.634608387469 141.526538408985 -61.6265411783296 105.063021346654 -72.0672744172979 131.572840719985 -21.8512782361249 40.4217685879882 -123.288339589732 200.236028655435 0.914462903529076 -142.865507128838 140.296392691039 159.929635661165 82.5633565109255 -2.6192828058041 -136.944952013377 3.37016034183e-07
974.344454606143 0 0 974.344454606143 896.242533016296 0 0 -896.242533016296 757.810872455371 -153.777177067018 -1.49456776672535 742.042899360987 11.4984591822117 7.91363054677444 -3.24962241436211 7.68303125714194 227.624003301462 106.478612023271 4.14666404403871 201.141237039767 873.653652683395 39.3849344969731 0.597526137048756 -872.765246068049 0.000272365886315
923.246228044938 0 0 923.246228044938 852.295810810071 0 0 -852.295810810071 179.530814665255 -58.914517955576 -31.3986314814188 166.656889835153 27.2325970697808 17.5891115933174 14.1467077720876 15.2350961839437 839.461732298096 1.34839749320061 23.3186769436696 -839.136711819187 729.316894821878 39.977008869058 -6.06675323433848 728.195143034958 0.00366164608439
22.3639067542711 0 0 22.3639067542713 987.541614982084 0 0 -987.541614982084 13.5750333218054 11.0241745950181 -3.28046875992038 -7.21024471858427 801.480754243854 84.2601450062344 -27.2242431971304 -796.574207446594 69.6331578770345 -29.3667207831563 31.1236587294599 -54.9335075674607 125.21657629366 -65.9175988180962 -0.618946772409146 -106.459748495173 1.30671264016e-05
141.276143710963 0 0 141.276143710963 241.706739498762 0 0 -241.706739498762 37.9527397921916 -0.240358584817905 -27.8603907592747 -25.7711333127791 80.1622470004252 -60.441619208206 -9.8220164255816 51.733205052297 120.232465895814 -75.071807049463 51.6001884228056 -78.4696769233015 144.635430521294 135.753784842487 -13.9177812379493 -47.9229906040154 4.81097255798e-07
175.115757158558 0 0 175.115757158559 550.834777665313 0 0 -550.834777665313 85.7715396989479 -19.6321696049546 -66.9905927568074 49.8356842134436 63.5871286551659 61.6203326784837 -15.26933974809 3.62005453812712 416.065726343715 -5.91136764008812 219.204702314097 -353.588804763294 160.526140126043 -36.076795433441 -136.944769809199 -75.5859544950308 7.44999204136e-08
599.925394790547 0 0 599.925394790547 335.691401566585 0 0 -335.691401566585 46.4734380865918 -28.8995198990882 -30.2396762663868 -20.252411621696 332.217783379594 4.43488101570473 -322.756633495823 -78.5948023629453 164.123449377063 43.6393814276743 19.1102907218865 157.05702089547 392.802125513883 -19.1747425442908 333.886019040324 206.024186313133 1.04077970466e-06
187.835659984251 0 0 187.835659984251 285.283421523835 0 0 -285.283421523835 108.328118611988 65.7026655560213 84.8902664897742 14.5527892907706 105.637711727765 -3.48501407246002 75.9854586159053 73.3034166660987 51.4835151561966 -32.1685532900786 -22.8891857493368 -33.042725187158 207.669736012138 -30.0490981934826 -137.986539356343 -152.261242309295 5.62080247616e-06
698.59336996304 0 0 698.59336996304 491.237677677405 0 0 -491.237677677405 73.7806400643036 62.1085396042236 -39.6980225950576 3.19047936385788 310.242025670482 119.699188119855 -280.163349867086 58.5723163860221 515.198047172112 -195.195837930148 225.456043429872 420.115680670994 290.610334733547 13.3881102060694 94.4053290322724 -274.522784135239 2.15158401495e-07
595.498025976736 0 0 595.498025976736 607.19125224674 0 0 -607.19125224674 157.487457111181 31.4954246650865 -83.3193664199913 -129.877713838377 32.1413467012798 27.4462077568924 14.0210766821515 -9.12037588099286 574.197295487235 9.35289189980565 161.962685603252 550.802274895582 438.86317892378 -68.2945243217846 -92.6643958654117 -423.497411446216 5.34535193918e-06
155.605630222975 0 0 155.605630222975 991.793211996935 0 0 -991.793211996935 155.826213479285 99.318845757878 4.3330521983412 -119.995001326143 261.1723955737 82.3675997697017 -66.8372833762728 -238.661635519334 108.067730561609 48.1501248146285 -14.4647112609832 95.6607129244213 622.332502605315 -229.836570342208 76.9689424389147 -573.191657852905 4.37701308643e-06
133.496992249923 0 0 133.496992249923 345.493521512257 0 0 -345.493521512257 53.4958331976978 45.702468010306 -8.67218969425658 26.4174509214967 92.3029340142404 -21.0304191317805 -81.7805153154854 37.2760031858634 281.046583974716 -60.3036780455808 52.9114289311561 -269.352983028767 52.1451625755262 35.6316291670554 37.5412760785859 -6.33700034092696 1.23759937095e-05
563.892526076948 0 0 563.892526076948 170.228432662237 0 0 -170.228432662237 111.926147833142 -77.2323928720282 -54.436379177945 59.9941720671438 32.4435292863337 5.18880527389659 12.4892727840202 29.4902858193865 443.779324055354 39.7058844426809 6.17469101872304 441.956337651668 145.971957564355 32.3377031554508 35.7724153752018 -137.776702123486 2.74774109305e-07
236.057143403376 0 0 236.057143403376 62.2374489891349 0 0 -62.2374489891349 74.8497147235799 21.9470601079298 67.1429167428457 24.7514661804814 130.29547838923 -30.3724294195305 -53.3941310684443 114.906457552566 45.0882770692732 15.5723854506184 -42.1278565390626 -3.96197474462804 48.0611222104283 -7.1470161390177 28.3790708646613 38.123745425822 3.15736427354e-09
686.149038247489 0 0 686.149038247489 226.986609901417 0 0 -226.986609901417 70.7676199848092 55.2783665594515 33.2602041541452 29.0880911793445 454.079216305882 229.793758005748 155.777459727312 359.327352846212 128.771492110061 -127.874964482621 -1.24631482102791 -15.1174514448329 259.517319748153 -157.197160082578 -187.791349060429 85.8644357653483 4.47047430124e-08
251.590608859832 0 0 251.590608859832 79.3227674048428 0 0 -79.3227674048428 61.6572204703103 50.6382281544727 5.28137916789976 34.7777187231264 62.8424710629485 -15.9477375439739 60.7555205995851 1.90067177582803 88.4174917823825 -68.3052295882389 12.9482331543207 54.6295865092075 117.996192949034 33.6147389777402 -78.9851329218056 80.9598644468274 2.14595048096e-07
216.695473132165 0 0 216.695473132165 120.634013158508 0 0 -120.634013158508 31.7293166352798 7.8526946879893 -7.92738853941435 -29.7025458710904 77.4260801174333 36.9528068879886 -4.33277794337974 67.9007730496759 112.412091462855 -98.9578120629999 -46.6930270776178 -25.760259336545 115.761998075105 54.152310487022 58.9531935604118 83.6234921316159 2.73626294068e-06
336.871952891664 0 0 336.871952891664 102.97540478921 0 0 -102.97540478921 87.3348882968209 23.3290887690161 -80.6333396242112 24.1122556404864 105.942034344014 88.3289439475548 -22.532647956052 53.9814049293516 199.650752445389 -90.8108133978507 62.5040224717446 166.454397048809 46.9196825946504 -20.8472193187201 40.6619651085186 -10.6515095161925 4.86584514378e-07
93.8343169840405 0 0 93.8343169840405 130.343646185289 0 0 -130.343646185289 63.4458589363936 4.76383144052101 29.5550912275989 55.9390696089179 73.1475553515662 32.8947716739227 -4.24946365709413 -65.1954055824333 61.8558082276324 -57.4831463450478 -10.4453370437188 -20.3156056225397 25.7287406537371 19.8245432306042 -14.860290526786 -6.93738760519317 9.67720814113e-09
432.521490591565 0 0 432.521490591565 340.9618704832 0 0 -340.9618704832 112.774969023943 -43.9418551755264 102.892506642212 14.1576508986044 169.64108315493 -15.1325955317319 121.342466995067 117.580216660806 294.348910777225 227.362594667465 -179.722934237952 51.450935178265 196.718398118666 -168.288143960206 -44.5120393993278 -91.6291826293099 2.15609402963e-08
53.4617849731283 0 0 53.4617849731283 168.807628099275 0 0 -168.807628099275 78.5304728488059 58.6351050990958 31.9895536507176 -41.2992502728912 47.5562854676831 -36.0237556735614 20.6537713892964 -23.1799707086528 27.0712136682301 -13.279743741734 9.3030884162021 -21.6783662102376 69.1114410876838 -9.3316056838003 -61.9464134562161 -29.1882559343648 9.14810604496e-06
784.505899383075 0 0 784.505899383075 102.017509670623 0 0 -102.017509670623 106.165585533466 44.1375745765469 28.3390166548714 92.3033379526352 338.756877573818 -23.6937133678384 38.7216229938081 335.701453620819 318.379324368994 -141.694342819814 -73.392808903361 275.502455524071 123.22162157742 121.250481611106 6.33216925468147 -21.0188573850725 3.23292553023e-08
723.557113939074 0 0 723.557113939074 399.122890109333 0 0 -399.122890109333 346.380678901084 95.0230912315904 -291.543218428011 161.098537043035 225.875782147305 91.4179333288632 -141.803856008384 150.180880433196 73.6271281179975 -25.94266413106 -8.15084244175958 -68.4214581851091 476.796414882021 -160.498360429394 441.497916878154 81.5762645386197 3.46029333132e-06
91.1571535101832 0 0 91.1571535101832 35.7181020307215 0 0 -35.7181020307215 21.6770162398988 -10.0897417081924 -15.7610542904159 -10.9398040650352 55.3932723225917 17.1500929686239 22.6603748683506 47.5478321335282 17.4596346994298 -2.54214506090276 17.1107365363114 -2.36622854175139 32.3453322789844 -4.51820619952877 -24.0100571142461 21.19725195272 8.02304409283e-08
