Created overview file for virtual and born tests
Thursday, 21. April 2016 10:36AM
The test is passed if the ratio of phase space points larger then the threshold is less then 0.05
Test for sm_21_21_25_23_LI                   not passed
Test for sm_21_21_25_23_21_LI                not passed
Test for sm_21_21_22_22_LI                   not passed
Test for sm_21_21_24_-24_LI                  not passed
Test for sm_21_21_25_25_LI                   not passed
Test for sm_21_21_25_25_21_LI                not passed
Test for sm_21_21_23_23_LI                   not passed
Test for sm_21_21_13_-13_LI                  not passed
Test for sm_21_21_11_-11_22_LI               not passed
Test for sm_21_21_12_-12_22_21_LI            not passed
Test for sm_21_21_13_-13_13_-13_LI           not passed
Test for sm_21_21_22_21_LI                   not passed
Test for sm_21_21_22_21_21_LI                not passed
Test for sm_21_21_11_-11_13_-13_21_LI        not passed