1.0000000000000001e+03   0.0000000000000000e+00   0.0000000000000000e+00   9.9583373190821374e+02   1.0000000000000001e+03   0.0000000000000000e+00   0.0000000000000000e+00   -9.9583373190821374e+02   9.9999999999999955e+02   2.1803129984892027e+02   8.7435349014152553e+02   -3.9223858796692048e+02   1.0000000000000000e+03   -2.1803129984892030e+02   -8.7435349014152564e+02   3.9223858796692036e+02   1.7546334501537593e-02
1.0000000000000001e+03   0.0000000000000000e+00   0.0000000000000000e+00   9.9583373190821374e+02   1.0000000000000001e+03   0.0000000000000000e+00   0.0000000000000000e+00   -9.9583373190821374e+02   1.0000000000000000e+03   -5.5412937290851949e+02   -7.6813353220601812e+02   2.6228667161614999e+02   1.0000000000000003e+03   5.5412937290851960e+02   7.6813353220601834e+02   -2.6228667161614999e+02   1.7643506449360385e-02
1.0000000000000001e+03   0.0000000000000000e+00   0.0000000000000000e+00   9.9583373190821374e+02   1.0000000000000001e+03   0.0000000000000000e+00   0.0000000000000000e+00   -9.9583373190821374e+02   9.9999999999999807e+02   -4.7296149808263073e+02   5.5129204884295984e+02   -6.6201758401172629e+02   1.0000000000000023e+03   4.7296149808263044e+02   -5.5129204884295984e+02   6.6201758401172629e+02   1.7022326788464371e-02
1.0000000000000001e+03   0.0000000000000000e+00   0.0000000000000000e+00   9.9583373190821374e+02   1.0000000000000001e+03   0.0000000000000000e+00   0.0000000000000000e+00   -9.9583373190821374e+02   1.0000000000000001e+03   8.8654882277277034e+02   1.1887806957942449e+02   -4.0716332440440380e+02   1.0000000000000001e+03   -8.8654882277277034e+02   -1.1887806957942449e+02   4.0716332440440362e+02   1.7531192659862707e-02
1.0000000000000001e+03   0.0000000000000000e+00   0.0000000000000000e+00   9.9583373190821374e+02   1.0000000000000001e+03   0.0000000000000000e+00   0.0000000000000000e+00   -9.9583373190821374e+02   1.0000000000000013e+03   8.9577483623748981e+02   -4.0036930102922042e+02   -5.6344022609620971e+01   1.0000000000000013e+03   -8.9577483623749004e+02   4.0036930102922071e+02   5.6344022609622186e+01   1.7707578398840077e-02
1.0000000000000001e+03   0.0000000000000000e+00   0.0000000000000000e+00   9.9583373190821374e+02   1.0000000000000001e+03   0.0000000000000000e+00   0.0000000000000000e+00   -9.9583373190821374e+02   1.0000000000000003e+03   -3.6822372143039172e+02   8.7378768027319211e+02   -2.5843599614896408e+02   1.0000000000000000e+03   3.6822372143039172e+02   -8.7378768027319234e+02   2.5843599614896408e+02   1.7645592286902472e-02
1.0000000000000001e+03   0.0000000000000000e+00   0.0000000000000000e+00   9.9583373190821374e+02   1.0000000000000001e+03   0.0000000000000000e+00   0.0000000000000000e+00   -9.9583373190821374e+02   1.0000000000000001e+03   2.3089372856920494e+02   -9.5063468967174254e+02   9.4151772298138297e+01   1.0000000000000001e+03   -2.3089372856920474e+02   9.5063468967174254e+02   -9.4151772298138297e+01   1.7702345672657115e-02
1.0000000000000001e+03   0.0000000000000000e+00   0.0000000000000000e+00   9.9583373190821374e+02   1.0000000000000001e+03   0.0000000000000000e+00   0.0000000000000000e+00   -9.9583373190821374e+02   1.0000000000000000e+03   -2.6677191582588347e+02   9.1735439514287452e+02   -2.3060017772195951e+02   1.0000000000000002e+03   2.6677191582588341e+02   -9.1735439514287452e+02   2.3060017772195951e+02   1.7659528771477744e-02
1.0000000000000001e+03   0.0000000000000000e+00   0.0000000000000000e+00   9.9583373190821374e+02   1.0000000000000001e+03   0.0000000000000000e+00   0.0000000000000000e+00   -9.9583373190821374e+02   1.0000000000000010e+03   -3.6486607858939828e+02   -2.7767160991517187e+02   -8.6928361601301947e+02   9.9999999999999682e+02   3.6486607858939789e+02   2.7767160991517324e+02   8.6928361601301663e+02   1.5230436780744514e-02
1.0000000000000001e+03   0.0000000000000000e+00   0.0000000000000000e+00   9.9583373190821374e+02   1.0000000000000001e+03   0.0000000000000000e+00   0.0000000000000000e+00   -9.9583373190821374e+02   9.9999999999999977e+02   -3.1301697630484580e+02   4.0725505562140120e+02   8.3788213702318683e+02   1.0000000000000005e+03   3.1301697630484574e+02   -4.0725505562140131e+02   -8.3788213702318649e+02   1.5760854088815977e-02
1.0000000000000001e+03   0.0000000000000000e+00   0.0000000000000000e+00   9.9583373190821374e+02   1.0000000000000001e+03   0.0000000000000000e+00   0.0000000000000000e+00   -9.9583373190821374e+02   1.0000000000000001e+03   7.4437715888492846e+01   -5.8890307173240672e+02   -7.8328473870247262e+02   1.0000000000000001e+03   -7.4437715888492747e+01   5.8890307173240672e+02   7.8328473870247262e+02   1.6354622863002762e-02
1.0000000000000001e+03   0.0000000000000000e+00   0.0000000000000000e+00   9.9583373190821374e+02   1.0000000000000001e+03   0.0000000000000000e+00   0.0000000000000000e+00   -9.9583373190821374e+02   9.9999999999999898e+02   4.2936285099990698e+02   7.1244994285512769e+02   -5.2339794080003492e+02   9.9999999999999977e+02   -4.2936285099990647e+02   -7.1244994285512666e+02   5.2339794080003628e+02   1.7372421893896397e-02
1.0000000000000001e+03   0.0000000000000000e+00   0.0000000000000000e+00   9.9583373190821374e+02   1.0000000000000001e+03   0.0000000000000000e+00   0.0000000000000000e+00   -9.9583373190821374e+02   9.9999999999999955e+02   -7.7704435319737939e+01   -2.5746523771809404e+02   -9.4528115152327405e+02   1.0000000000000000e+03   7.7704435319737939e+01   2.5746523771809416e+02   9.4528115152327382e+02   1.2519283557266659e-02
1.0000000000000001e+03   0.0000000000000000e+00   0.0000000000000000e+00   9.9583373190821374e+02   1.0000000000000001e+03   0.0000000000000000e+00   0.0000000000000000e+00   -9.9583373190821374e+02   9.9999999999999920e+02   -1.3948514559273221e+02   9.7249790831032362e+02   -2.5971057309670048e+01   1.0000000000000005e+03   1.3948514559273417e+02   -9.7249790831032317e+02   2.5971057309669927e+01   1.7709859540742875e-02
1.0000000000000001e+03   0.0000000000000000e+00   0.0000000000000000e+00   9.9583373190821374e+02   1.0000000000000001e+03   0.0000000000000000e+00   0.0000000000000000e+00   -9.9583373190821374e+02   9.9999999999999989e+02   -8.7599430153393155e+02   -8.2012227649138580e+01   -4.3793922126576604e+02   9.9999999999999932e+02   8.7599430153393098e+02   8.2012227649138836e+01   4.3793922126576587e+02   1.7496708665773322e-02
1.0000000000000001e+03   0.0000000000000000e+00   0.0000000000000000e+00   9.9583373190821374e+02   1.0000000000000001e+03   0.0000000000000000e+00   0.0000000000000000e+00   -9.9583373190821374e+02   9.9999999999999989e+02   4.6448711969308152e+02   -8.1175574389148915e+02   3.0197203715768165e+02   1.0000000000000001e+03   -4.6448711969308158e+02   8.1175574389148949e+02   -3.0197203715768165e+02   1.7619613368573591e-02
1.0000000000000001e+03   0.0000000000000000e+00   0.0000000000000000e+00   9.9583373190821374e+02   1.0000000000000001e+03   0.0000000000000000e+00   0.0000000000000000e+00   -9.9583373190821374e+02   9.9999999999999943e+02   6.7325118960808243e+02   -5.2412517696661791e+02   4.8775856516085344e+02   1.0000000000000005e+03   -6.7325118960808265e+02   5.2412517696661791e+02   -4.8775856516085321e+02   1.7430070333809770e-02
1.0000000000000001e+03   0.0000000000000000e+00   0.0000000000000000e+00   9.9583373190821374e+02   1.0000000000000001e+03   0.0000000000000000e+00   0.0000000000000000e+00   -9.9583373190821374e+02   9.9999999999999864e+02   -3.8265792316436824e+02   6.7797446136037240e+02   5.9983858404524551e+02   1.0000000000000030e+03   3.8265792316436620e+02   -6.7797446136037524e+02   -5.9983858404524290e+02   1.7210515361876146e-02
1.0000000000000001e+03   0.0000000000000000e+00   0.0000000000000000e+00   9.9583373190821374e+02   1.0000000000000001e+03   0.0000000000000000e+00   0.0000000000000000e+00   -9.9583373190821374e+02   1.0000000000000000e+03   2.2159562722153828e+02   9.5700256772795888e+02   -3.0401425709116520e+01   9.9999999999999989e+02   -2.2159562722153828e+02   -9.5700256772795888e+02   3.0401425709116509e+01   1.7709632161533765e-02
1.0000000000000001e+03   0.0000000000000000e+00   0.0000000000000000e+00   9.9583373190821374e+02   1.0000000000000001e+03   0.0000000000000000e+00   0.0000000000000000e+00   -9.9583373190821374e+02   1.0000000000000008e+03   5.3081777220139656e+02   -8.2425277900808499e+02   -6.8721411069312637e+01   9.9999999999999841e+02   -5.3081777220139668e+02   8.2425277900808464e+02   6.8721411069310903e+01   1.7706160492622483e-02
1.0000000000000001e+03   0.0000000000000000e+00   0.0000000000000000e+00   9.9583373190821374e+02   1.0000000000000001e+03   0.0000000000000000e+00   0.0000000000000000e+00   -9.9583373190821374e+02   1.0000000000000003e+03   -2.2728342295249641e+02   9.2878388737661453e+02   2.2712445823235905e+02   9.9999999999999977e+02   2.2728342295249666e+02   -9.2878388737661442e+02   -2.2712445823235890e+02   1.7661132476061811e-02
1.0000000000000001e+03   0.0000000000000000e+00   0.0000000000000000e+00   9.9583373190821374e+02   1.0000000000000001e+03   0.0000000000000000e+00   0.0000000000000000e+00   -9.9583373190821374e+02   9.9999999999999989e+02   4.6803067065297159e+02   -8.4116913427256736e+02   -1.9815287583588065e+02   9.9999999999999989e+02   -4.6803067065297159e+02   8.4116913427256736e+02   1.9815287583588065e+02   1.7673379740552209e-02
1.0000000000000001e+03   0.0000000000000000e+00   0.0000000000000000e+00   9.9583373190821374e+02   1.0000000000000001e+03   0.0000000000000000e+00   0.0000000000000000e+00   -9.9583373190821374e+02   9.9999999999999966e+02   8.9616992564506279e+02   3.9709614841770468e+02   -7.1252344578319537e+01   9.9999999999999977e+02   -8.9616992564506279e+02   -3.9709614841770474e+02   7.1252344578319367e+01   1.7705835400569109e-02
1.0000000000000001e+03   0.0000000000000000e+00   0.0000000000000000e+00   9.9583373190821374e+02   1.0000000000000001e+03   0.0000000000000000e+00   0.0000000000000000e+00   -9.9583373190821374e+02   9.9999999999999966e+02   -3.4247551932735433e+02   -3.4338608107639402e+02   -8.5479781311794227e+02   1.0000000000000002e+03   3.4247551932735394e+02   3.4338608107639402e+02   8.5479781311794227e+02   1.5499131180776594e-02
1.0000000000000001e+03   0.0000000000000000e+00   0.0000000000000000e+00   9.9583373190821374e+02   1.0000000000000001e+03   0.0000000000000000e+00   0.0000000000000000e+00   -9.9583373190821374e+02   9.9999999999999966e+02   4.4110094895708892e+02   -8.6734215262347152e+02   1.3795044921420018e+02   1.0000000000000008e+03   -4.4110094895708880e+02   8.6734215262347175e+02   -1.3795044921420055e+02   1.7692851478448405e-02
1.0000000000000001e+03   0.0000000000000000e+00   0.0000000000000000e+00   9.9583373190821374e+02   1.0000000000000001e+03   0.0000000000000000e+00   0.0000000000000000e+00   -9.9583373190821374e+02   1.0000000000000005e+03   6.3359453368321886e+02   2.8270990292614653e+02   -6.9607173552802351e+02   1.0000000000000003e+03   -6.3359453368321840e+02   -2.8270990292614653e+02   6.9607173552802351e+02   1.6886653364759668e-02
1.0000000000000001e+03   0.0000000000000000e+00   0.0000000000000000e+00   9.9583373190821374e+02   1.0000000000000001e+03   0.0000000000000000e+00   0.0000000000000000e+00   -9.9583373190821374e+02   9.9999999999999693e+02   -8.5448807098813211e+02   -1.8309441527238405e+02   -4.4967694510815153e+02   1.0000000000000018e+03   8.5448807098813381e+02   1.8309441527238562e+02   4.4967694510815164e+02   1.7482294971559974e-02
1.0000000000000001e+03   0.0000000000000000e+00   0.0000000000000000e+00   9.9583373190821374e+02   1.0000000000000001e+03   0.0000000000000000e+00   0.0000000000000000e+00   -9.9583373190821374e+02   9.9999999999999670e+02   2.9523504251312261e+02   9.0154202614246196e+02   -2.5678985201517406e+02   1.0000000000000009e+03   -2.9523504251312539e+02   -9.0154202614246026e+02   2.5678985201517975e+02   1.7646471974530103e-02
1.0000000000000001e+03   0.0000000000000000e+00   0.0000000000000000e+00   9.9583373190821374e+02   1.0000000000000001e+03   0.0000000000000000e+00   0.0000000000000000e+00   -9.9583373190821374e+02   9.9999999999999886e+02   -1.9757876660524559e+01   -9.6273894089469343e+02   -1.9653534369571372e+02   9.9999999999999943e+02   1.9757876660524747e+01   9.6273894089469297e+02   1.9653534369571460e+02   1.7674006128723257e-02
1.0000000000000001e+03   0.0000000000000000e+00   0.0000000000000000e+00   9.9583373190821374e+02   1.0000000000000001e+03   0.0000000000000000e+00   0.0000000000000000e+00   -9.9583373190821374e+02   9.9999999999999841e+02   -4.4797302581220669e+02   6.0282342135032115e+02   -6.3388238194708163e+02   9.9999999999999704e+02   4.4797302581221260e+02   -6.0282342135032036e+02   6.3388238194708038e+02   1.7115505065037451e-02
1.0000000000000001e+03   0.0000000000000000e+00   0.0000000000000000e+00   9.9583373190821374e+02   1.0000000000000001e+03   0.0000000000000000e+00   0.0000000000000000e+00   -9.9583373190821374e+02   1.0000000000000000e+03   -8.0506437342095592e+02   5.6000844540695482e+02   -6.4379181790156721e+01   1.0000000000000000e+03   8.0506437342095592e+02   -5.6000844540695482e+02   6.4379181790156764e+01   1.7706690376355739e-02
1.0000000000000001e+03   0.0000000000000000e+00   0.0000000000000000e+00   9.9583373190821374e+02   1.0000000000000001e+03   0.0000000000000000e+00   0.0000000000000000e+00   -9.9583373190821374e+02   9.9999999999999909e+02   2.4518056848381320e+02   -9.3755076418399904e+02   1.6360879176472258e+02   9.9999999999999841e+02   -2.4518056848381241e+02   9.3755076418399881e+02   -1.6360879176472255e+02   1.7685497402832862e-02
1.0000000000000001e+03   0.0000000000000000e+00   0.0000000000000000e+00   9.9583373190821374e+02   1.0000000000000001e+03   0.0000000000000000e+00   0.0000000000000000e+00   -9.9583373190821374e+02   1.0000000000000005e+03   5.8847851397983823e+02   -4.2650377981827262e+02   6.6156658599990385e+02   1.0000000000000000e+03   -5.8847851397983834e+02   4.2650377981827251e+02   -6.6156658599990385e+02   1.7023942629478109e-02
1.0000000000000001e+03   0.0000000000000000e+00   0.0000000000000000e+00   9.9583373190821374e+02   1.0000000000000001e+03   0.0000000000000000e+00   0.0000000000000000e+00   -9.9583373190821374e+02   1.0000000000000000e+03   7.7171626214126798e+02   2.2442803121876915e+02   5.6565789385169739e+02   1.0000000000000003e+03   -7.7171626214126798e+02   -2.2442803121876923e+02   -5.6565789385169785e+02   1.7290424917428607e-02
1.0000000000000001e+03   0.0000000000000000e+00   0.0000000000000000e+00   9.9583373190821374e+02   1.0000000000000001e+03   0.0000000000000000e+00   0.0000000000000000e+00   -9.9583373190821374e+02   9.9999999999999989e+02   2.9027415897152940e+02   3.3738543514162052e+02   -8.7623898801321968e+02   9.9999999999999977e+02   -2.9027415897152940e+02   -3.3738543514162046e+02   8.7623898801321968e+02   1.5083337094808151e-02
1.0000000000000001e+03   0.0000000000000000e+00   0.0000000000000000e+00   9.9583373190821374e+02   1.0000000000000001e+03   0.0000000000000000e+00   0.0000000000000000e+00   -9.9583373190821374e+02   1.0000000000000008e+03   2.3517634109216615e+02   -9.5254711761006490e+02   5.6823064419468800e+01   1.0000000000000005e+03   -2.3517634109216624e+02   9.5254711761006524e+02   -5.6823064419469503e+01   1.7707528814065530e-02
1.0000000000000001e+03   0.0000000000000000e+00   0.0000000000000000e+00   9.9583373190821374e+02   1.0000000000000001e+03   0.0000000000000000e+00   0.0000000000000000e+00   -9.9583373190821374e+02   9.9999999999999966e+02   6.4768748658684297e+02   -1.3399786422314236e+02   7.2693072257899178e+02   9.9999999999999977e+02   -6.4768748658684274e+02   1.3399786422314213e+02   -7.2693072257899178e+02   1.6735332870065039e-02
1.0000000000000001e+03   0.0000000000000000e+00   0.0000000000000000e+00   9.9583373190821374e+02   1.0000000000000001e+03   0.0000000000000000e+00   0.0000000000000000e+00   -9.9583373190821374e+02   1.0000000000000003e+03   8.8922332273741347e+02   -2.0116737228917739e+02   3.6701001887259491e+02   1.0000000000000003e+03   -8.8922332273741347e+02   2.0116737228917739e+02   -3.6701001887259480e+02   1.7569810111184008e-02
1.0000000000000001e+03   0.0000000000000000e+00   0.0000000000000000e+00   9.9583373190821374e+02   1.0000000000000001e+03   0.0000000000000000e+00   0.0000000000000000e+00   -9.9583373190821374e+02   9.9999999999999989e+02   -8.2720589939346860e+02   -1.9062110324273348e+02   -4.9525425625018767e+02   1.0000000000000000e+03   8.2720589939346871e+02   1.9062110324273348e+02   4.9525425625018778e+02   1.7418707685924677e-02
1.0000000000000001e+03   0.0000000000000000e+00   0.0000000000000000e+00   9.9583373190821374e+02   1.0000000000000001e+03   0.0000000000000000e+00   0.0000000000000000e+00   -9.9583373190821374e+02   1.0000000000000009e+03   -6.3695615489972022e+02   -6.2118689821145972e+02   -4.1748829630607725e+02   1.0000000000000005e+03   6.3695615489971965e+02   6.2118689821146006e+02   4.1748829630607753e+02   1.7520131585020957e-02
1.0000000000000001e+03   0.0000000000000000e+00   0.0000000000000000e+00   9.9583373190821374e+02   1.0000000000000001e+03   0.0000000000000000e+00   0.0000000000000000e+00   -9.9583373190821374e+02   1.0000000000000000e+03   8.5373428367726626e+02   -2.1753592396624165e+02   -4.3554411715115566e+02   1.0000000000000001e+03   -8.5373428367726626e+02   2.1753592396624157e+02   4.3554411715115572e+02   1.7499560431187236e-02
1.0000000000000001e+03   0.0000000000000000e+00   0.0000000000000000e+00   9.9583373190821374e+02   1.0000000000000001e+03   0.0000000000000000e+00   0.0000000000000000e+00   -9.9583373190821374e+02   1.0000000000000006e+03   6.2147023692836046e+02   -6.7710725152531768e+02   3.4811391507780758e+02   1.0000000000000006e+03   -6.2147023692836024e+02   6.7710725152531791e+02   -3.4811391507780758e+02   1.7585782799443828e-02
1.0000000000000001e+03   0.0000000000000000e+00   0.0000000000000000e+00   9.9583373190821374e+02   1.0000000000000001e+03   0.0000000000000000e+00   0.0000000000000000e+00   -9.9583373190821374e+02   1.0000000000000000e+03   4.3372115153479263e+02   -2.7435450446586835e+01   8.8148513435955681e+02   9.9999999999999909e+02   -4.3372115153479263e+02   2.7435450446586827e+01   -8.8148513435955670e+02   1.4963324159731941e-02
1.0000000000000001e+03   0.0000000000000000e+00   0.0000000000000000e+00   9.9583373190821374e+02   1.0000000000000001e+03   0.0000000000000000e+00   0.0000000000000000e+00   -9.9583373190821374e+02   9.9999999999999966e+02   4.8681521670225243e+02   -5.5851066522644601e+02   -6.4572406253926465e+02   9.9999999999999966e+02   -4.8681521670225243e+02   5.5851066522644601e+02   6.4572406253926488e+02   1.7078098154752010e-02
1.0000000000000001e+03   0.0000000000000000e+00   0.0000000000000000e+00   9.9583373190821374e+02   1.0000000000000001e+03   0.0000000000000000e+00   0.0000000000000000e+00   -9.9583373190821374e+02   1.0000000000000016e+03   3.7406927798006626e+02   1.2423580947836611e+02   9.0028907704219603e+02   9.9999999999999920e+02   -3.7406927798006660e+02   -1.2423580947836517e+02   -9.0028907704219591e+02   1.4455604252796635e-02
1.0000000000000001e+03   0.0000000000000000e+00   0.0000000000000000e+00   9.9583373190821374e+02   1.0000000000000001e+03   0.0000000000000000e+00   0.0000000000000000e+00   -9.9583373190821374e+02   1.0000000000000007e+03   -9.4307051914310966e+02   -1.1895733027615448e+02   2.4969968526907877e+02   1.0000000000000018e+03   9.4307051914310864e+02   1.1895733027615654e+02   -2.4969968526908227e+02   1.7650179748749713e-02
1.0000000000000001e+03   0.0000000000000000e+00   0.0000000000000000e+00   9.9583373190821374e+02   1.0000000000000001e+03   0.0000000000000000e+00   0.0000000000000000e+00   -9.9583373190821374e+02   9.9999999999999864e+02   4.6491666871968746e+01   -2.7567603976408307e+01   9.8130593366657331e+02   9.9999999999999864e+02   -4.6491666871967006e+01   2.7567603976408886e+01   -9.8130593366657297e+02   1.7464290421324191e-02
1.0000000000000001e+03   0.0000000000000000e+00   0.0000000000000000e+00   9.9583373190821374e+02   1.0000000000000001e+03   0.0000000000000000e+00   0.0000000000000000e+00   -9.9583373190821374e+02   9.9999999999999977e+02   2.2278360921680613e+02   9.4669306248711405e+02   -1.4150085593332375e+02   1.0000000000000001e+03   -2.2278360921680604e+02   -9.4669306248711405e+02   1.4150085593332369e+02   1.7691914717765066e-02
1.0000000000000001e+03   0.0000000000000000e+00   0.0000000000000000e+00   9.9583373190821374e+02   1.0000000000000001e+03   0.0000000000000000e+00   0.0000000000000000e+00   -9.9583373190821374e+02   1.0000000000000001e+03   2.7130948830922631e+02   -6.0628817563756536e+02   7.2435391416228265e+02   1.0000000000000002e+03   -2.7130948830922631e+02   6.0628817563756547e+02   -7.2435391416228265e+02   1.6749214123467034e-02
1.0000000000000001e+03   0.0000000000000000e+00   0.0000000000000000e+00   9.9583373190821374e+02   1.0000000000000001e+03   0.0000000000000000e+00   0.0000000000000000e+00   -9.9583373190821374e+02   1.0000000000000001e+03   -5.8407622128833043e+02   -4.1905292774747124e+02   -6.7017340651399957e+02   1.0000000000000003e+03   5.8407622128833043e+02   4.1905292774747124e+02   6.7017340651400002e+02   1.6992349029866158e-02
1.0000000000000001e+03   0.0000000000000000e+00   0.0000000000000000e+00   9.9583373190821374e+02   1.0000000000000001e+03   0.0000000000000000e+00   0.0000000000000000e+00   -9.9583373190821374e+02   1.0000000000000000e+03   5.6177001658060556e+02   -4.6268331811849151e+02   -6.6047057385825292e+02   1.0000000000000005e+03   -5.6177001658060601e+02   4.6268331811849123e+02   6.6047057385825292e+02   1.7027851634159617e-02
1.0000000000000001e+03   0.0000000000000000e+00   0.0000000000000000e+00   9.9583373190821374e+02   1.0000000000000001e+03   0.0000000000000000e+00   0.0000000000000000e+00   -9.9583373190821374e+02   1.0000000000000015e+03   4.1642079630722122e+02   2.2383220351210088e+01   8.8993005072102687e+02   1.0000000000000015e+03   -4.1642079630722259e+02   -2.2383220351211705e+01   -8.8993005072102687e+02   1.4751587711361341e-02
1.0000000000000001e+03   0.0000000000000000e+00   0.0000000000000000e+00   9.9583373190821374e+02   1.0000000000000001e+03   0.0000000000000000e+00   0.0000000000000000e+00   -9.9583373190821374e+02   9.9999999999999989e+02   -2.0918851846215628e+02   -1.0881073376545912e+02   -9.5408761195594138e+02   9.9999999999999989e+02   2.0918851846215679e+02   1.0881073376545908e+02   9.5408761195594127e+02   1.2051196482015617e-02
1.0000000000000001e+03   0.0000000000000000e+00   0.0000000000000000e+00   9.9583373190821374e+02   1.0000000000000001e+03   0.0000000000000000e+00   0.0000000000000000e+00   -9.9583373190821374e+02   1.0000000000000002e+03   4.8943282958501351e+02   5.4920987866004373e+02   -6.5169532592568748e+02   1.0000000000000000e+03   -4.8943282958501351e+02   -5.4920987866004350e+02   6.5169532592568748e+02   1.7058264762647241e-02
1.0000000000000001e+03   0.0000000000000000e+00   0.0000000000000000e+00   9.9583373190821374e+02   1.0000000000000001e+03   0.0000000000000000e+00   0.0000000000000000e+00   -9.9583373190821374e+02   9.9999999999999864e+02   9.6059848831889076e+02   6.0695979158310386e+01   -1.9861854314295999e+02   9.9999999999999579e+02   -9.6059848831889315e+02   -6.0695979158308425e+01   1.9861854314295746e+02   1.7673198310245629e-02
1.0000000000000001e+03   0.0000000000000000e+00   0.0000000000000000e+00   9.9583373190821374e+02   1.0000000000000001e+03   0.0000000000000000e+00   0.0000000000000000e+00   -9.9583373190821374e+02   1.0000000000000006e+03   -8.5049373923648602e+02   -2.9232393920409947e+02   3.9634567919241783e+02   1.0000000000000002e+03   8.5049373923648602e+02   2.9232393920409964e+02   -3.9634567919241806e+02   1.7542264495125762e-02
1.0000000000000001e+03   0.0000000000000000e+00   0.0000000000000000e+00   9.9583373190821374e+02   1.0000000000000001e+03   0.0000000000000000e+00   0.0000000000000000e+00   -9.9583373190821374e+02   9.9999999999999966e+02   -4.9134080790749260e+02   4.0559336434903531e+02   -7.4830543002680622e+02   9.9999999999999943e+02   4.9134080790749221e+02   -4.0559336434903503e+02   7.4830543002680633e+02   1.6609792384386628e-02
1.0000000000000001e+03   0.0000000000000000e+00   0.0000000000000000e+00   9.9583373190821374e+02   1.0000000000000001e+03   0.0000000000000000e+00   0.0000000000000000e+00   -9.9583373190821374e+02   9.9999999999999943e+02   -7.6867853658766069e+02   7.5465947359324261e+01   6.0771784695314955e+02   9.9999999999999966e+02   7.6867853658766103e+02   -7.5465947359324190e+01   -6.0771784695314966e+02   1.7190030450784814e-02
1.0000000000000001e+03   0.0000000000000000e+00   0.0000000000000000e+00   9.9583373190821374e+02   1.0000000000000001e+03   0.0000000000000000e+00   0.0000000000000000e+00   -9.9583373190821374e+02   9.9999999999999989e+02   7.0565714592907000e+02   -6.7909280390567392e+02   8.2241956503541360e+01   1.0000000000000006e+03   -7.0565714592907000e+02   6.7909280390567426e+02   -8.2241956503541388e+01   1.7704284403410334e-02
1.0000000000000001e+03   0.0000000000000000e+00   0.0000000000000000e+00   9.9583373190821374e+02   1.0000000000000001e+03   0.0000000000000000e+00   0.0000000000000000e+00   -9.9583373190821374e+02   1.0000000000000002e+03   -2.7958589205135610e+02   -4.8387026771503849e+02   8.0844546897981093e+02   1.0000000000000002e+03   2.7958589205135615e+02   4.8387026771503804e+02   -8.0844546897981115e+02   1.6118680343157783e-02
1.0000000000000001e+03   0.0000000000000000e+00   0.0000000000000000e+00   9.9583373190821374e+02   1.0000000000000001e+03   0.0000000000000000e+00   0.0000000000000000e+00   -9.9583373190821374e+02   9.9999999999999966e+02   -8.3822303210553155e+00   -8.4265320389482849e+02   -5.0571543332924500e+02   9.9999999999999966e+02   8.3822303210553724e+00   8.4265320389482861e+02   5.0571543332924415e+02   1.7402193250785146e-02
1.0000000000000001e+03   0.0000000000000000e+00   0.0000000000000000e+00   9.9583373190821374e+02   1.0000000000000001e+03   0.0000000000000000e+00   0.0000000000000000e+00   -9.9583373190821374e+02   9.9999999999999898e+02   2.6146347639519269e+02   8.6325201557160869e+02   3.9027630141946486e+02   1.0000000000000003e+03   -2.6146347639519274e+02   -8.6325201557160847e+02   -3.9027630141946486e+02   1.7548253730748618e-02
1.0000000000000001e+03   0.0000000000000000e+00   0.0000000000000000e+00   9.9583373190821374e+02   1.0000000000000001e+03   0.0000000000000000e+00   0.0000000000000000e+00   -9.9583373190821374e+02   9.9999999999999932e+02   2.9816233134566517e+02   9.3645470070509236e+02   5.8822632220799624e+00   9.9999999999999977e+02   -2.9816233134566517e+02   -9.3645470070509248e+02   -5.8822632220802307e+00   1.7710441617839575e-02
1.0000000000000001e+03   0.0000000000000000e+00   0.0000000000000000e+00   9.9583373190821374e+02   1.0000000000000001e+03   0.0000000000000000e+00   0.0000000000000000e+00   -9.9583373190821374e+02   9.9999999999999955e+02   -2.2919112976180465e+01   3.3769896108571015e+02   -9.2266836364360995e+02   1.0000000000000002e+03   2.2919112976180351e+01   -3.3769896108571032e+02   9.2266836364361018e+02   1.3640775017257682e-02
1.0000000000000001e+03   0.0000000000000000e+00   0.0000000000000000e+00   9.9583373190821374e+02   1.0000000000000001e+03   0.0000000000000000e+00   0.0000000000000000e+00   -9.9583373190821374e+02   9.9999999999999659e+02   -2.8586218556636641e+02   -9.1898256131569997e+02   1.9908954313979197e+02   9.9999999999999318e+02   2.8586218556636339e+02   9.1898256131570531e+02   -1.9908954313979513e+02   1.7673014300605128e-02
1.0000000000000001e+03   0.0000000000000000e+00   0.0000000000000000e+00   9.9583373190821374e+02   1.0000000000000001e+03   0.0000000000000000e+00   0.0000000000000000e+00   -9.9583373190821374e+02   9.9999999999999966e+02   -9.1975843934487079e+02   -2.7780096850769758e+02   -2.0676996512267814e+02   9.9999999999999955e+02   9.1975843934487057e+02   2.7780096850769746e+02   2.0676996512267783e+02   1.7669942075542188e-02
1.0000000000000001e+03   0.0000000000000000e+00   0.0000000000000000e+00   9.9583373190821374e+02   1.0000000000000001e+03   0.0000000000000000e+00   0.0000000000000000e+00   -9.9583373190821374e+02   9.9999999999999909e+02   -8.7115163368562162e+02   -3.8333379934178220e+02   -2.4501594383988322e+02   9.9999999999999909e+02   8.7115163368567164e+02   3.8333379934177469e+02   2.4501594383988214e+02   1.7652557729925456e-02
1.0000000000000001e+03   0.0000000000000000e+00   0.0000000000000000e+00   9.9583373190821374e+02   1.0000000000000001e+03   0.0000000000000000e+00   0.0000000000000000e+00   -9.9583373190821374e+02   1.0000000000000011e+03   2.4525769186824394e+02   9.4346907734500462e+02   1.2489014372634560e+02   1.0000000000000005e+03   -2.4525769186824533e+02   -9.4346907734500439e+02   -1.2489014372634543e+02   1.7696078557480052e-02
1.0000000000000001e+03   0.0000000000000000e+00   0.0000000000000000e+00   9.9583373190821374e+02   1.0000000000000001e+03   0.0000000000000000e+00   0.0000000000000000e+00   -9.9583373190821374e+02   1.0000000000000001e+03   6.2557115322737411e+02   -6.3753845869318206e+02   -4.0998564519218957e+02   9.9999999999999989e+02   -6.2557115322737411e+02   6.3753845869318218e+02   4.0998564519218951e+02   1.7528217952194367e-02
1.0000000000000001e+03   0.0000000000000000e+00   0.0000000000000000e+00   9.9583373190821374e+02   1.0000000000000001e+03   0.0000000000000000e+00   0.0000000000000000e+00   -9.9583373190821374e+02   1.0000000000000005e+03   9.2672176963635150e+02   -3.2720733811765331e+02   -2.2142472287698154e+00   1.0000000000000002e+03   -9.2672176963635150e+02   3.2720733811765331e+02   2.2142472287698154e+00   1.7710468615195662e-02
1.0000000000000001e+03   0.0000000000000000e+00   0.0000000000000000e+00   9.9583373190821374e+02   1.0000000000000001e+03   0.0000000000000000e+00   0.0000000000000000e+00   -9.9583373190821374e+02   1.0000000000000001e+03   -5.2863357947339932e+02   -1.2932797372277707e+02   8.1835420032688955e+02   1.0000000000000001e+03   5.2863357947339921e+02   1.2932797372277716e+02   -8.1835420032688944e+02   1.6009711943407636e-02
1.0000000000000001e+03   0.0000000000000000e+00   0.0000000000000000e+00   9.9583373190821374e+02   1.0000000000000001e+03   0.0000000000000000e+00   0.0000000000000000e+00   -9.9583373190821374e+02   9.9999999999999966e+02   -7.4007581488916276e+02   -3.6949542943055621e+02   5.3070113922322685e+02   9.9999999999999977e+02   7.4007581488916276e+02   3.6949542943055621e+02   -5.3070113922322696e+02   1.7359397984457452e-02
1.0000000000000001e+03   0.0000000000000000e+00   0.0000000000000000e+00   9.9583373190821374e+02   1.0000000000000001e+03   0.0000000000000000e+00   0.0000000000000000e+00   -9.9583373190821374e+02   9.9999999999999989e+02   -4.2068249985639056e+02   6.0126814793676658e+02   6.5374737622267287e+02   9.9999999999999989e+02   4.2068249985639056e+02   -6.0126814793676647e+02   -6.5374737622267298e+02   1.7051290707921451e-02
1.0000000000000001e+03   0.0000000000000000e+00   0.0000000000000000e+00   9.9583373190821374e+02   1.0000000000000001e+03   0.0000000000000000e+00   0.0000000000000000e+00   -9.9583373190821374e+02   9.9999999999999977e+02   -7.5202738879663389e+02   4.1088406125929902e+02   4.8115681230711226e+02   9.9999999999999977e+02   7.5202738879663400e+02   -4.1088406125929902e+02   -4.8115681230711232e+02   1.7439766645923564e-02
1.0000000000000001e+03   0.0000000000000000e+00   0.0000000000000000e+00   9.9583373190821374e+02   1.0000000000000001e+03   0.0000000000000000e+00   0.0000000000000000e+00   -9.9583373190821374e+02   1.0000000000000002e+03   -9.4907095606940925e+02   -1.1099685548729909e+02   2.2984081827253834e+02   1.0000000000000005e+03   9.4907095606940925e+02   1.1099685548729890e+02   -2.2984081827253846e+02   1.7659881664090032e-02
1.0000000000000001e+03   0.0000000000000000e+00   0.0000000000000000e+00   9.9583373190821374e+02   1.0000000000000001e+03   0.0000000000000000e+00   0.0000000000000000e+00   -9.9583373190821374e+02   9.9999999999999841e+02   -6.1757211249758564e+02   -2.0846470789213564e+02   7.3554737084397084e+02   1.0000000000000010e+03   6.1757211249758575e+02   2.0846470789213615e+02   -7.3554737084397141e+02   1.6687042616058960e-02
1.0000000000000001e+03   0.0000000000000000e+00   0.0000000000000000e+00   9.9583373190821374e+02   1.0000000000000001e+03   0.0000000000000000e+00   0.0000000000000000e+00   -9.9583373190821374e+02   1.0000000000000000e+03   -6.2337056432941495e+02   -3.3158614997659834e+02   6.8362456655541882e+02   9.9999999999999989e+02   6.2337056432941495e+02   3.3158614997659828e+02   -6.8362456655541882e+02   1.6939571973319089e-02
1.0000000000000001e+03   0.0000000000000000e+00   0.0000000000000000e+00   9.9583373190821374e+02   1.0000000000000001e+03   0.0000000000000000e+00   0.0000000000000000e+00   -9.9583373190821374e+02   9.9999999999999989e+02   6.4549794877522288e+01   -9.7553426015617265e+02   1.0024477327810493e+02   9.9999999999999966e+02   -6.4549794877522373e+01   9.7553426015617288e+02   -1.0024477327810511e+02   1.7701249111997854e-02
1.0000000000000001e+03   0.0000000000000000e+00   0.0000000000000000e+00   9.9583373190821374e+02   1.0000000000000001e+03   0.0000000000000000e+00   0.0000000000000000e+00   -9.9583373190821374e+02   1.0000000000000005e+03   2.1226704378570581e+01   2.1891936842032155e+02   9.5786560668938989e+02   9.9999999999999977e+02   -2.1226704378570659e+01   -2.1891936842032214e+02   -9.5786560668938989e+02   1.1882462521251769e-02
1.0000000000000001e+03   0.0000000000000000e+00   0.0000000000000000e+00   9.9583373190821374e+02   1.0000000000000001e+03   0.0000000000000000e+00   0.0000000000000000e+00   -9.9583373190821374e+02   1.0000000000000005e+03   -4.2912257307369981e+02   4.5717694904227488e+02   7.5678652067129576e+02   1.0000000000000000e+03   4.2912257307369958e+02   -4.5717694904227488e+02   -7.5678652067129565e+02   1.6554220189969146e-02
1.0000000000000001e+03   0.0000000000000000e+00   0.0000000000000000e+00   9.9583373190821374e+02   1.0000000000000001e+03   0.0000000000000000e+00   0.0000000000000000e+00   -9.9583373190821374e+02   1.0000000000000000e+03   3.0343923112619615e+02   -8.8088309395562692e+02   -3.1281366837698442e+02   1.0000000000000005e+03   -3.0343923112619632e+02   8.8088309395562680e+02   3.1281366837698437e+02   1.7612282196459335e-02
1.0000000000000001e+03   0.0000000000000000e+00   0.0000000000000000e+00   9.9583373190821374e+02   1.0000000000000001e+03   0.0000000000000000e+00   0.0000000000000000e+00   -9.9583373190821374e+02   1.0000000000000000e+03   2.4020991268999765e+01   6.5216097602844371e+01   -9.8033292096036007e+02   1.0000000000000000e+03   -2.4020991268999811e+01   -6.5216097602844343e+01   9.8033292096036007e+02   1.6348130310938427e-02
1.0000000000000001e+03   0.0000000000000000e+00   0.0000000000000000e+00   9.9583373190821374e+02   1.0000000000000001e+03   0.0000000000000000e+00   0.0000000000000000e+00   -9.9583373190821374e+02   9.9999999999999977e+02   3.5010795863775058e+02   -9.0747393504657293e+02   1.4070628214957574e+02   9.9999999999999966e+02   -3.5010795863775053e+02   9.0747393504657282e+02   -1.4070628214957586e+02   1.7692126589736529e-02
1.0000000000000001e+03   0.0000000000000000e+00   0.0000000000000000e+00   9.9583373190821374e+02   1.0000000000000001e+03   0.0000000000000000e+00   0.0000000000000000e+00   -9.9583373190821374e+02   1.0000000000000000e+03   -1.2188601500876756e+02   -2.0917186781565059e+02   -9.5250916656300751e+02   1.0000000000000000e+03   1.2188601500876776e+02   2.0917186781565064e+02   9.5250916656300751e+02   1.2130479109154253e-02
1.0000000000000001e+03   0.0000000000000000e+00   0.0000000000000000e+00   9.9583373190821374e+02   1.0000000000000001e+03   0.0000000000000000e+00   0.0000000000000000e+00   -9.9583373190821374e+02   1.0000000000000002e+03   -9.3416757222907165e+02   3.0310781553922322e+02   -3.6597574802750842e+01   1.0000000000000003e+03   9.3416757222907165e+02   -3.0310781553922328e+02   3.6597574802750799e+01   1.7709253969865318e-02
1.0000000000000001e+03   0.0000000000000000e+00   0.0000000000000000e+00   9.9583373190821374e+02   1.0000000000000001e+03   0.0000000000000000e+00   0.0000000000000000e+00   -9.9583373190821374e+02   9.9999999999999943e+02   8.2637230498037027e+01   9.7623663409003552e+02   -7.7562269970213137e+01   1.0000000000000007e+03   -8.2637230498037113e+01   -9.7623663409003552e+02   7.7562269970213137e+01   1.7704972636863114e-02
1.0000000000000001e+03   0.0000000000000000e+00   0.0000000000000000e+00   9.9583373190821374e+02   1.0000000000000001e+03   0.0000000000000000e+00   0.0000000000000000e+00   -9.9583373190821374e+02   9.9999999999999943e+02   -8.9390208205464694e+02   -2.7443032046781184e+02   -3.0250595073991718e+02   1.0000000000000011e+03   8.9390208205464751e+02   2.7443032046781207e+02   3.0250595073991718e+02   1.7619260759968069e-02
1.0000000000000001e+03   0.0000000000000000e+00   0.0000000000000000e+00   9.9583373190821374e+02   1.0000000000000001e+03   0.0000000000000000e+00   0.0000000000000000e+00   -9.9583373190821374e+02   1.0000000000000015e+03   7.9219863501404075e+02   -2.4725640215849594e+02   -5.2646783149617784e+02   1.0000000000000006e+03   -7.9219863501404075e+02   2.4725640215849589e+02   5.2646783149617806e+02   1.7367001221502192e-02
1.0000000000000001e+03   0.0000000000000000e+00   0.0000000000000000e+00   9.9583373190821374e+02   1.0000000000000001e+03   0.0000000000000000e+00   0.0000000000000000e+00   -9.9583373190821374e+02   1.0000000000000001e+03   -6.0860000427083264e+02   -2.5498105217723383e+02   -7.2833610452791265e+02   1.0000000000000002e+03   6.0860000427083253e+02   2.5498105217723366e+02   7.2833610452791265e+02   1.6727656069079496e-02
1.0000000000000001e+03   0.0000000000000000e+00   0.0000000000000000e+00   9.9583373190821374e+02   1.0000000000000001e+03   0.0000000000000000e+00   0.0000000000000000e+00   -9.9583373190821374e+02   1.0000000000000002e+03   1.8916915073684692e+02   7.9329460270202571e+02   5.4843549215937526e+02   1.0000000000000002e+03   -1.8916915073684697e+02   -7.9329460270202571e+02   -5.4843549215937526e+02   1.7325847942997123e-02
1.0000000000000001e+03   0.0000000000000000e+00   0.0000000000000000e+00   9.9583373190821374e+02   1.0000000000000001e+03   0.0000000000000000e+00   0.0000000000000000e+00   -9.9583373190821374e+02   1.0000000000000002e+03   -4.2430331385192102e+02   3.2224582848018815e+02   8.2583721592584789e+02   1.0000000000000002e+03   4.2430331385192142e+02   -3.2224582848018758e+02   -8.2583721592584800e+02   1.5920152245541545e-02
1.0000000000000001e+03   0.0000000000000000e+00   0.0000000000000000e+00   9.9583373190821374e+02   1.0000000000000001e+03   0.0000000000000000e+00   0.0000000000000000e+00   -9.9583373190821374e+02   9.9999999999997681e+02   -1.1523508461362061e+02   1.7694292338135372e+02   9.5984106000219242e+02   1.0000000000000064e+03   1.1523508461362100e+02   -1.7694292338135139e+02   -9.5984106000218890e+02   1.1813062946465386e-02
1.0000000000000001e+03   0.0000000000000000e+00   0.0000000000000000e+00   9.9583373190821374e+02   1.0000000000000001e+03   0.0000000000000000e+00   0.0000000000000000e+00   -9.9583373190821374e+02   1.0000000000000000e+03   7.3416994108855829e+02   4.7770596631022329e+02   4.4572894305889474e+02   9.9999999999999977e+02   -7.3416994108855829e+02   -4.7770596631022329e+02   -4.4572894305889474e+02   1.7487225563078537e-02
1.0000000000000001e+03   0.0000000000000000e+00   0.0000000000000000e+00   9.9583373190821374e+02   1.0000000000000001e+03   0.0000000000000000e+00   0.0000000000000000e+00   -9.9583373190821374e+02   9.9999999999999807e+02   -4.2035545599232790e+02   -5.0607204771601141e+02   7.3011996032485126e+02   9.9999999999999704e+02   4.2035545599232802e+02   5.0607204771601289e+02   -7.3011996032485388e+02   1.6717802011118860e-02
1.0000000000000001e+03   0.0000000000000000e+00   0.0000000000000000e+00   9.9583373190821374e+02   1.0000000000000001e+03   0.0000000000000000e+00   0.0000000000000000e+00   -9.9583373190821374e+02   1.0000000000000033e+03   -2.9413007786408258e+02   7.1464446889142539e+02   -6.0716848049394616e+02   1.0000000000000040e+03   2.9413007786408008e+02   -7.1464446889142278e+02   6.0716848049394525e+02   1.7191486257182004e-02
1.0000000000000001e+03   0.0000000000000000e+00   0.0000000000000000e+00   9.9583373190821374e+02   1.0000000000000001e+03   0.0000000000000000e+00   0.0000000000000000e+00   -9.9583373190821374e+02   1.0000000000000002e+03   6.5391244274874691e+02   2.0640532866385047e+02   7.0404413273906039e+02   1.0000000000000000e+03   -6.5391244274874691e+02   -2.0640532866385047e+02   -7.0404413273906027e+02   1.6850481696926406e-02
1.0000000000000001e+03   0.0000000000000000e+00   0.0000000000000000e+00   9.9583373190821374e+02   1.0000000000000001e+03   0.0000000000000000e+00   0.0000000000000000e+00   -9.9583373190821374e+02   1.0000000000000003e+03   -3.7837968610280581e+02   9.0306815290455620e+02   8.4731975552658128e+01   1.0000000000000002e+03   3.7837968610280569e+02   -9.0306815290455631e+02   -8.4731975552657900e+01   1.7703901339462091e-02
1.0000000000000001e+03   0.0000000000000000e+00   0.0000000000000000e+00   9.9583373190821374e+02   1.0000000000000001e+03   0.0000000000000000e+00   0.0000000000000000e+00   -9.9583373190821374e+02   1.0000000000000022e+03   -7.8211593146855421e+02   5.9509322251316280e+02   -6.4427935509485312e+00   9.9999999999999875e+02   7.8211593146855250e+02   -5.9509322251316178e+02   6.4427935509491281e+00   1.7710435337320887e-02
1.0000000000000001e+03   0.0000000000000000e+00   0.0000000000000000e+00   9.9583373190821374e+02   1.0000000000000001e+03   0.0000000000000000e+00   0.0000000000000000e+00   -9.9583373190821374e+02   1.0000000000000000e+03   -3.3403000591589569e+02   3.9808364378121780e+02   -8.3416793934342525e+02   1.0000000000000001e+03   3.3403000591589569e+02   -3.9808364378121775e+02   8.3416793934342525e+02   1.5812126879207852e-02
1.0000000000000001e+03   0.0000000000000000e+00   0.0000000000000000e+00   9.9583373190821374e+02   1.0000000000000001e+03   0.0000000000000000e+00   0.0000000000000000e+00   -9.9583373190821374e+02   1.0000000000000010e+03   -3.2297309447918025e+02   -5.9823524962841896e+02   -7.0970821445952379e+02   9.9999999999999943e+02   3.2297309447918013e+02   5.9823524962841896e+02   7.0970821445952356e+02   1.6823613569136114e-02
