1.0000000000000001e+03   0.0000000000000000e+00   0.0000000000000000e+00   9.9680857172652770e+02   1.0000000000000001e+03   0.0000000000000000e+00   0.0000000000000000e+00   -9.9680857172652770e+02   9.5414746993174037e+02   1.9221133231846954e+02   7.7080973866532088e+02   -3.4578843327576647e+02   1.0458525300682597e+03   -1.9221133231846957e+02   -7.7080973866532099e+02   3.4578843327576635e+02   3.0400867904804965e-02
1.0000000000000001e+03   0.0000000000000000e+00   0.0000000000000000e+00   9.9680857172652770e+02   1.0000000000000001e+03   0.0000000000000000e+00   0.0000000000000000e+00   -9.9680857172652770e+02   9.5414746993174026e+02   -4.8850759096216058e+02   -6.7716868966115021e+02   2.3122584067356664e+02   1.0458525300682595e+03   4.8850759096216069e+02   6.7716868966115044e+02   -2.3122584067356664e+02   3.2645201041314194e-02
1.0000000000000001e+03   0.0000000000000000e+00   0.0000000000000000e+00   9.9680857172652770e+02   1.0000000000000001e+03   0.0000000000000000e+00   0.0000000000000000e+00   -9.9680857172652770e+02   9.5414746993173878e+02   -4.1695187683967697e+02   4.8600627193485411e+02   -5.8361933323023470e+02   1.0458525300682611e+03   4.1695187683967674e+02   -4.8600627193485411e+02   5.8361933323023470e+02   3.0675502832482899e-02
1.0000000000000001e+03   0.0000000000000000e+00   0.0000000000000000e+00   9.9680857172652770e+02   1.0000000000000001e+03   0.0000000000000000e+00   0.0000000000000000e+00   -9.9680857172652770e+02   9.5414746993174037e+02   7.8156086079660497e+02   1.0480014636954451e+02   -3.5894573443912435e+02   1.0458525300682595e+03   -7.8156086079660497e+02   -1.0480014636954451e+02   3.5894573443912424e+02   3.0397054712511265e-02
1.0000000000000001e+03   0.0000000000000000e+00   0.0000000000000000e+00   9.9680857172652770e+02   1.0000000000000001e+03   0.0000000000000000e+00   0.0000000000000000e+00   -9.9680857172652770e+02   9.5414746993174049e+02   7.8969430008385632e+02   -3.5295628115580314e+02   -4.9671582297961670e+01   1.0458525300682595e+03   -7.8969430008385643e+02   3.5295628115580342e+02   4.9671582297962736e+01   3.1062401938797297e-02
1.0000000000000001e+03   0.0000000000000000e+00   0.0000000000000000e+00   9.9680857172652770e+02   1.0000000000000001e+03   0.0000000000000000e+00   0.0000000000000000e+00   -9.9680857172652770e+02   9.5414746993174049e+02   -3.2461748444578211e+02   7.7031093382075596e+02   -2.2783117457568659e+02   1.0458525300682593e+03   3.2461748444578211e+02   -7.7031093382075619e+02   2.2783117457568659e+02   3.0533285467575961e-02
1.0000000000000001e+03   0.0000000000000000e+00   0.0000000000000000e+00   9.9680857172652770e+02   1.0000000000000001e+03   0.0000000000000000e+00   0.0000000000000000e+00   -9.9680857172652770e+02   9.5414746993174037e+02   2.0355055087511883e+02   -8.3805747329201756e+02   8.3002016710950429e+01   1.0458525300682595e+03   -2.0355055087511866e+02   8.3805747329201756e+02   -8.3002016710950429e+01   3.1703140718391323e-02
1.0000000000000001e+03   0.0000000000000000e+00   0.0000000000000000e+00   9.9680857172652770e+02   1.0000000000000001e+03   0.0000000000000000e+00   0.0000000000000000e+00   -9.9680857172652770e+02   9.5414746993174037e+02   -2.3517992784327100e+02   8.0871833824224575e+02   -2.0329176326301288e+02   1.0458525300682595e+03   2.3517992784327095e+02   -8.0871833824224575e+02   2.0329176326301288e+02   3.0582875553995938e-02
1.0000000000000001e+03   0.0000000000000000e+00   0.0000000000000000e+00   9.9680857172652770e+02   1.0000000000000001e+03   0.0000000000000000e+00   0.0000000000000000e+00   -9.9680857172652770e+02   9.5414746993174219e+02   -3.2165746446532967e+02   -2.4478884511440430e+02   -7.6634025533149577e+02   1.0458525300682579e+03   3.2165746446532933e+02   2.4478884511440546e+02   7.6634025533149338e+02   3.1384967004435230e-02
1.0000000000000001e+03   0.0000000000000000e+00   0.0000000000000000e+00   9.9680857172652770e+02   1.0000000000000001e+03   0.0000000000000000e+00   0.0000000000000000e+00   -9.9680857172652770e+02   9.5414746993174026e+02   -2.7594849957571881e+02   3.5902660255047579e+02   7.3865744044396058e+02   1.0458525300682597e+03   2.7594849957571881e+02   -3.5902660255047590e+02   -7.3865744044396035e+02   3.5267420201758097e-02
1.0000000000000001e+03   0.0000000000000000e+00   0.0000000000000000e+00   9.9680857172652770e+02   1.0000000000000001e+03   0.0000000000000000e+00   0.0000000000000000e+00   -9.9680857172652770e+02   9.5414746993174037e+02   6.5622562244893970e+01   -5.1916327656882345e+02   -6.9052564157096208e+02   1.0458525300682595e+03   -6.5622562244893885e+01   5.1916327656882345e+02   6.9052564157096208e+02   3.1037721210658880e-02
1.0000000000000001e+03   0.0000000000000000e+00   0.0000000000000000e+00   9.9680857172652770e+02   1.0000000000000001e+03   0.0000000000000000e+00   0.0000000000000000e+00   -9.9680857172652770e+02   9.5414746993174015e+02   3.7851632172048141e+02   6.2807932999203172e+02   -4.6141547384998717e+02   1.0458525300682597e+03   -3.7851632172048102e+02   -6.2807932999203092e+02   4.6141547384998842e+02   3.0443281359056822e-02
1.0000000000000001e+03   0.0000000000000000e+00   0.0000000000000000e+00   9.9680857172652770e+02   1.0000000000000001e+03   0.0000000000000000e+00   0.0000000000000000e+00   -9.9680857172652770e+02   9.5414746993174037e+02   -6.8502426258112934e+01   -2.2697537647932984e+02   -8.3333791834349495e+02   1.0458525300682597e+03   6.8502426258112934e+01   2.2697537647932992e+02   8.3333791834349472e+02   3.1754422231228728e-02
1.0000000000000001e+03   0.0000000000000000e+00   0.0000000000000000e+00   9.9680857172652770e+02   1.0000000000000001e+03   0.0000000000000000e+00   0.0000000000000000e+00   -9.9680857172652770e+02   9.5414746993174003e+02   -1.2296686618660971e+02   8.5733157928599041e+02   -2.2895481202332189e+01   1.0458525300682600e+03   1.2296686618661144e+02   -8.5733157928599007e+02   2.2895481202332082e+01   3.1175236541308597e-02
1.0000000000000001e+03   0.0000000000000000e+00   0.0000000000000000e+00   9.9680857172652770e+02   1.0000000000000001e+03   0.0000000000000000e+00   0.0000000000000000e+00   -9.9680857172652770e+02   9.5414746993174072e+02   -7.7225623989719099e+02   -7.2300075969687057e+01   -3.8607705064517961e+02   1.0458525300682593e+03   7.7225623989719054e+02   7.2300075969687285e+01   3.8607705064517944e+02   3.0396179000713335e-02
1.0000000000000001e+03   0.0000000000000000e+00   0.0000000000000000e+00   9.9680857172652770e+02   1.0000000000000001e+03   0.0000000000000000e+00   0.0000000000000000e+00   -9.9680857172652770e+02   9.5414746993174037e+02   4.0948106158537740e+02   -7.1562501878707258e+02   2.6621153763344773e+02   1.0458525300682595e+03   -4.0948106158537746e+02   7.1562501878707292e+02   -2.6621153763344773e+02   3.2897837635807878e-02
1.0000000000000001e+03   0.0000000000000000e+00   0.0000000000000000e+00   9.9680857172652770e+02   1.0000000000000001e+03   0.0000000000000000e+00   0.0000000000000000e+00   -9.9680857172652770e+02   9.5414746993174003e+02   5.9352261913419443e+02   -4.6205658837155318e+02   4.2999662765977376e+02   1.0458525300682600e+03   -5.9352261913419454e+02   4.6205658837155318e+02   -4.2999662765977359e+02   3.4180346131619160e-02
1.0000000000000001e+03   0.0000000000000000e+00   0.0000000000000000e+00   9.9680857172652770e+02   1.0000000000000001e+03   0.0000000000000000e+00   0.0000000000000000e+00   -9.9680857172652770e+02   9.5414746993173878e+02   -3.3734234160236298e+02   5.9768654585957211e+02   5.2880377035431297e+02   1.0458525300682611e+03   3.3734234160236116e+02   -5.9768654585957449e+02   -5.2880377035431070e+02   3.4949618893299866e-02
1.0000000000000001e+03   0.0000000000000000e+00   0.0000000000000000e+00   9.9680857172652770e+02   1.0000000000000001e+03   0.0000000000000000e+00   0.0000000000000000e+00   -9.9680857172652770e+02   9.5414746993174049e+02   1.9535356058379114e+02   8.4367124675516288e+02   -2.6801191131637403e+01   1.0458525300682595e+03   -1.9535356058379114e+02   -8.4367124675516288e+02   2.6801191131637395e+01   3.1158248585007833e-02
1.0000000000000001e+03   0.0000000000000000e+00   0.0000000000000000e+00   9.9680857172652770e+02   1.0000000000000001e+03   0.0000000000000000e+00   0.0000000000000000e+00   -9.9680857172652770e+02   9.5414746993174128e+02   4.6795662496096230e+02   -7.2664211482537576e+02   -6.0583200621152542e+01   1.0458525300682586e+03   -4.6795662496096242e+02   7.2664211482537542e+02   6.0583200621151015e+01   3.1018869027765739e-02
1.0000000000000001e+03   0.0000000000000000e+00   0.0000000000000000e+00   9.9680857172652770e+02   1.0000000000000001e+03   0.0000000000000000e+00   0.0000000000000000e+00   -9.9680857172652770e+02   9.5414746993174072e+02   -2.0036778925719861e+02   8.1879431325818632e+02   2.0022764965031462e+02   1.0458525300682593e+03   2.0036778925719884e+02   -8.1879431325818621e+02   -2.0022764965031450e+02   3.2430273047758570e-02
1.0000000000000001e+03   0.0000000000000000e+00   0.0000000000000000e+00   9.9680857172652770e+02   1.0000000000000001e+03   0.0000000000000000e+00   0.0000000000000000e+00   -9.9680857172652770e+02   9.5414746993174049e+02   4.1260497384756559e+02   -7.4155518091089539e+02   -1.7468697518907857e+02   1.0458525300682595e+03   -4.1260497384756559e+02   7.4155518091089539e+02   1.7468697518907857e+02   3.0650167949601816e-02
1.0000000000000001e+03   0.0000000000000000e+00   0.0000000000000000e+00   9.9680857172652770e+02   1.0000000000000001e+03   0.0000000000000000e+00   0.0000000000000000e+00   -9.9680857172652770e+02   9.5414746993174037e+02   7.9004260173351588e+02   3.5007074580020543e+02   -6.2814412846703497e+01   1.0458525300682595e+03   -7.9004260173351588e+02   -3.5007074580020549e+02   6.2814412846703334e+01   3.1010142982386683e-02
1.0000000000000001e+03   0.0000000000000000e+00   0.0000000000000000e+00   9.9680857172652770e+02   1.0000000000000001e+03   0.0000000000000000e+00   0.0000000000000000e+00   -9.9680857172652770e+02   9.5414746993174026e+02   -3.0191846722000133e+02   -3.0272119731913131e+02   -7.5356990778921613e+02   1.0458525300682597e+03   3.0191846722000099e+02   3.0272119731913131e+02   7.5356990778921613e+02   3.1321213613796722e-02
1.0000000000000001e+03   0.0000000000000000e+00   0.0000000000000000e+00   9.9680857172652770e+02   1.0000000000000001e+03   0.0000000000000000e+00   0.0000000000000000e+00   -9.9680857172652770e+02   9.5414746993174003e+02   3.8886435637788134e+02   -7.6462870627862435e+02   1.2161391348749545e+02   1.0458525300682600e+03   -3.8886435637788122e+02   7.6462870627862458e+02   -1.2161391348749578e+02   3.1926848884762660e-02
1.0000000000000001e+03   0.0000000000000000e+00   0.0000000000000000e+00   9.9680857172652770e+02   1.0000000000000001e+03   0.0000000000000000e+00   0.0000000000000000e+00   -9.9680857172652770e+02   9.5414746993174049e+02   5.5856223190586979e+02   2.4923048726817410e+02   -6.1364068263492140e+02   1.0458525300682595e+03   -5.5856223190586934e+02   -2.4923048726817410e+02   6.1364068263492140e+02   3.0762192858787687e-02
1.0000000000000001e+03   0.0000000000000000e+00   0.0000000000000000e+00   9.9680857172652770e+02   1.0000000000000001e+03   0.0000000000000000e+00   0.0000000000000000e+00   -9.9680857172652770e+02   9.5414746993173867e+02   -7.5329684631828468e+02   -1.6141178594065229e+02   -3.9642475549166056e+02   1.0458525300682616e+03   7.5329684631828616e+02   1.6141178594065366e+02   3.9642475549166068e+02   3.0398328422617780e-02
1.0000000000000001e+03   0.0000000000000000e+00   0.0000000000000000e+00   9.9680857172652770e+02   1.0000000000000001e+03   0.0000000000000000e+00   0.0000000000000000e+00   -9.9680857172652770e+02   9.5414746993173878e+02   2.6027235955511532e+02   7.9477852081792923e+02   -2.2637997212281314e+02   1.0458525300682611e+03   -2.6027235955511782e+02   -7.9477852081792776e+02   2.2637997212281812e+02   3.0536008296717401e-02
1.0000000000000001e+03   0.0000000000000000e+00   0.0000000000000000e+00   9.9680857172652770e+02   1.0000000000000001e+03   0.0000000000000000e+00   0.0000000000000000e+00   -9.9680857172652770e+02   9.5414746993174026e+02   -1.7418085381938013e+01   -8.4872830016821933e+02   -1.7326099640555142e+02   1.0458525300682597e+03   1.7418085381938180e+01   8.4872830016821888e+02   1.7326099640555222e+02   3.0653788771489807e-02
1.0000000000000001e+03   0.0000000000000000e+00   0.0000000000000000e+00   9.9680857172652770e+02   1.0000000000000001e+03   0.0000000000000000e+00   0.0000000000000000e+00   -9.9680857172652770e+02   9.5414746993174106e+02   -3.9492261979709048e+02   5.3143513362903718e+02   -5.5881599225285345e+02   1.0458525300682591e+03   3.9492261979709571e+02   -5.3143513362903650e+02   5.5881599225285231e+02   3.0612716046274507e-02
1.0000000000000001e+03   0.0000000000000000e+00   0.0000000000000000e+00   9.9680857172652770e+02   1.0000000000000001e+03   0.0000000000000000e+00   0.0000000000000000e+00   -9.9680857172652770e+02   9.5414746993174049e+02   -7.0972606192138926e+02   4.9369044479325805e+02   -5.6755192094132958e+01   1.0458525300682595e+03   7.0972606192138926e+02   -4.9369044479325805e+02   5.6755192094132994e+01   3.1033978993005053e-02
1.0000000000000001e+03   0.0000000000000000e+00   0.0000000000000000e+00   9.9680857172652770e+02   1.0000000000000001e+03   0.0000000000000000e+00   0.0000000000000000e+00   -9.9680857172652770e+02   9.5414746993174072e+02   2.1614549727277111e+02   -8.2652298832725739e+02   1.4423371261788191e+02   1.0458525300682593e+03   -2.1614549727277043e+02   8.2652298832725705e+02   -1.4423371261788188e+02   3.2065279589247625e-02
1.0000000000000001e+03   0.0000000000000000e+00   0.0000000000000000e+00   9.9680857172652770e+02   1.0000000000000001e+03   0.0000000000000000e+00   0.0000000000000000e+00   -9.9680857172652770e+02   9.5414746993174060e+02   5.1878899631032903e+02   -3.7599583094050558e+02   5.8322174385299616e+02   1.0458525300682593e+03   -5.1878899631032914e+02   3.7599583094050553e+02   -5.8322174385299616e+02   3.5310924641821943e-02
1.0000000000000001e+03   0.0000000000000000e+00   0.0000000000000000e+00   9.9680857172652770e+02   1.0000000000000001e+03   0.0000000000000000e+00   0.0000000000000000e+00   -9.9680857172652770e+02   9.5414746993174026e+02   6.8032714119847003e+02   1.9785054219307906e+02   4.9867086738937570e+02   1.0458525300682595e+03   -6.8032714119847003e+02   -1.9785054219307912e+02   -4.9867086738937610e+02   3.4724155593184813e-02
1.0000000000000001e+03   0.0000000000000000e+00   0.0000000000000000e+00   9.9680857172652770e+02   1.0000000000000001e+03   0.0000000000000000e+00   0.0000000000000000e+00   -9.9680857172652770e+02   9.5414746993174060e+02   2.5589895979247953e+02   2.9743116716890324e+02   -7.7247194981689904e+02   1.0458525300682595e+03   -2.5589895979247953e+02   -2.9743116716890319e+02   7.7247194981689904e+02   3.1416336505442573e-02
1.0000000000000001e+03   0.0000000000000000e+00   0.0000000000000000e+00   9.9680857172652770e+02   1.0000000000000001e+03   0.0000000000000000e+00   0.0000000000000000e+00   -9.9680857172652770e+02   9.5414746993174049e+02   2.0732600265388868e+02   -8.3974342536514939e+02   5.0093894436498253e+01   1.0458525300682593e+03   -2.0732600265388879e+02   8.3974342536514973e+02   -5.0093894436498864e+01   3.1525406216534511e-02
1.0000000000000001e+03   0.0000000000000000e+00   0.0000000000000000e+00   9.9680857172652770e+02   1.0000000000000001e+03   0.0000000000000000e+00   0.0000000000000000e+00   -9.9680857172652770e+02   9.5414746993174037e+02   5.7098625201575373e+02   -1.1812940631921443e+02   6.4084524922318258e+02   1.0458525300682595e+03   -5.7098625201575351e+02   1.1812940631921423e+02   -6.4084524922318258e+02   3.5570654868465112e-02
1.0000000000000001e+03   0.0000000000000000e+00   0.0000000000000000e+00   9.9680857172652770e+02   1.0000000000000001e+03   0.0000000000000000e+00   0.0000000000000000e+00   -9.9680857172652770e+02   9.5414746993174049e+02   7.8391863787652869e+02   -1.7734448528033127e+02   3.2354751244710985e+02   1.0458525300682595e+03   -7.8391863787652869e+02   1.7734448528033127e+02   -3.2354751244710974e+02   3.3331981041159697e-02
1.0000000000000001e+03   0.0000000000000000e+00   0.0000000000000000e+00   9.9680857172652770e+02   1.0000000000000001e+03   0.0000000000000000e+00   0.0000000000000000e+00   -9.9680857172652770e+02   9.5414746993174049e+02   -7.2924551720001057e+02   -1.6804713932215626e+02   -4.3660465491057198e+02   1.0458525300682595e+03   7.2924551720001068e+02   1.6804713932215626e+02   4.3660465491057209e+02   3.0419706897060736e-02
1.0000000000000001e+03   0.0000000000000000e+00   0.0000000000000000e+00   9.9680857172652770e+02   1.0000000000000001e+03   0.0000000000000000e+00   0.0000000000000000e+00   -9.9680857172652770e+02   9.5414746993174060e+02   -5.6152575912981172e+02   -5.4762394851902889e+02   -3.6804798997191500e+02   1.0458525300682593e+03   5.6152575912981115e+02   5.4762394851902923e+02   3.6804798997191534e+02   3.0395711079550247e-02
1.0000000000000001e+03   0.0000000000000000e+00   0.0000000000000000e+00   9.9680857172652770e+02   1.0000000000000001e+03   0.0000000000000000e+00   0.0000000000000000e+00   -9.9680857172652770e+02   9.5414746993174037e+02   7.5263232492430677e+02   -1.9177462044052317e+02   -3.8396558246042929e+02   1.0458525300682595e+03   -7.5263232492430677e+02   1.9177462044052308e+02   3.8396558246042929e+02   3.0395909004597613e-02
1.0000000000000001e+03   0.0000000000000000e+00   0.0000000000000000e+00   9.9680857172652770e+02   1.0000000000000001e+03   0.0000000000000000e+00   0.0000000000000000e+00   -9.9680857172652770e+02   9.5414746993174049e+02   5.4787373335409916e+02   -5.9692203380139028e+02   3.0688914601742329e+02   1.0458525300682595e+03   -5.4787373335409893e+02   5.9692203380139063e+02   -3.0688914601742329e+02   3.3203547360964765e-02
1.0000000000000001e+03   0.0000000000000000e+00   0.0000000000000000e+00   9.9680857172652770e+02   1.0000000000000001e+03   0.0000000000000000e+00   0.0000000000000000e+00   -9.9680857172652770e+02   9.5414746993174083e+02   3.8235849829345574e+02   -2.4186456195738362e+01   7.7709683064577951e+02   1.0458525300682591e+03   -3.8235849829345574e+02   2.4186456195738355e+01   -7.7709683064577939e+02   3.4532735158828008e-02
1.0000000000000001e+03   0.0000000000000000e+00   0.0000000000000000e+00   9.9680857172652770e+02   1.0000000000000001e+03   0.0000000000000000e+00   0.0000000000000000e+00   -9.9680857172652770e+02   9.5414746993174037e+02   4.2916499355864289e+02   -4.9237003655730643e+02   -5.6925534295658360e+02   1.0458525300682595e+03   -4.2916499355864289e+02   4.9237003655730643e+02   5.6925534295658372e+02   3.0638168460212851e-02
1.0000000000000001e+03   0.0000000000000000e+00   0.0000000000000000e+00   9.9680857172652770e+02   1.0000000000000001e+03   0.0000000000000000e+00   0.0000000000000000e+00   -9.9680857172652770e+02   9.5414746993174151e+02   3.2977079139452962e+02   1.0952340548374038e+02   7.9367394997852909e+02   1.0458525300682586e+03   -3.2977079139452991e+02   -1.0952340548373955e+02   -7.9367394997852898e+02   3.3994740584865686e-02
1.0000000000000001e+03   0.0000000000000000e+00   0.0000000000000000e+00   9.9680857172652770e+02   1.0000000000000001e+03   0.0000000000000000e+00   0.0000000000000000e+00   -9.9680857172652770e+02   9.5414746993174003e+02   -8.3138907615729306e+02   -1.0487002075973297e+02   2.2012944571870725e+02   1.0458525300682600e+03   8.3138907615729215e+02   1.0487002075973479e+02   -2.2012944571871031e+02   3.2567262338227626e-02
1.0000000000000001e+03   0.0000000000000000e+00   0.0000000000000000e+00   9.9680857172652770e+02   1.0000000000000001e+03   0.0000000000000000e+00   0.0000000000000000e+00   -9.9680857172652770e+02   9.5414746993174049e+02   4.0985974203519056e+01   -2.4302959679665577e+01   8.6509652996047123e+02   1.0458525300682595e+03   -4.0985974203517529e+01   2.4302959679666088e+01   -8.6509652996047089e+02   2.8052093846433923e-02
1.0000000000000001e+03   0.0000000000000000e+00   0.0000000000000000e+00   9.9680857172652770e+02   1.0000000000000001e+03   0.0000000000000000e+00   0.0000000000000000e+00   -9.9680857172652770e+02   9.5414746993174037e+02   1.9640085793164448e+02   8.3458262627149782e+02   -1.2474386962786646e+02   1.0458525300682597e+03   -1.9640085793164442e+02   -8.3458262627149782e+02   1.2474386962786642e+02   3.0791954217724866e-02
1.0000000000000001e+03   0.0000000000000000e+00   0.0000000000000000e+00   9.9680857172652770e+02   1.0000000000000001e+03   0.0000000000000000e+00   0.0000000000000000e+00   -9.9680857172652770e+02   9.5414746993174049e+02   2.3918014640418085e+02   -5.3448958057389552e+02   6.3857359474399379e+02   1.0458525300682595e+03   -2.3918014640418085e+02   5.3448958057389564e+02   -6.3857359474399379e+02   3.5564115991599345e-02
1.0000000000000001e+03   0.0000000000000000e+00   0.0000000000000000e+00   9.9680857172652770e+02   1.0000000000000001e+03   0.0000000000000000e+00   0.0000000000000000e+00   -9.9680857172652770e+02   9.5414746993174037e+02   -5.1490803727336095e+02   -3.6942733272750166e+02   -5.9080931700963299e+02   1.0458525300682595e+03   5.1490803727336095e+02   3.6942733272750166e+02   5.9080931700963333e+02   3.0695197532119339e-02
1.0000000000000001e+03   0.0000000000000000e+00   0.0000000000000000e+00   9.9680857172652770e+02   1.0000000000000001e+03   0.0000000000000000e+00   0.0000000000000000e+00   -9.9680857172652770e+02   9.5414746993174026e+02   4.9524340504481739e+02   -4.0789087199273467e+02   -5.8225552499299818e+02   1.0458525300682597e+03   -4.9524340504481779e+02   4.0789087199273439e+02   5.8225552499299818e+02   3.0671842909285311e-02
1.0000000000000001e+03   0.0000000000000000e+00   0.0000000000000000e+00   9.9680857172652770e+02   1.0000000000000001e+03   0.0000000000000000e+00   0.0000000000000000e+00   -9.9680857172652770e+02   9.5414746993174037e+02   3.6710690675509102e+02   1.9732527431910693e+01   7.8454167286008828e+02   1.0458525300682595e+03   -3.6710690675509221e+02   -1.9732527431912118e+01   -7.8454167286008828e+02   3.4312246534312932e-02
1.0000000000000001e+03   0.0000000000000000e+00   0.0000000000000000e+00   9.9680857172652770e+02   1.0000000000000001e+03   0.0000000000000000e+00   0.0000000000000000e+00   -9.9680857172652770e+02   9.5414746993174049e+02   -1.8441574153435445e+02   -9.5925016830617892e+01   -8.4110148941767454e+02   1.0458525300682595e+03   1.8441574153435491e+02   9.5925016830617864e+01   8.4110148941767443e+02   3.1801036291200416e-02
1.0000000000000001e+03   0.0000000000000000e+00   0.0000000000000000e+00   9.9680857172652770e+02   1.0000000000000001e+03   0.0000000000000000e+00   0.0000000000000000e+00   -9.9680857172652770e+02   9.5414746993174049e+02   4.3147262030782105e+02   4.8417067903947878e+02   -5.7451947013430561e+02   1.0458525300682593e+03   -4.3147262030782105e+02   -4.8417067903947861e+02   5.7451947013430561e+02   3.0651539686272586e-02
1.0000000000000001e+03   0.0000000000000000e+00   0.0000000000000000e+00   9.9680857172652770e+02   1.0000000000000001e+03   0.0000000000000000e+00   0.0000000000000000e+00   -9.9680857172652770e+02   9.5414746993174163e+02   8.4684132686831106e+02   5.3508166159982203e+01   -1.7509749667646588e+02   1.0458525300682584e+03   -8.4684132686831322e+02   -5.3508166159980469e+01   1.7509749667646366e+02   3.0649130237427109e-02
1.0000000000000001e+03   0.0000000000000000e+00   0.0000000000000000e+00   9.9680857172652770e+02   1.0000000000000001e+03   0.0000000000000000e+00   0.0000000000000000e+00   -9.9680857172652770e+02   9.5414746993174072e+02   -7.4977553617502520e+02   -2.5770599845956690e+02   3.4940914955344454e+02   1.0458525300682595e+03   7.4977553617502520e+02   2.5770599845956701e+02   -3.4940914955344471e+02   3.3534493423426591e-02
1.0000000000000001e+03   0.0000000000000000e+00   0.0000000000000000e+00   9.9680857172652770e+02   1.0000000000000001e+03   0.0000000000000000e+00   0.0000000000000000e+00   -9.9680857172652770e+02   9.5414746993174037e+02   -4.3315464970292453e+02   3.5756169410116274e+02   -6.5968869509223350e+02   1.0458525300682593e+03   4.3315464970292419e+02   -3.5756169410116252e+02   6.5968869509223362e+02   3.0917957611333296e-02
1.0000000000000001e+03   0.0000000000000000e+00   0.0000000000000000e+00   9.9680857172652770e+02   1.0000000000000001e+03   0.0000000000000000e+00   0.0000000000000000e+00   -9.9680857172652770e+02   9.5414746993174037e+02   -6.7764915287165081e+02   6.6529027239035827e+01   5.3574994561568735e+02   1.0458525300682595e+03   6.7764915287165115e+02   -6.6529027239035770e+01   -5.3574994561568747e+02   3.4999591895674025e-02
1.0000000000000001e+03   0.0000000000000000e+00   0.0000000000000000e+00   9.9680857172652770e+02   1.0000000000000001e+03   0.0000000000000000e+00   0.0000000000000000e+00   -9.9680857172652770e+02   9.5414746993174026e+02   6.2209095791778736e+02   -5.9867245068502530e+02   7.2502599594539731e+01   1.0458525300682597e+03   -6.2209095791778736e+02   5.9867245068502564e+02   -7.2502599594539760e+01   3.1645123300806682e-02
1.0000000000000001e+03   0.0000000000000000e+00   0.0000000000000000e+00   9.9680857172652770e+02   1.0000000000000001e+03   0.0000000000000000e+00   0.0000000000000000e+00   -9.9680857172652770e+02   9.5414746993174049e+02   -2.4647643180532577e+02   -4.2656879489893396e+02   7.1270675727345053e+02   1.0458525300682595e+03   2.4647643180532583e+02   4.2656879489893356e+02   -7.1270675727345076e+02   3.5501364492199858e-02
1.0000000000000001e+03   0.0000000000000000e+00   0.0000000000000000e+00   9.9680857172652770e+02   1.0000000000000001e+03   0.0000000000000000e+00   0.0000000000000000e+00   -9.9680857172652770e+02   9.5414746993174037e+02   -7.3895796563462710e+00   -7.4286350223698878e+02   -4.4582698576572153e+02   1.0458525300682595e+03   7.3895796563463199e+00   7.4286350223698889e+02   4.4582698576572074e+02   3.0427543562131967e-02
1.0000000000000001e+03   0.0000000000000000e+00   0.0000000000000000e+00   9.9680857172652770e+02   1.0000000000000001e+03   0.0000000000000000e+00   0.0000000000000000e+00   -9.9680857172652770e+02   9.5414746993173992e+02   2.3050013087736761e+02   7.6102293640682910e+02   3.4405852701029721e+02   1.0458525300682600e+03   -2.3050013087736764e+02   -7.6102293640682888e+02   -3.4405852701029721e+02   3.3492314128537877e-02
1.0000000000000001e+03   0.0000000000000000e+00   0.0000000000000000e+00   9.9680857172652770e+02   1.0000000000000001e+03   0.0000000000000000e+00   0.0000000000000000e+00   -9.9680857172652770e+02   9.5414746993174037e+02   2.6285298943244868e+02   8.2555672420952578e+02   5.1856666989894222e+00   1.0458525300682597e+03   -2.6285298943244868e+02   -8.2555672420952590e+02   -5.1856666989896585e+00   3.1302652176204593e-02
1.0000000000000001e+03   0.0000000000000000e+00   0.0000000000000000e+00   9.9680857172652770e+02   1.0000000000000001e+03   0.0000000000000000e+00   0.0000000000000000e+00   -9.9680857172652770e+02   9.5414746993174026e+02   -2.0204957929259376e+01   2.9770756436266225e+02   -8.1340300950794267e+02   1.0458525300682597e+03   2.0204957929259276e+01   -2.9770756436266242e+02   8.1340300950794290e+02   3.1638347612390615e-02
1.0000000000000001e+03   0.0000000000000000e+00   0.0000000000000000e+00   9.9680857172652770e+02   1.0000000000000001e+03   0.0000000000000000e+00   0.0000000000000000e+00   -9.9680857172652770e+02   9.5414746993174197e+02   -2.5200946646309342e+02   -8.1015369174209866e+02   1.7551271933934001e+02   1.0458525300682584e+03   2.5200946646309077e+02   8.1015369174210332e+02   -1.7551271933934277e+02   3.2265354674721192e-02
1.0000000000000001e+03   0.0000000000000000e+00   0.0000000000000000e+00   9.9680857172652770e+02   1.0000000000000001e+03   0.0000000000000000e+00   0.0000000000000000e+00   -9.9680857172652770e+02   9.5414746993174037e+02   -8.1083768780049013e+02   -2.4490288464649623e+02   -1.8228360105733810e+02   1.0458525300682593e+03   8.1083768780048990e+02   2.4490288464649615e+02   1.8228360105733785e+02   3.0631304175183092e-02
1.0000000000000001e+03   0.0000000000000000e+00   0.0000000000000000e+00   9.9680857172652770e+02   1.0000000000000001e+03   0.0000000000000000e+00   0.0000000000000000e+00   -9.9680857172652770e+02   9.5414746993174049e+02   -7.6798705634535975e+02   -3.3793817834980791e+02   -2.1600036800846746e+02   1.0458525300682595e+03   7.6798705634540386e+02   3.3793817834980126e+02   2.1600036800846652e+02   3.0556252682691718e-02
1.0000000000000001e+03   0.0000000000000000e+00   0.0000000000000000e+00   9.9680857172652770e+02   1.0000000000000001e+03   0.0000000000000000e+00   0.0000000000000000e+00   -9.9680857172652770e+02   9.5414746993174083e+02   2.1621348745805426e+02   8.3174043581549734e+02   1.1010025136629432e+02   1.0458525300682593e+03   -2.1621348745805548e+02   -8.3174043581549711e+02   -1.1010025136629417e+02   3.1858459304681848e-02
1.0000000000000001e+03   0.0000000000000000e+00   0.0000000000000000e+00   9.9680857172652770e+02   1.0000000000000001e+03   0.0000000000000000e+00   0.0000000000000000e+00   -9.9680857172652770e+02   9.5414746993174049e+02   5.5148900595994155e+02   -5.6203910463586078e+02   -3.6143382692504878e+02   1.0458525300682593e+03   -5.5148900595994155e+02   5.6203910463586089e+02   3.6143382692504872e+02   3.0396582242683563e-02
1.0000000000000001e+03   0.0000000000000000e+00   0.0000000000000000e+00   9.9680857172652770e+02   1.0000000000000001e+03   0.0000000000000000e+00   0.0000000000000000e+00   -9.9680857172652770e+02   9.5414746993174049e+02   8.1697639813073340e+02   -2.8845839311857634e+02   -1.9520289528119905e+00   1.0458525300682593e+03   -8.1697639813073340e+02   2.8845839311857634e+02   1.9520289528119905e+00   3.1269391127109705e-02
1.0000000000000001e+03   0.0000000000000000e+00   0.0000000000000000e+00   9.9680857172652770e+02   1.0000000000000001e+03   0.0000000000000000e+00   0.0000000000000000e+00   -9.9680857172652770e+02   9.5414746993174037e+02   -4.6603109135831158e+02   -1.1401253926627952e+02   7.2144206479639547e+02   1.0458525300682595e+03   4.6603109135831147e+02   1.1401253926627959e+02   -7.2144206479639547e+02   3.5440033748673452e-02
1.0000000000000001e+03   0.0000000000000000e+00   0.0000000000000000e+00   9.9680857172652770e+02   1.0000000000000001e+03   0.0000000000000000e+00   0.0000000000000000e+00   -9.9680857172652770e+02   9.5414746993174037e+02   -6.5243365743859954e+02   -3.2573859269584113e+02   4.6785380403505945e+02   1.0458525300682595e+03   6.5243365743859954e+02   3.2573859269584113e+02   -4.6785380403505951e+02   3.4483372325126674e-02
1.0000000000000001e+03   0.0000000000000000e+00   0.0000000000000000e+00   9.9680857172652770e+02   1.0000000000000001e+03   0.0000000000000000e+00   0.0000000000000000e+00   -9.9680857172652770e+02   9.5414746993174049e+02   -3.7086392566797156e+02   5.3006404069354471e+02   5.7632851003748203e+02   1.0458525300682595e+03   3.7086392566797156e+02   -5.3006404069354471e+02   -5.7632851003748215e+02   3.5269742905231452e-02
1.0000000000000001e+03   0.0000000000000000e+00   0.0000000000000000e+00   9.9680857172652770e+02   1.0000000000000001e+03   0.0000000000000000e+00   0.0000000000000000e+00   -9.9680857172652770e+02   9.5414746993174049e+02   -6.6296988753789935e+02   3.6222584967295296e+02   4.2417667560456835e+02   1.0458525300682595e+03   6.6296988753789947e+02   -3.6222584967295296e+02   -4.2417667560456840e+02   3.4133449765600184e-02
1.0000000000000001e+03   0.0000000000000000e+00   0.0000000000000000e+00   9.9680857172652770e+02   1.0000000000000001e+03   0.0000000000000000e+00   0.0000000000000000e+00   -9.9680857172652770e+02   9.5414746993174037e+02   -8.3667892205050350e+02   -9.7852250989458213e+01   2.0262232960104319e+02   1.0458525300682595e+03   8.3667892205050350e+02   9.7852250989458057e+01   -2.0262232960104330e+02   3.2446562095543363e-02
1.0000000000000001e+03   0.0000000000000000e+00   0.0000000000000000e+00   9.9680857172652770e+02   1.0000000000000001e+03   0.0000000000000000e+00   0.0000000000000000e+00   -9.9680857172652770e+02   9.5414746993173947e+02   -5.4443723735145431e+02   -1.8377764693919195e+02   6.4844148629684548e+02   1.0458525300682606e+03   5.4443723735145431e+02   1.8377764693919244e+02   -6.4844148629684605e+02   3.5589655674586773e-02
1.0000000000000001e+03   0.0000000000000000e+00   0.0000000000000000e+00   9.9680857172652770e+02   1.0000000000000001e+03   0.0000000000000000e+00   0.0000000000000000e+00   -9.9680857172652770e+02   9.5414746993174049e+02   -5.4954901787449216e+02   -2.9231865199866820e+02   6.0266754743151148e+02   1.0458525300682595e+03   5.4954901787449216e+02   2.9231865199866814e+02   -6.0266754743151148e+02   3.5417325620465095e-02
1.0000000000000001e+03   0.0000000000000000e+00   0.0000000000000000e+00   9.9680857172652770e+02   1.0000000000000001e+03   0.0000000000000000e+00   0.0000000000000000e+00   -9.9680857172652770e+02   9.5414746993174049e+02   5.6905600631146811e+01   -8.6000835658394101e+02   8.8373464924985072e+01   1.0458525300682593e+03   -5.6905600631146889e+01   8.6000835658394124e+02   -8.8373464924985228e+01   3.1733292088778148e-02
1.0000000000000001e+03   0.0000000000000000e+00   0.0000000000000000e+00   9.9680857172652770e+02   1.0000000000000001e+03   0.0000000000000000e+00   0.0000000000000000e+00   -9.9680857172652770e+02   9.5414746993174083e+02   1.8712969799118252e+01   1.9299423295437578e+02   8.4443208186798529e+02   1.0458525300682593e+03   -1.8712969799118319e+01   -1.9299423295437632e+02   -8.4443208186798529e+02   3.0718680888613421e-02
1.0000000000000001e+03   0.0000000000000000e+00   0.0000000000000000e+00   9.9680857172652770e+02   1.0000000000000001e+03   0.0000000000000000e+00   0.0000000000000000e+00   -9.9680857172652770e+02   9.5414746993174060e+02   -3.7830449827882387e+02   4.0303658484630108e+02   6.6716542771466220e+02   1.0458525300682593e+03   3.7830449827882370e+02   -4.0303658484630108e+02   -6.6716542771466209e+02   3.5615166205081678e-02
1.0000000000000001e+03   0.0000000000000000e+00   0.0000000000000000e+00   9.9680857172652770e+02   1.0000000000000001e+03   0.0000000000000000e+00   0.0000000000000000e+00   -9.9680857172652770e+02   9.5414746993174026e+02   2.6750498177496866e+02   -7.7656608580212992e+02   -2.7576926802633932e+02   1.0458525300682597e+03   -2.6750498177496877e+02   7.7656608580212992e+02   2.7576926802633926e+02   3.0458231171959633e-02
1.0000000000000001e+03   0.0000000000000000e+00   0.0000000000000000e+00   9.9680857172652770e+02   1.0000000000000001e+03   0.0000000000000000e+00   0.0000000000000000e+00   -9.9680857172652770e+02   9.5414746993174049e+02   2.1176348251944034e+01   5.7492997645476066e+01   -8.6423874454730401e+02   1.0458525300682595e+03   -2.1176348251944074e+01   -5.7492997645476045e+01   8.6423874454730401e+02   3.1944644454245386e-02
1.0000000000000001e+03   0.0000000000000000e+00   0.0000000000000000e+00   9.9680857172652770e+02   1.0000000000000001e+03   0.0000000000000000e+00   0.0000000000000000e+00   -9.9680857172652770e+02   9.5414746993174049e+02   3.0864704852785809e+02   -8.0000795399766480e+02   1.2404339182626019e+02   1.0458525300682595e+03   -3.0864704852785803e+02   8.0000795399766480e+02   -1.2404339182626029e+02   3.1941459702197805e-02
1.0000000000000001e+03   0.0000000000000000e+00   0.0000000000000000e+00   9.9680857172652770e+02   1.0000000000000001e+03   0.0000000000000000e+00   0.0000000000000000e+00   -9.9680857172652770e+02   9.5414746993174049e+02   -1.0745188123016274e+02   -1.8440106271094217e+02   -8.3970996860310333e+02   1.0458525300682595e+03   1.0745188123016293e+02   1.8440106271094226e+02   8.3970996860310333e+02   3.1792623196002200e-02
1.0000000000000001e+03   0.0000000000000000e+00   0.0000000000000000e+00   9.9680857172652770e+02   1.0000000000000001e+03   0.0000000000000000e+00   0.0000000000000000e+00   -9.9680857172652770e+02   9.5414746993174037e+02   -8.2354044484108545e+02   2.6721281348735437e+02   -3.2263572328082972e+01   1.0458525300682595e+03   8.2354044484108545e+02   -2.6721281348735442e+02   3.2263572328082937e+01   3.1134792272646736e-02
1.0000000000000001e+03   0.0000000000000000e+00   0.0000000000000000e+00   9.9680857172652770e+02   1.0000000000000001e+03   0.0000000000000000e+00   0.0000000000000000e+00   -9.9680857172652770e+02   9.5414746993174003e+02   7.2851063971743855e+01   8.6062755313832145e+02   -6.8377096586361120e+01   1.0458525300682600e+03   -7.2851063971743940e+01   -8.6062755313832145e+02   6.8377096586361120e+01   3.0988648116574417e-02
1.0000000000000001e+03   0.0000000000000000e+00   0.0000000000000000e+00   9.9680857172652770e+02   1.0000000000000001e+03   0.0000000000000000e+00   0.0000000000000000e+00   -9.9680857172652770e+02   9.5414746993173992e+02   -7.8804332347252364e+02   -2.4193139958461731e+02   -2.6668222345266508e+02   1.0458525300682602e+03   7.8804332347252421e+02   2.4193139958461751e+02   2.6668222345266508e+02   3.0470233073087851e-02
1.0000000000000001e+03   0.0000000000000000e+00   0.0000000000000000e+00   9.9680857172652770e+02   1.0000000000000001e+03   0.0000000000000000e+00   0.0000000000000000e+00   -9.9680857172652770e+02   9.5414746993174083e+02   6.9838392562184049e+02   -2.1797550404959023e+02   -4.6412181821974696e+02   1.0458525300682591e+03   -6.9838392562184049e+02   2.1797550404959020e+02   4.6412181821974713e+02   3.0446332804441159e-02
1.0000000000000001e+03   0.0000000000000000e+00   0.0000000000000000e+00   9.9680857172652770e+02   1.0000000000000001e+03   0.0000000000000000e+00   0.0000000000000000e+00   -9.9680857172652770e+02   9.5414746993174049e+02   -5.3652763502754601e+02   -2.2478537617723606e+02   -6.4208420132320464e+02   1.0458525300682595e+03   5.3652763502754590e+02   2.2478537617723592e+02   6.4208420132320464e+02   3.0855146118950176e-02
1.0000000000000001e+03   0.0000000000000000e+00   0.0000000000000000e+00   9.9680857172652770e+02   1.0000000000000001e+03   0.0000000000000000e+00   0.0000000000000000e+00   -9.9680857172652770e+02   9.5414746993174049e+02   1.6676713170025522e+02   6.9935010529251929e+02   4.8348799787798470e+02   1.0458525300682595e+03   -1.6676713170025528e+02   -6.9935010529251929e+02   -4.8348799787798470e+02   3.4606491568678927e-02
1.0000000000000001e+03   0.0000000000000000e+00   0.0000000000000000e+00   9.9680857172652770e+02   1.0000000000000001e+03   0.0000000000000000e+00   0.0000000000000000e+00   -9.9680857172652770e+02   9.5414746993174049e+02   -3.7405595122870756e+02   2.8408444140435500e+02   7.2803891762914157e+02   1.0458525300682595e+03   3.7405595122870790e+02   -2.8408444140435449e+02   -7.2803891762914179e+02   3.5382623433783907e-02
1.0000000000000001e+03   0.0000000000000000e+00   0.0000000000000000e+00   9.9680857172652770e+02   1.0000000000000001e+03   0.0000000000000000e+00   0.0000000000000000e+00   -9.9680857172652770e+02   9.5414746993172901e+02   -1.0158857539611864e+02   1.5598877349730029e+02   8.4617359564812409e+02   1.0458525300682709e+03   1.0158857539611898e+02   -1.5598877349729821e+02   -8.4617359564812091e+02   3.0536607535531161e-02
1.0000000000000001e+03   0.0000000000000000e+00   0.0000000000000000e+00   9.9680857172652770e+02   1.0000000000000001e+03   0.0000000000000000e+00   0.0000000000000000e+00   -9.9680857172652770e+02   9.5414746993174049e+02   6.4722717620170567e+02   4.2113448988560265e+02   3.9294428853847728e+02   1.0458525300682593e+03   -6.4722717620170567e+02   -4.2113448988560265e+02   -3.9294428853847728e+02   3.3881804941289582e-02
1.0000000000000001e+03   0.0000000000000000e+00   0.0000000000000000e+00   9.9680857172652770e+02   1.0000000000000001e+03   0.0000000000000000e+00   0.0000000000000000e+00   -9.9680857172652770e+02   9.5414746993174083e+02   -3.7057561138978571e+02   -4.4614136873024091e+02   6.4365680718131568e+02   1.0458525300682591e+03   3.7057561138978576e+02   4.4614136873024222e+02   -6.4365680718131796e+02   3.5578212775620795e-02
1.0000000000000001e+03   0.0000000000000000e+00   0.0000000000000000e+00   9.9680857172652770e+02   1.0000000000000001e+03   0.0000000000000000e+00   0.0000000000000000e+00   -9.9680857172652770e+02   9.5414746993174026e+02   -2.5929824837243541e+02   6.3001397319938792e+02   -5.3526563689887371e+02   1.0458525300682597e+03   2.5929824837243319e+02   -6.3001397319938565e+02   5.3526563689887291e+02   3.0560490173679622e-02
1.0000000000000001e+03   0.0000000000000000e+00   0.0000000000000000e+00   9.9680857172652770e+02   1.0000000000000001e+03   0.0000000000000000e+00   0.0000000000000000e+00   -9.9680857172652770e+02   9.5414746993174049e+02   5.7647402885482529e+02   1.8196214602032396e+02   6.2066896293581078e+02   1.0458525300682593e+03   -5.7647402885482529e+02   -1.8196214602032396e+02   -6.2066896293581067e+02   3.5500285610056664e-02
1.0000000000000001e+03   0.0000000000000000e+00   0.0000000000000000e+00   9.9680857172652770e+02   1.0000000000000001e+03   0.0000000000000000e+00   0.0000000000000000e+00   -9.9680857172652770e+02   9.5414746993174049e+02   -3.3357074712878534e+02   7.9612391874213563e+02   7.4697742582086661e+01   1.0458525300682595e+03   3.3357074712878523e+02   -7.9612391874213574e+02   -7.4697742582086462e+01   3.1657152282138279e-02
1.0000000000000001e+03   0.0000000000000000e+00   0.0000000000000000e+00   9.9680857172652770e+02   1.0000000000000001e+03   0.0000000000000000e+00   0.0000000000000000e+00   -9.9680857172652770e+02   9.5414746993174185e+02   -6.8949524824756918e+02   5.2462036979188713e+02   -5.6798172241268325e+00   1.0458525300682581e+03   6.8949524824756770e+02   -5.2462036979188622e+02   5.6798172241273592e+00   3.1252256168793104e-02
1.0000000000000001e+03   0.0000000000000000e+00   0.0000000000000000e+00   9.9680857172652770e+02   1.0000000000000001e+03   0.0000000000000000e+00   0.0000000000000000e+00   -9.9680857172652770e+02   9.5414746993174037e+02   -2.9447309866028161e+02   3.5094129878782996e+02   -7.3538308999512208e+02   1.0458525300682595e+03   2.9447309866028161e+02   -3.5094129878782991e+02   7.3538308999512208e+02   3.1234101570035287e-02
1.0000000000000001e+03   0.0000000000000000e+00   0.0000000000000000e+00   9.9680857172652770e+02   1.0000000000000001e+03   0.0000000000000000e+00   0.0000000000000000e+00   -9.9680857172652770e+02   9.5414746993174117e+02   -2.8472558222548054e+02   -5.2739030795408064e+02   -6.2566228588809031e+02   1.0458525300682588e+03   2.8472558222548042e+02   5.2739030795408064e+02   6.2566228588809020e+02   3.0800194148436835e-02
