Welcome to Sherpa, Stephan Bräuer. Initialization of framework underway.
The local time is Tue Feb  9 16:13:03 2016.
Run_Parameter::Init(): Setting memory limit to 3.72888 GB.
Random::SetSeed(): Seed set to 1234
-----------------------------------------------------------------------------
-----------    Event generation run with SHERPA started .......   -----------
-----------------------------------------------------------------------------
................................................ |       +                   
................................................ ||  |       +  +            
...................................        ....  | |         /   +           
................. ................   _,_ |  ....  ||         +|  +  +        
...............................  __.'  ,\|  ...  ||    /    +|          +    
.............................. (  \    \   ...  | |  |   + + \         +   
.............................  (    \   -/  .... ||       +    |          +  
........ ...................  <S   /()))))~~~~~~~~##     +     /\    +       
............................ (!H   (~~)))))~~~~~~#/     +  +    |  +         
................ ........... (!E   (~~~)))))     /|/    +         +          
............................ (!R   (~~~)))))   |||   + +            +        
..... ...................... (!P    (~~~~)))   /|  + +          +            
............................ (!A>    (~~~~~~~~~##        + +        +        
............................. ~~(!    '~~~~~~~ \       +     + +      +      
...............................  `~~~QQQQQDb //   |         + + +        +   
........................ ..........   IDDDDP||     \  + + + + +             +
....................................  IDDDI||       \                      + 
.................................... IHD HD||         \ + +  + + + + +      +
...................................  IHD ##|            :-) + +\          +  
......... ............... ......... IHI ## /      /   +  + + + +\       +    
................................... IHI/ /       /      + + + +        +     
................................... ## | | /    / + +      + + /      +      
....................... /TT\ .....  ##/ ///  / + + + + + + +/       +        
......................./TTT/T\ ... /TT\/\\\ / + + + + + + +/   \         +   
....................../TTT/TTTT\...|TT/T\\\/   +    ++  + /              
-----------------------------------------------------------------------------

     SHERPA version 2.2.0 (Cho Oyu)
                                                                             
     Authors:        Stefan Hoeche, Frank Krauss, Silvan Kuttimalai,         
                     Marek Schoenherr, Holger Schulz, Steffen Schumann,      
                     Frank Siegert, Korinna Zapp.
     Former Authors: Timo Fischer, Tanju Gleisberg, Hendrik Hoeth,           
                     Ralf Kuhn, Thomas Laubrich, Andreas Schaelicke,         
                     Jan Winter                                              
                                                                             
     This program uses a lot of genuine and original research work           
     by other people. Users are encouraged to refer to                       
     the various original publications.                                      
                                                                             
     Users are kindly asked to refer to the documentation                    
     published under JHEP 02(2009)007                                        
                                                                             
     Please visit also our homepage                                          
                                                                             
       http://sherpa.hepforge.org                                            
                                                                             
     for news, bugreports, updates and new releases.                         
                                                                             
-----------------------------------------------------------------------------

SVN branch branches/RecolaInterface, revision 26997.

Beam_Spectra_Handler : 
   type = Monochromatic*Monochromatic
   for    P+  ((1000,0,0,1000))
   and    P+  ((1000,0,0,-1000))
PDF set 'NNPDF30NNLO' loaded for beam 1 (P+).
PDF set 'NNPDF30NNLO' loaded for beam 2 (P+).
Initialized the ISR: (SF)*(SF)
One_Running_AlphaS::One_Running_AlphaS() {
  Setting \alpha_s according to PDF
  perturbative order 2
  \alpha_s(M_Z) = 0.118
}
One_Running_AlphaS::One_Running_AlphaS() {
  Setting \alpha_s according to PDF
  perturbative order 2
  \alpha_s(M_Z) = 0.118
}
 List of Particle Data 
  IDName     kfc  MASS[<kfc>]   WIDTH[<kfc>]  STABLE[<kfc>] MASSIVE[<kfc>]  ACTIVE[<kfc>]  YUKAWA[<kfc>]
       d       1         0.01              0              1              0              1              0
       u       2        0.005              0              1              0              1              0
       s       3          0.2              0              1              0              1              0
       c       4         1.42              0              1              0              1              0
       b       5          4.8              0              1              0              1              0
       t       6       173.21              2              0              1              1         173.21
      e-      11     0.000511              0              1              0              1              0
      ve      12            0              0              1              0              1              0
     mu-      13        0.105              0              1              0              1              0
     vmu      14            0              0              1              0              1              0
    tau-      15        1.777    2.26735e-12              0              0              1              0
    vtau      16            0              0              1              0              1              0
       G      21            0              0              1              0              1              0
       P      22            0              0              1              0              1              0
       Z      23      91.1876         2.4952              0              1              1        91.1876
      W+      24       80.385          2.085              0              1              1         80.385
      h0      25          125        0.00407              0              1              1            125

 List of Particle Containers 
    IDName     kfc     Constituents
         l      90     {e-,e+,mu-,mu+,tau-,tau+}
         v      91     {ve,veb,vmu,vmub,vtau,vtaub}
         j      93     {d,db,u,ub,s,sb,c,cb,b,bb,G}
         Q      94     {d,db,u,ub,s,sb,c,cb,b,bb}
         r      99     {d,db,u,ub,s,sb,c,cb,b,bb,G}

Shower_Handler::Shower_Handler(): No shower selected.
Shower_Handler::Shower_Handler(): No shower selected.
Initialized the Shower_Handler.
+-----------------------------------------+
|   X   X   X XXXX  XXX  XXX  XXX         |
|  X X  XX XX X    X      X  X     X   X  |
| X   X X X X XXX  X XXX  X  X    XXX XXX |
| XXXXX X   X X    X   X  X  X     X   X  |
| X   X X   X XXXX  XXX  XXX  XXX         |
+-----------------------------------------+
| please cite: JHEP 0202:044,2002         |
+-----------------------------------------+
ME_Generators::ME_Generators(): Try loading 'Recola' from 'libSherpaRecola'.
ME_Generator_Base::SetPSMasses(): Massive PS flavours for Amegic: (c,cb,b,bb,e-,e+,mu-,mu+,tau-,tau+)
Amegic::Initialize(): Set gauge 1.
Initialising Recola generator from /home/stephan/Recola
ME_Generator_Base::SetPSMasses(): Massive PS flavours for Comix: (c,cb,b,bb,e-,e+,mu-,mu+,tau-,tau+)
+----------------------------------+
|                                  |
|      [31mCCC[0m  [32mOOO[0m  [34mM[0m   [34mM[0m I [33mX[0m   [33mX[0m     |
|     [31mC[0m    [32mO[0m   [32mO[0m [34mMM[0m [34mMM[0m I  [33mX[0m [33mX[0m      |
|     [31mC[0m    [32mO[0m   [32mO[0m [34mM[0m [34mM[0m [34mM[0m I   [33mX[0m       |
|     [31mC[0m    [32mO[0m   [32mO[0m [34mM[0m   [34mM[0m I  [33mX[0m [33mX[0m      |
|      [31mCCC[0m  [32mOOO[0m  [34mM[0m   [34mM[0m I [33mX[0m   [33mX[0m     |
|                                  |
+==================================+
|  Color dressed  Matrix Elements  |
|     http://comix.freacafe.de     |
|   please cite  JHEP12(2008)039   |
+----------------------------------+
Matrix_Element_Handler::BuildProcesses(): Looking for processes .. done ( 18 MB, 0s / 0s ).
Matrix_Element_Handler::InitializeProcesses(): Performing tests  done ( 18 MB, 0s / 0s ).
Initialized the Matrix_Element_Handler for the hard processes.
Beam_Remnant_Handler::Beam_Remnant_Handler(): Set remnants 0.
Initialized the Beam_Remnant_Handler.
Single_Process::CalculateTotalXSec(): Calculate xs for '2_2__u__ub__Z__P__QCD(V)' (Amegic)
Starting the calculation at 16:13:03. Lean back and enjoy ... .
processes in Recola are being generated...

 xxxxxxxxxxxxxxxxxxxxxxxxxxxxxxxxxxxxxxxxxxxxxxxxxxxxxxxxxxxxxxxxxxxxxxxxxxx
                           _    _   _   _        _ 
                          | )  |_  |   | |  |   |_|
                          | \  |_  |_  |_|  |_  | |

                REcursive Computation of One Loop Amplitudes

                                 Version 1.0

       by S.Actis, A.Denner, L.Hofer, J.-N.Lang, A.Scharf, S.Uccirati

 ---------------------------------------------------------------------------
  Pole masses and widths:
  M_Z   =  91.187600000000                Width_Z   =  2.4952000000000    
  M_W   =  80.385000000000                Width_W   =  2.0850000000000    
  M_H   =  125.00000000000                Width_H   = 0.40700000000000E-02
  m_e   =  0.0000000000000           
  m_mu  =  0.0000000000000                Width_mu  =  0.0000000000000    
  m_tau =  0.0000000000000                Width_tau = 0.22673500000000E-11
  m_u   =  0.0000000000000           
  m_d   =  0.0000000000000           
  m_c   =  0.0000000000000                Width_c   =  0.0000000000000    
  m_s   =  0.0000000000000           
  m_t   =  173.21000000000                Width_t   =  2.0000000000000    
  m_b   =  0.0000000000000                Width_b   =  0.0000000000000    
 ---------------------------------------------------------------------------
  Renormalization done in the complex-mass scheme
 ---------------------------------------------------------------------------
  EW Renormalization Scheme: gfermi       Gf = 0.11663900000000E-04
 ---------------------------------------------------------------------------
  alpha_s(Q) = 0.11330729748566           Q =  120.00000000000    
 ---------------------------------------------------------------------------
  Delta_UV   =  0.0000000000000           mu_UV =  120.00000000000    
  Delta_IR^2 =  1.6449340668482    
  Delta_IR   =  0.0000000000000           mu_IR =  120.00000000000    
 ---------------------------------------------------------------------------
  Dimensional regularization for soft singularities
 ---------------------------------------------------------------------------

 Total RAM needed for this run:         4 Mbytes

 ---------------------------------------------------------------------------

process generation in Recola completed...
Momenta are:  ((206.266205552639,0,0,206.266205552639),(16.1001201226537,0,0,-16.1001201226537),(192.521958186059,10.62552959589,-17.3506821896981,168.331749644544),(29.8443674892334,-10.62552959589,17.3506821896981,21.8343357854406))
    and finite is:  3.57942327967706
    with Born:  0.047963592795278
    factor:  0.000864947444909101 and AlphaQCD()= 0.113307297485655
    flavours:  (u,ub,Z,P)
Momenta are:  ((738.095263442974,0,0,738.095263442974),(305.026450479108,0,0,-305.026450479108),(343.134187600965,-103.910268866586,221.296052927126,-222.83762090312),(699.987526321118,103.910268866586,-221.296052927126,655.906433866985))
    and finite is:  -2.6530636752091
    with Born:  0.014691676358902
    factor:  0.000264941118616844 and AlphaQCD()= 0.113307297485655
    flavours:  (u,ub,Z,P)
Momenta are:  ((114.540871883133,0,0,114.540871883133),(243.712644901364,0,0,-243.712644901364),(134.942210375271,-40.010442190056,12.9333242494582,90.1449687271481),(223.311306409225,40.010442190056,-12.9333242494582,-219.316741745379))
    and finite is:  15.6785020204995
    with Born:  0.0691418254701899
    factor:  0.00124686333511445 and AlphaQCD()= 0.113307297485655
    flavours:  (u,ub,Z,P)
Momenta are:  ((936.474621919931,0,0,936.474621919931),(42.2554028019947,0,0,-42.2554028019948),(634.563436006157,-98.5827644836745,-151.58454179968,601.381028264375),(344.16658871577,98.5827644836745,151.58454179968,292.838190853562))
    and finite is:  4.01254171378856
    with Born:  0.0032089310281325
    factor:  5.78679896962597e-05 and AlphaQCD()= 0.113307297485655
    flavours:  (u,ub,Z,P)
Momenta are:  ((392.373675909242,0,0,392.373675909242),(90.4963142958848,0,0,-90.4963142958849),(262.313696597831,176.887398313792,10.6038010501174,170.562905551372),(220.556293607296,-176.887398313792,-10.6038010501174,131.314456061985))
    and finite is:  4.34569794119591
    with Born:  0.00285395282962139
    factor:  5.14665200000436e-05 and AlphaQCD()= 0.113307297485655
    flavours:  (u,ub,Z,P)
Momenta are:  ((249.342944677483,0,0,249.342944677483),(104.89079086549,0,0,-104.89079086549),(125.251122946919,10.2751008006584,-15.9393354316972,-83.7438075038168),(228.982612596054,-10.2751008006584,15.9393354316972,228.19596131581))
    and finite is:  27.042369375989
    with Born:  0.326836778475315
    factor:  0.00589398374828119 and AlphaQCD()= 0.113307297485655
    flavours:  (u,ub,Z,P)
Momenta are:  ((448.208462940042,0,0,448.208462940042),(523.388140599682,0,0,-523.388140599683),(517.33854404501,-208.440395579924,-252.689742821588,-389.903175319329),(454.258059494715,208.440395579924,252.689742821588,314.723497659689))
    and finite is:  -4.2493225655897
    with Born:  0.00758370453065359
    factor:  0.000136760102287003 and AlphaQCD()= 0.113307297485655
    flavours:  (u,ub,Z,P)
Momenta are:  ((398.158567263398,0,0,398.158567263398),(107.271509726995,0,0,-107.271509726995),(373.187239290362,48.8316813330621,-112.447686452544,340.476903600022),(132.242837700031,-48.8316813330621,112.447686452544,-49.5898460636188))
    and finite is:  4.88608577046639
    with Born:  0.0105614444248886
    factor:  0.00019045892597846 and AlphaQCD()= 0.113307297485655
    flavours:  (u,ub,Z,P)
Momenta are:  ((964.052254968575,0,0,964.052254968575),(882.885676602588,0,0,-882.885676602588),(885.394322691469,-66.2888215729254,-45.1839637926313,-877.024589057219),(961.543608879694,66.2888215729254,45.1839637926313,958.191167423205))
    and finite is:  15.1661777713273
    with Born:  0.592471035150104
    factor:  0.0106842769311098 and AlphaQCD()= 0.113307297485655
    flavours:  (u,ub,Z,P)
Momenta are:  ((319.92446479302,0,0,319.92446479302),(470.370509960638,0,0,-470.370509960638),(452.924365985338,41.8825669891819,267.967416972872,-351.090610715729),(337.37060876832,-41.8825669891819,-267.967416972872,200.644565548112))
    and finite is:  -1.43140493783012
    with Born:  0.0069525094106711
    factor:  0.000125377497806179 and AlphaQCD()= 0.113307297485655
    flavours:  (u,ub,Z,P)
Momenta are:  ((830.226862470539,0,0,830.226862470539),(895.285905838826,0,0,-895.285905838826),(895.457188735461,179.943544609721,-249.759947241591,-835.923852974314),(830.055579573903,-179.943544609721,249.759947241591,770.864809606027))
    and finite is:  -10.0104774764992
    with Born:  0.0330248054495709
    factor:  0.00059555007094962 and AlphaQCD()= 0.113307297485655
    flavours:  (u,ub,Z,P)
Momenta are:  ((27.6582215093406,0,0,27.6582215093406),(294.532041640882,0,0,-294.532041640882),(112.028412692244,26.8446432253882,8.83915057162142,-58.6209979773253),(210.161850457978,-26.8446432253882,-8.83915057162142,-208.252822154216))
    and finite is:  11.0001267776187
    with Born:  0.0465991242148978
    factor:  0.00084034141472083 and AlphaQCD()= 0.113307297485655
    flavours:  (u,ub,Z,P)
Momenta are:  ((607.406822713067,0,0,607.406822713066),(359.401162384806,0,0,-359.401162384806),(610.462634564866,22.5155239470677,-27.7419417856701,602.555296759946),(356.345350533007,-22.5155239470677,27.7419417856701,-354.549636431686))
    and finite is:  32.0106798081915
    with Born:  0.766816180573287
    factor:  0.0138283155503546 and AlphaQCD()= 0.113307297485655
    flavours:  (u,ub,Z,P)
Momenta are:  ((66.7543095396685,0,0,66.7543095396684),(143.205316219963,0,0,-143.205316219962),(154.814327518692,-11.1067925845302,30.9712747933959,-120.705082359696),(55.1452982409388,11.1067925845302,-30.9712747933959,44.2540756794023))
    and finite is:  11.0426193063798
    with Born:  0.0393379536873183
    factor:  0.000709397702441264 and AlphaQCD()= 0.113307297485655
    flavours:  (u,ub,Z,P)
Momenta are:  ((299.751190345225,0,0,299.751190345225),(492.494506203593,0,0,-492.494506203593),(398.925393257533,182.824553837109,331.587450246406,-86.3205441668827),(393.320303291285,-182.824553837109,-331.587450246406,-106.422771691485))
    and finite is:  -1.24565792453224
    with Born:  0.00238265697057067
    factor:  4.29674454869623e-05 and AlphaQCD()= 0.113307297485655
    flavours:  (u,ub,Z,P)
Momenta are:  ((685.991124162242,0,0,685.991124162241),(358.920687935189,0,0,-358.920687935189),(490.350859722622,-463.28462493817,123.156541124939,48.2556723193754),(554.560952374808,463.28462493817,-123.156541124939,278.814763907678))
    and finite is:  -4.69005677749751
    with Born:  0.0025700011656412
    factor:  4.63459013823839e-05 and AlphaQCD()= 0.113307297485655
    flavours:  (u,ub,Z,P)
Momenta are:  ((474.492035904216,0,0,474.492035904216),(7.70921301044814,0,0,-7.70921301044807),(374.984867420375,-25.7118030504042,-4.46998970219436,362.791117278904),(107.216381494289,25.7118030504042,4.46998970219436,103.991705614863))
    and finite is:  3.72932547646219
    with Born:  0.0297033698451113
    factor:  0.000535653239372185 and AlphaQCD()= 0.113307297485655
    flavours:  (u,ub,Z,P)
Momenta are:  ((206.912770819046,0,0,206.912770819046),(38.4764509985726,0,0,-38.4764509985726),(205.643504663945,23.3029105450634,-29.9005151431351,180.380171224594),(39.7457171536733,-23.3029105450634,29.9005151431351,-11.943851404121))
    and finite is:  8.44124888243629
    with Born:  0.0243623217049697
    factor:  0.000439335893804053 and AlphaQCD()= 0.113307297485655
    flavours:  (u,ub,Z,P)
Momenta are:  ((129.455764598816,0,0,129.455764598816),(292.753629816671,0,0,-292.753629816671),(289.80382668921,86.0883012936292,28.8632117403811,-259.666707450834),(132.405567726277,-86.0883012936292,-28.8632117403811,96.3688422329794))
    and finite is:  7.09812989834367
    with Born:  0.0184855565832023
    factor:  0.000333357740789125 and AlphaQCD()= 0.113307297485655
    flavours:  (u,ub,Z,P)
Momenta are:  ((376.880749480245,0,0,376.880749480245),(40.7557372775819,0,0,-40.7557372775819),(375.371230150659,32.8557598896014,-2.00473191645091,362.635991213061),(42.2652566071677,-32.8557598896014,2.00473191645091,-26.5109790103977))
    and finite is:  14.7860595337084
    with Born:  0.0626666408331501
    factor:  0.00113009363374893 and AlphaQCD()= 0.113307297485655
    flavours:  (u,ub,Z,P)
Momenta are:  ((54.8113359850147,0,0,54.8113359850147),(151.249764458024,0,0,-151.249764458024),(115.742846941437,-58.8732654840871,-23.9538855127659,-32.2703920712219),(90.3182535016022,58.8732654840871,23.9538855127659,-64.1680364017879))
    and finite is:  5.38028759103113
    with Born:  0.00755979519285906
    factor:  0.000136328935240716 and AlphaQCD()= 0.113307297485655
    flavours:  (u,ub,Z,P)
Momenta are:  ((283.598612578119,0,0,283.598612578119),(206.506212260077,0,0,-206.506212260077),(257.874838522813,207.551479714089,103.600407861626,66.1331437994899),(232.229986315382,-207.551479714089,-103.600407861626,10.9592565185523))
    and finite is:  2.97203581614355
    with Born:  0.00265188262871878
    factor:  4.78225039083177e-05 and AlphaQCD()= 0.113307297485655
    flavours:  (u,ub,Z,P)
Momenta are:  ((104.876648720316,0,0,104.876648720316),(105.636650051633,0,0,-105.636650051633),(125.209370040118,60.2452170608433,23.0146077791957,-56.5954910054219),(85.3039287318314,-60.2452170608433,-23.0146077791957,55.8354896741046))
    and finite is:  6.44278159719273
    with Born:  0.0101516017261725
    factor:  0.000183068061899904 and AlphaQCD()= 0.113307297485655
    flavours:  (u,ub,Z,P)
Momenta are:  ((194.546101733104,0,0,194.546101733105),(909.983174408505,0,0,-909.983174408505),(205.866606063082,-22.9830184552922,9.61795073113992,182.880171108267),(898.662670078528,22.9830184552922,-9.61795073113992,-898.317243783668))
    and finite is:  39.7871878475253
    with Born:  1.28044863964321
    factor:  0.023090863604066 and AlphaQCD()= 0.113307297485655
    flavours:  (u,ub,Z,P)
Momenta are:  ((6.37312010809897,0,0,6.37312010809875),(718.589927087561,0,0,-718.589927087561),(685.880417650999,-3.92868044977894,-20.9486269887948,-679.45749640471),(39.082629544661,3.92868044977894,20.9486269887948,-32.7593105747522))
    and finite is:  7.0750295099871
    with Born:  0.052425428246103
    factor:  0.000945409581873451 and AlphaQCD()= 0.113307297485655
    flavours:  (u,ub,Z,P)
Momenta are:  ((383.221900126252,0,0,383.221900126252),(15.3400983287644,0,0,-15.3400983287644),(179.209165525316,6.90139026205935,31.3720427715846,150.89371212648),(219.3528329297,-6.90139026205935,-31.3720427715846,216.988089671008))
    and finite is:  7.18332995623846
    with Born:  0.0265749917235225
    factor:  0.000479237893788562 and AlphaQCD()= 0.113307297485655
    flavours:  (u,ub,Z,P)
Momenta are:  ((998.628694452222,0,0,998.628694452222),(29.7999819447455,0,0,-29.7999819447457),(715.289309542168,-124.089950326503,83.0016426876644,693.567609891542),(313.139366854799,124.089950326503,-83.0016426876644,275.261102615934))
    and finite is:  4.58739966101308
    with Born:  0.00378520218715745
    factor:  6.82601275142278e-05 and AlphaQCD()= 0.113307297485655
    flavours:  (u,ub,Z,P)
Momenta are:  ((507.609900717734,0,0,507.609900717734),(727.288796388466,0,0,-727.288796388466),(576.654359527081,445.920923638939,-325.902045682155,138.410470879232),(658.244337579118,-445.920923638939,325.902045682155,-358.089366549964))
    and finite is:  -8.01780732421668
    with Born:  0.00319379918617855
    factor:  5.75951108881457e-05 and AlphaQCD()= 0.113307297485655
    flavours:  (u,ub,Z,P)
Momenta are:  ((69.6669081699899,0,0,69.6669081699899),(251.419108015609,0,0,-251.419108015609),(158.497162784926,-88.5747222161432,-69.3903870554095,-64.3868386065428),(162.588853400672,88.5747222161432,69.3903870554095,-117.365361239076))
    and finite is:  5.23548093875332
    with Born:  0.0040605058188969
    factor:  7.32247925647301e-05 and AlphaQCD()= 0.113307297485655
    flavours:  (u,ub,Z,P)
Momenta are:  ((976.062544797404,0,0,976.062544797405),(938.615773396629,0,0,-938.61577339663),(947.667934204878,392.132737595233,625.825615113278,-586.799412662059),(967.010383989155,-392.132737595233,-625.825615113278,624.246184062834))
    and finite is:  -16.7301972284953
    with Born:  0.00530492211978376
    factor:  9.56658699971381e-05 and AlphaQCD()= 0.113307297485655
    flavours:  (u,ub,Z,P)
Momenta are:  ((964.861117132997,0,0,964.861117132997),(986.161632326417,0,0,-986.161632326417),(983.344770129722,68.4961852643353,818.480192061538,-532.96360697036),(967.677979329692,-68.4961852643353,-818.480192061538,511.66309177694))
    and finite is:  -17.1836152822018
    with Born:  0.00409428862323587
    factor:  7.3834011945346e-05 and AlphaQCD()= 0.113307297485655
    flavours:  (u,ub,Z,P)
Momenta are:  ((503.983666849994,0,0,503.983666849994),(995.249149957372,0,0,-995.249149957372),(958.624273791042,-173.729280865602,338.839067180971,-875.015167542536),(540.608543016324,173.729280865602,-338.839067180971,383.749684435158))
    and finite is:  -9.43638004012706
    with Born:  0.0133081335687028
    factor:  0.000239991115258817 and AlphaQCD()= 0.113307297485655
    flavours:  (u,ub,Z,P)
Momenta are:  ((909.429726038626,0,0,909.429726038626),(17.1487993100851,0,0,-17.148799310085),(732.078327855661,-91.3784878487316,2.56221245060271,720.601767100261),(194.50019749305,91.3784878487316,-2.56221245060271,171.679159628281))
    and finite is:  5.61077517067247
    with Born:  0.00629298096161857
    factor:  0.000113483946601879 and AlphaQCD()= 0.113307297485655
    flavours:  (u,ub,Z,P)
Momenta are:  ((971.550795231853,0,0,971.550795231853),(678.841788058651,0,0,-678.841788058651),(911.123925369995,628.632494641586,215.425581460837,616.639793170067),(739.268657920509,-628.632494641586,-215.425581460837,-323.930785996865))
    and finite is:  -13.3821340676788
    with Born:  0.00446786672121721
    factor:  8.0570901375255e-05 and AlphaQCD()= 0.113307297485655
    flavours:  (u,ub,Z,P)
Momenta are:  ((731.168280652309,0,0,731.168280652309),(388.176014751907,0,0,-388.176014751907),(393.648471169371,-10.6116289087026,16.4997001249213,-382.438352794166),(725.695824234846,10.6116289087026,-16.4997001249213,725.430618694568))
    and finite is:  50.4581596693629
    with Born:  3.31431595162651
    factor:  0.05976843991268 and AlphaQCD()= 0.113307297485655
    flavours:  (u,ub,Z,P)
Momenta are:  ((381.090369283826,0,0,381.090369283826),(374.076134945492,0,0,-374.076134945493),(380.469083056502,-3.00060134133626,-242.592346798633,-278.534548008712),(374.697421172816,3.00060134133626,242.592346798633,285.548782347046))
    and finite is:  -0.827340134239417
    with Born:  0.00864506224415876
    factor:  0.000155900007972327 and AlphaQCD()= 0.113307297485655
    flavours:  (u,ub,Z,P)
Momenta are:  ((47.0564788073771,0,0,47.0564788073771),(139.871926880212,0,0,-139.871926880212),(145.339944331134,23.068786255551,-31.9563895683339,-106.090250687185),(41.5884613564552,-23.068786255551,31.9563895683339,13.27480261435))
    and finite is:  6.77246943650676
    with Born:  0.0187059326294201
    factor:  0.000337331873813499 and AlphaQCD()= 0.113307297485655
    flavours:  (u,ub,Z,P)
Momenta are:  ((940.51116200644,0,0,940.51116200644),(18.871218875702,0,0,-18.8712188757021),(916.780122751902,36.3759033903755,19.6156635565992,911.297226197359),(42.6022581302404,-36.3759033903755,-19.6156635565992,10.342716933379))
    and finite is:  13.0771295441165
    with Born:  0.045121773274218
    factor:  0.000813699729915666 and AlphaQCD()= 0.113307297485655
    flavours:  (u,ub,Z,P)
Momenta are:  ((847.224463784968,0,0,847.224463784967),(919.864462493171,0,0,-919.864462493171),(866.209949313293,735.11461458851,-75.5680636186754,442.606449427578),(900.878976964847,-735.11461458851,75.5680636186754,-515.246448135782))
    and finite is:  -15.0701080027696
    with Born:  0.00416895108454767
    factor:  7.51804312058445e-05 and AlphaQCD()= 0.113307297485655
    flavours:  (u,ub,Z,P)
Momenta are:  ((152.573179450482,0,0,152.573179450482),(120.897526065475,0,0,-120.897526065475),(153.711524081933,-118.325054436438,-18.4705846233592,31.1459987496914),(119.759181434024,118.325054436438,18.4705846233592,0.529654635315271))
    and finite is:  5.20209959879502
    with Born:  0.00360857378237736
    factor:  6.50749139280608e-05 and AlphaQCD()= 0.113307297485655
    flavours:  (u,ub,Z,P)
Momenta are:  ((788.876966801879,0,0,788.876966801879),(468.848331696193,0,0,-468.848331696193),(476.940463811811,-112.217273193273,63.4885792633059,-450.03723349014),(780.78483468626,112.217273193273,-63.4885792633059,770.065868595826))
    and finite is:  3.70420332499008
    with Born:  0.0978067270998478
    factor:  0.00176378944465277 and AlphaQCD()= 0.113307297485655
    flavours:  (u,ub,Z,P)
Momenta are:  ((33.4791360230709,0,0,33.4791360230709),(219.201083847869,0,0,-219.201083847869),(205.017121292154,-31.9084438319499,-34.4427890331908,-177.517286834269),(47.6630985787864,31.9084438319499,34.4427890331908,-8.2046609905295))
    and finite is:  6.38884550709852
    with Born:  0.0139228058513658
    factor:  0.000251075756532775 and AlphaQCD()= 0.113307297485655
    flavours:  (u,ub,Z,P)
Momenta are:  ((948.671850992885,0,0,948.671850992885),(797.572817778307,0,0,-797.572817778307),(950.808176557511,-5.81872270972772,-32.6072393942353,945.845611408105),(795.436492213681,5.81872270972772,32.6072393942353,-794.746578193527))
    and finite is:  42.6469371958006
    with Born:  3.09912801998298
    factor:  0.0558878663191884 and AlphaQCD()= 0.113307297485655
    flavours:  (u,ub,Z,P)
Momenta are:  ((976.331081326432,0,0,976.331081326431),(381.151987470431,0,0,-381.151987470431),(424.527851675215,190.088030387431,-228.331401575177,-289.205861303597),(932.955217121648,-190.088030387431,228.331401575177,884.384955159598))
    and finite is:  -6.18505795202804
    with Born:  0.0167103074966987
    factor:  0.000301343934650739 and AlphaQCD()= 0.113307297485655
    flavours:  (u,ub,Z,P)
Momenta are:  ((995.881618465223,0,0,995.881618465223),(38.4150661099765,0,0,-38.4150661099766),(128.430713270885,-27.4174818639554,66.7781718745833,54.4814387368451),(905.865971304315,27.4174818639554,-66.7781718745833,902.985113618402))
    and finite is:  9.62390589714538
    with Born:  0.0308625623748763
    factor:  0.000556557441045682 and AlphaQCD()= 0.113307297485655
    flavours:  (u,ub,Z,P)
Momenta are:  ((362.238817498369,0,0,362.238817498369),(567.798181789941,0,0,-567.798181789941),(433.91276260682,389.300855984884,158.192494451654,58.181486642429),(496.124236681489,-389.300855984884,-158.192494451654,-263.740850934001))
    and finite is:  -3.5590999058643
    with Born:  0.00298998333794805
    factor:  5.39196148111232e-05 and AlphaQCD()= 0.113307297485655
    flavours:  (u,ub,Z,P)
Momenta are:  ((188.422360929857,0,0,188.422360929857),(85.8616236325703,0,0,-85.8616236325703),(147.735272003687,32.1510122967883,-104.64303467539,39.0727514063213),(126.54871255874,-32.1510122967883,104.64303467539,63.4879858909651))
    and finite is:  5.26770552631004
    with Born:  0.00392255914750495
    factor:  7.07371427870444e-05 and AlphaQCD()= 0.113307297485655
    flavours:  (u,ub,Z,P)
Momenta are:  ((159.11942717721,0,0,159.11942717721),(935.211191758842,0,0,-935.211191758842),(933.716273754696,3.9935751274804,52.7442267235013,-927.746193409402),(160.614345181356,-3.9935751274804,-52.7442267235013,151.654428827769))
    and finite is:  20.1636809041588
    with Born:  0.236968600959882
    factor:  0.00427335347455692 and AlphaQCD()= 0.113307297485655
    flavours:  (u,ub,Z,P)
Momenta are:  ((273.306560822284,0,0,273.306560822284),(237.063935669247,0,0,-237.063935669247),(280.794839233196,-16.6983388650312,-23.1052904050887,264.041425501154),(229.575657258334,16.6983388650312,23.1052904050887,-227.798800348117))
    and finite is:  28.405136881402
    with Born:  0.356628038566703
    factor:  0.0064312219490693 and AlphaQCD()= 0.113307297485655
    flavours:  (u,ub,Z,P)
Momenta are:  ((408.362397434483,0,0,408.362397434483),(73.2084369414199,0,0,-73.20843694142),(116.505274930612,-66.9853193195255,-14.9541078066601,-23.4017595121703),(365.065559445291,66.9853193195255,14.9541078066601,358.555720005233))
    and finite is:  9.45271681266456
    with Born:  0.0264281410984651
    factor:  0.00047658967530608 and AlphaQCD()= 0.113307297485655
    flavours:  (u,ub,Z,P)
Momenta are:  ((725.442782191419,0,0,725.44278219142),(981.124965988411,0,0,-981.124965988412),(979.186921245676,183.303296662199,-103.555368592771,-951.928587349498),(727.380826934154,-183.303296662199,103.555368592771,696.246403552506))
    and finite is:  -5.17666314470198
    with Born:  0.0699621943904391
    factor:  0.0012616573895232 and AlphaQCD()= 0.113307297485655
    flavours:  (u,ub,Z,P)
Momenta are:  ((729.787017383436,0,0,729.787017383436),(328.185825351106,0,0,-328.185825351106),(387.183754359152,324.330058191694,-53.6189552316875,-183.114997308038),(670.789088375389,-324.330058191694,53.6189552316875,584.716189340368))
    and finite is:  -4.37668479150391
    with Born:  0.00771872436657257
    factor:  0.000139194971221627 and AlphaQCD()= 0.113307297485655
    flavours:  (u,ub,Z,P)
Momenta are:  ((35.5810564661541,0,0,35.5810564661539),(708.512373416613,0,0,-708.512373416613),(96.7856027019823,-19.5063195728165,0.246276880214313,-25.9175103173007),(647.307827180785,19.5063195728165,-0.246276880214313,-647.013806633159))
    and finite is:  26.2430569498581
    with Born:  0.297665356114266
    factor:  0.0053679233394363 and AlphaQCD()= 0.113307297485655
    flavours:  (u,ub,Z,P)
Momenta are:  ((539.279196194498,0,0,539.279196194499),(6.01160483799658,0,0,-6.01160483799664),(441.897238214014,-8.10289431219674,18.714606887369,431.905194852099),(103.393562818481,8.10289431219674,-18.714606887369,101.362396504403))
    and finite is:  3.28789160854849
    with Born:  0.0472175441423146
    factor:  0.000851493638833463 and AlphaQCD()= 0.113307297485655
    flavours:  (u,ub,Z,P)
Momenta are:  ((935.545018508192,0,0,935.545018508192),(821.106946904444,0,0,-821.106946904443),(929.707638548307,425.731274615938,139.020446777576,809.609357636732),(826.944326864329,-425.731274615938,-139.020446777576,-695.171286032983))
    and finite is:  -13.2889094176276
    with Born:  0.0149742466379099
    factor:  0.000270036826143974 and AlphaQCD()= 0.113307297485655
    flavours:  (u,ub,Z,P)
Momenta are:  ((930.996403969962,0,0,930.996403969962),(858.486974781177,0,0,-858.486974781177),(933.133537385989,-52.4105541771273,38.1799415961763,926.400802067489),(856.349841365151,52.4105541771273,-38.1799415961763,-853.891372878704))
    and finite is:  21.2303260060043
    with Born:  0.852561555229126
    factor:  0.0153745976030336 and AlphaQCD()= 0.113307297485655
    flavours:  (u,ub,Z,P)
Momenta are:  ((17.9097264979363,0,0,17.9097264979363),(216.256323803083,0,0,-216.256323803083),(151.574365498299,11.140093279343,19.7645879335222,-118.932204503227),(82.5916848027202,-11.140093279343,-19.7645879335222,-79.414392801919))
    and finite is:  4.91780334713888
    with Born:  0.0413346591888058
    factor:  0.000745405124343935 and AlphaQCD()= 0.113307297485655
    flavours:  (u,ub,Z,P)
Momenta are:  ((6.50244542732255,0,0,6.50244542732248),(517.97600025194,0,0,-517.97600025194),(407.225519760658,-8.37027127988874,20.2197398211516,-396.280893093326),(117.252925918604,8.37027127988874,-20.2197398211516,-115.192661731291))
    and finite is:  3.48817047217486
    with Born:  0.0414255047002473
    factor:  0.000747043379287392 and AlphaQCD()= 0.113307297485655
    flavours:  (u,ub,Z,P)
Momenta are:  ((219.046631652935,0,0,219.046631652935),(158.225156937052,0,0,-158.225156937052),(225.189346278217,-81.3197325923762,-11.8174309641095,188.792247457261),(152.08244231177,81.3197325923762,11.8174309641095,-127.970772741379))
    and finite is:  7.90336882185316
    with Born:  0.0209154341870292
    factor:  0.000377176735622199 and AlphaQCD()= 0.113307297485655
    flavours:  (u,ub,Z,P)
Momenta are:  ((78.2901618040729,0,0,78.2901618040728),(154.608237935812,0,0,-154.608237935812),(108.531393198255,-25.8011768087624,34.0513865202198,40.4807024040805),(124.36700654163,25.8011768087624,-34.0513865202198,-116.79877853582))
    and finite is:  10.2695801237643
    with Born:  0.0284531794084385
    factor:  0.000513108034544319 and AlphaQCD()= 0.113307297485655
    flavours:  (u,ub,Z,P)
Momenta are:  ((22.2568057857793,0,0,22.2568057857793),(292.282453213884,0,0,-292.282453213884),(163.154531544782,-4.8174161517053,-47.8136337653368,-126.470833387042),(151.384727454881,4.8174161517053,47.8136337653368,-143.554814041063))
    and finite is:  5.5190341861539
    with Born:  0.0117123631844357
    factor:  0.000211213923307731 and AlphaQCD()= 0.113307297485655
    flavours:  (u,ub,Z,P)
Momenta are:  ((230.002767276607,0,0,230.002767276607),(134.831626174105,0,0,-134.831626174105),(168.36235295001,-131.065725253248,-18.831708377362,-49.9784545632791),(196.472040500703,131.065725253248,18.831708377362,145.149595665781))
    and finite is:  4.67909872649549
    with Born:  0.00574120305937648
    factor:  0.000103533505884507 and AlphaQCD()= 0.113307297485655
    flavours:  (u,ub,Z,P)
Momenta are:  ((281.357003583721,0,0,281.357003583721),(76.0477470351409,0,0,-76.0477470351409),(254.869433544253,59.9339430431669,-82.6290870264897,214.996758603183),(102.53531707461,-59.9339430431669,82.6290870264897,-9.68750205460296))
    and finite is:  5.5428878453812
    with Born:  0.00707292206266593
    factor:  0.000127548949309452 and AlphaQCD()= 0.113307297485655
    flavours:  (u,ub,Z,P)
Momenta are:  ((842.533809774534,0,0,842.533809774534),(353.677442592007,0,0,-353.677442592007),(408.057687269818,129.091395258505,-298.390991766342,-229.115965068226),(788.153565096723,-129.091395258505,298.390991766342,717.972332250753))
    and finite is:  -5.54305014556315
    with Born:  0.0104292836305839
    factor:  0.00018807561533201 and AlphaQCD()= 0.113307297485655
    flavours:  (u,ub,Z,P)
Momenta are:  ((618.677816755112,0,0,618.677816755112),(655.699008913323,0,0,-655.699008913323),(658.088547434691,-179.330047740173,-34.1619479372311,-625.650903588881),(616.288278233744,179.330047740173,34.1619479372311,588.62971143067))
    and finite is:  -1.66777896708337
    with Born:  0.0524910108287726
    factor:  0.000946592259900778 and AlphaQCD()= 0.113307297485655
    flavours:  (u,ub,Z,P)
Momenta are:  ((717.499374141115,0,0,717.499374141115),(793.199336736212,0,0,-793.199336736212),(795.787240927787,-31.0080613169446,-4.78270393544032,-789.922641975865),(714.91146994954,31.0080613169446,4.78270393544032,714.222679380768))
    and finite is:  42.3981705774334
    with Born:  2.59765022168773
    factor:  0.046844508325439 and AlphaQCD()= 0.113307297485655
    flavours:  (u,ub,Z,P)
Momenta are:  ((896.745842936889,0,0,896.745842936889),(433.112486391789,0,0,-433.112486391789),(896.193721551192,56.7252181296992,79.3038404050671,886.194763400891),(433.664607777486,-56.7252181296992,-79.3038404050671,-422.561406855792))
    and finite is:  9.08949137114256
    with Born:  0.18147006198926
    factor:  0.00327252520708914 and AlphaQCD()= 0.113307297485655
    flavours:  (u,ub,Z,P)
Momenta are:  ((24.0886189573489,0,0,24.088618957349),(202.535919388206,0,0,-202.535919388206),(188.271298376281,-30.4055192164189,-15.6936266952767,-161.1214383031),(38.3532399692746,30.4055192164189,15.6936266952767,-17.3258621277569))
    and finite is:  5.22544723564547
    with Born:  0.0198924946479463
    factor:  0.000358729640876757 and AlphaQCD()= 0.113307297485655
    flavours:  (u,ub,Z,P)
Momenta are:  ((111.067228883347,0,0,111.067228883347),(623.73183601169,0,0,-623.73183601169),(626.56288894628,10.6923442461361,12.1857092347528,-619.679802539922),(108.236175948757,-10.6923442461361,-12.1857092347528,107.015195411579))
    and finite is:  40.2926655159612
    with Born:  1.18414028597876
    factor:  0.0213540949516212 and AlphaQCD()= 0.113307297485655
    flavours:  (u,ub,Z,P)
Momenta are:  ((148.92683752667,0,0,148.92683752667),(232.949571335761,0,0,-232.949571335761),(238.24467631504,-51.9322453354748,-51.7509918820258,-207.533669876338),(143.63173254739,51.9322453354748,51.7509918820258,123.510936067247))
    and finite is:  9.15163995307868
    with Born:  0.0268795334012934
    factor:  0.000484729820700305 and AlphaQCD()= 0.113307297485655
    flavours:  (u,ub,Z,P)
Momenta are:  ((329.535938577487,0,0,329.535938577487),(832.38182905209,0,0,-832.38182905209),(815.213192302632,-102.811772227268,-174.175758547508,-784.442423085581),(346.704575326944,102.811772227268,174.175758547508,281.596532610978))
    and finite is:  -1.80036372859644
    with Born:  0.0279062675141861
    factor:  0.000503245344575634 and AlphaQCD()= 0.113307297485655
    flavours:  (u,ub,Z,P)
Momenta are:  ((642.208838146416,0,0,642.208838146416),(666.813136197053,0,0,-666.813136197053),(645.469019376905,38.0534385131496,-12.6591525566653,637.735649196041),(663.552954966564,-38.0534385131496,12.6591525566653,-662.339947246678))
    and finite is:  32.9594139873551
    with Born:  1.19511391187404
    factor:  0.0215519869177218 and AlphaQCD()= 0.113307297485655
    flavours:  (u,ub,Z,P)
Momenta are:  ((734.641658158692,0,0,734.641658158692),(223.555922853319,0,0,-223.555922853319),(254.752734520899,148.039759376676,68.3303691485054,-173.202100587264),(703.444846491112,-148.039759376676,-68.3303691485054,684.287835892637))
    and finite is:  1.46496678789779
    with Born:  0.0255362173476325
    factor:  0.000460505242836036 and AlphaQCD()= 0.113307297485655
    flavours:  (u,ub,Z,P)
Momenta are:  ((36.7841531039473,0,0,36.7841531039473),(754.910872250719,0,0,-754.910872250719),(752.970521728241,-25.8148766720388,0.733231231356269,-746.982250600581),(38.7245036264247,25.8148766720388,-0.733231231356269,28.8555314538094))
    and finite is:  23.000842832409
    with Born:  0.186029812436326
    factor:  0.00335475308596067 and AlphaQCD()= 0.113307297485655
    flavours:  (u,ub,Z,P)
Momenta are:  ((9.42574684483303,0,0,9.42574684483292),(479.205969007339,0,0,-479.205969007339),(361.513353106685,36.2073988100408,1.78265359763049,-347.940472636111),(127.118362745486,-36.2073988100408,-1.78265359763049,-121.839749526394))
    and finite is:  4.29768645202275
    with Born:  0.0164813966564878
    factor:  0.000297215890131692 and AlphaQCD()= 0.113307297485655
    flavours:  (u,ub,Z,P)
Momenta are:  ((115.513888198896,0,0,115.513888198896),(182.114312220271,0,0,-182.114312220271),(134.598898480535,32.9721644025492,11.4118463950566,92.6514501499042),(163.029301938632,-32.9721644025492,-11.4118463950566,-159.251874171278))
    and finite is:  16.4154223823027
    with Born:  0.0762162924015596
    factor:  0.00137444014368465 and AlphaQCD()= 0.113307297485655
    flavours:  (u,ub,Z,P)
Momenta are:  ((361.994468334812,0,0,361.994468334812),(53.2001743939421,0,0,-53.2001743939421),(292.377241447834,93.7511308626818,-58.2493925685572,254.925492350701),(122.81740128092,-93.7511308626818,58.2493925685572,53.8688015901688))
    and finite is:  5.24960236571842
    with Born:  0.00494317230570723
    factor:  8.91422849371666e-05 and AlphaQCD()= 0.113307297485655
    flavours:  (u,ub,Z,P)
Momenta are:  ((706.089382709073,0,0,706.089382709073),(554.732400853163,0,0,-554.732400853163),(558.557714764235,20.6318568622423,19.3992282963607,-550.335841784638),(702.264068798001,-20.6318568622423,-19.3992282963607,701.692823640548))
    and finite is:  42.7457550051667
    with Born:  2.19402337646626
    factor:  0.0395657373217496 and AlphaQCD()= 0.113307297485655
    flavours:  (u,ub,Z,P)
Momenta are:  ((110.845020289224,0,0,110.845020289224),(60.5116165583134,0,0,-60.5116165583135),(108.197501983181,20.5108126633952,-51.0000647609313,19.2307306129621),(63.1591348643572,-20.5108126633952,51.0000647609313,31.1026731179489))
    and finite is:  5.03751373730954
    with Born:  0.00869221163227033
    factor:  0.000156750272525072 and AlphaQCD()= 0.113307297485655
    flavours:  (u,ub,Z,P)
Momenta are:  ((204.157958287815,0,0,204.157958287815),(120.407063990533,0,0,-120.407063990533),(177.784220304727,106.951504104681,-95.4846312232962,52.3078537649675),(146.780801973621,-106.951504104681,95.4846312232962,31.4430405323143))
    and finite is:  4.94727231723437
    with Born:  0.00316763212780113
    factor:  5.71232294262848e-05 and AlphaQCD()= 0.113307297485655
    flavours:  (u,ub,Z,P)
Momenta are:  ((64.9710909812708,0,0,64.9710909812708),(78.3547467199575,0,0,-78.3547467199575),(100.442872263398,40.8054964586014,-9.50997796829494,-4.25017324011491),(42.8829654378298,-40.8054964586014,9.50997796829494,-9.1334824985718))
    and finite is:  4.56534516417827
    with Born:  0.0129661797700068
    factor:  0.000233824519988911 and AlphaQCD()= 0.113307297485655
    flavours:  (u,ub,Z,P)
Momenta are:  ((345.407464445009,0,0,345.407464445009),(840.663473252792,0,0,-840.663473252792),(488.800221672373,455.04892250392,153.078011522821,10.3960968368523),(697.270716025428,-455.04892250392,-153.078011522821,-505.652105644635))
    and finite is:  -6.12837919429433
    with Born:  0.00341668341108867
    factor:  6.1614474943491e-05 and AlphaQCD()= 0.113307297485655
    flavours:  (u,ub,Z,P)
Momenta are:  ((58.787041460954,0,0,58.7870414609539),(613.976600375929,0,0,-613.976600375929),(429.080910590993,109.444133588544,-132.51268048296,-382.436426839952),(243.68273124589,-109.444133588544,132.51268048296,-172.753132075023))
    and finite is:  4.22647942338063
    with Born:  0.00326477234973201
    factor:  5.88749995056374e-05 and AlphaQCD()= 0.113307297485655
    flavours:  (u,ub,Z,P)
Momenta are:  ((500.645464405562,0,0,500.645464405561),(138.670192970272,0,0,-138.670192970272),(503.007381367713,-3.74698870773562,-36.2149583553947,493.331211442764),(136.308276008121,3.74698870773562,36.2149583553947,-131.355940007474))
    and finite is:  24.0019765429178
    with Born:  0.233478481624461
    factor:  0.0042104146990051 and AlphaQCD()= 0.113307297485655
    flavours:  (u,ub,Z,P)
Momenta are:  ((44.3244842811769,0,0,44.3244842811769),(373.58160142826,0,0,-373.58160142826),(93.972442964956,6.54432289193566,20.881755846645,-6.06347702965094),(323.933642744481,-6.54432289193566,-20.881755846645,-323.193640117432))
    and finite is:  20.4004920882868
    with Born:  0.155696036797326
    factor:  0.00280773147635384 and AlphaQCD()= 0.113307297485655
    flavours:  (u,ub,Z,P)
Momenta are:  ((979.878259425481,0,0,979.878259425481),(508.203860424596,0,0,-508.203860424596),(980.9980791344,-59.6714923074933,-25.3526854396626,974.596638214198),(507.084040715677,59.6714923074933,25.3526854396626,-502.922239213313))
    and finite is:  19.6835078441997
    with Born:  0.530496304063032
    factor:  0.00956666079398071 and AlphaQCD()= 0.113307297485655
    flavours:  (u,ub,Z,P)
Momenta are:  ((318.940496472023,0,0,318.940496472023),(16.4237816601148,0,0,-16.4237816601148),(274.278944140582,-34.3871639140562,-18.8638531720608,255.686211608219),(61.0853339915558,34.3871639140562,18.8638531720608,46.8305032036886))
    and finite is:  5.09926169424233
    with Born:  0.0154755271132489
    factor:  0.000279076625730673 and AlphaQCD()= 0.113307297485655
    flavours:  (u,ub,Z,P)
Momenta are:  ((582.603199456068,0,0,582.603199456068),(768.083534721613,0,0,-768.083534721613),(770.444507740282,-27.0399419174075,-50.8065571167658,-762.86112524394),(580.242226437399,27.0399419174075,50.8065571167658,577.380789978394))
    and finite is:  22.6288837050225
    with Born:  0.605251713097508
    factor:  0.0109147562194733 and AlphaQCD()= 0.113307297485655
    flavours:  (u,ub,Z,P)
Momenta are:  ((5.58539585493707,0,0,5.58539585493723),(644.961151309264,0,0,-644.961151309264),(500.213337373813,-20.0676167073837,15.3597049451937,-491.181814317845),(150.333209790388,20.0676167073837,-15.3597049451937,-148.193941136481))
    and finite is:  3.6940035166949
    with Born:  0.0315640150838273
    factor:  0.000569207029889483 and AlphaQCD()= 0.113307297485655
    flavours:  (u,ub,Z,P)
Momenta are:  ((873.448298094271,0,0,873.448298094271),(671.339346745568,0,0,-671.339346745568),(869.74258700553,255.884632800728,-52.6495370795195,824.553254919935),(675.04505783431,-255.884632800728,52.6495370795195,-622.444303571232))
    and finite is:  -7.16330985190471
    with Born:  0.0363879179719648
    factor:  0.000656198479745902 and AlphaQCD()= 0.113307297485655
    flavours:  (u,ub,Z,P)
Momenta are:  ((131.522113912961,0,0,131.522113912961),(650.228551420103,0,0,-650.228551420103),(160.877961816401,-89.2866364490323,-22.6571507704667,95.2947547088606),(620.872703516663,89.2866364490323,22.6571507704667,-614.001192216003))
    and finite is:  8.20469690417194
    with Born:  0.0430990898944545
    factor:  0.000777223838114691 and AlphaQCD()= 0.113307297485655
    flavours:  (u,ub,Z,P)
Momenta are:  ((947.360542056355,0,0,947.360542056355),(882.829300195998,0,0,-882.829300195998),(949.534320844521,-26.8769668670078,18.4005870110451,944.584191651323),(880.655521407833,26.8769668670078,-18.4005870110451,-880.052949790966))
    and finite is:  43.9046536921505
    with Born:  3.54266417525316
    factor:  0.0638863385325442 and AlphaQCD()= 0.113307297485655
    flavours:  (u,ub,Z,P)
Momenta are:  ((874.099946902087,0,0,874.099946902087),(454.269492012014,0,0,-454.269492012014),(472.315477363416,75.1906636351639,208.336109673058,-407.073901486782),(856.053961550685,-75.1906636351639,-208.336109673058,826.904356376855))
    and finite is:  -3.89244095344762
    with Born:  0.0341504167259334
    factor:  0.000615848687894481 and AlphaQCD()= 0.113307297485655
    flavours:  (u,ub,Z,P)
Momenta are:  ((502.00758674195,0,0,502.00758674195),(27.7006906118415,0,0,-27.7006906118416),(432.945001220833,69.7010891422856,-33.4410951482321,416.112541286625),(96.7632761329592,-69.7010891422856,33.4410951482321,58.1943548434842))
    and finite is:  6.13346716328627
    with Born:  0.00844842830528758
    factor:  0.000152354026257925 and AlphaQCD()= 0.113307297485655
    flavours:  (u,ub,Z,P)
Momenta are:  ((68.3922867979269,0,0,68.3922867979269),(71.6409864309775,0,0,-71.6409864309775),(100.469652617229,-18.7723177322592,-15.342915496585,-34.5132979341372),(39.5636206116749,18.7723177322592,15.342915496585,31.2645983010866))
    and finite is:  7.11992257772988
    with Born:  0.0419825466896311
    factor:  0.000757088749480595 and AlphaQCD()= 0.113307297485655
    flavours:  (u,ub,Z,P)
Momenta are:  ((153.788244660822,0,0,153.788244660822),(593.014375564888,0,0,-593.014375564888),(595.965017120681,20.1901267572331,-6.48694813349715,-588.565545647496),(150.837603105028,-20.1901267572331,6.48694813349715,149.33941474343))
    and finite is:  37.5663983833838
    with Born:  0.910134267966005
    factor:  0.0164128303098869 and AlphaQCD()= 0.113307297485655
    flavours:  (u,ub,Z,P)
Momenta are:  ((572.269868136838,0,0,572.269868136838),(48.6416824897293,0,0,-48.6416824897294),(327.574504099923,67.2805391823159,-138.89640039266,274.173296197586),(293.337046526644,-67.2805391823159,138.89640039266,249.454889449523))
    and finite is:  4.78113856237284
    with Born:  0.0030361617037456
    factor:  5.47523685140651e-05 and AlphaQCD()= 0.113307297485655
    flavours:  (u,ub,Z,P)
Momenta are:  ((39.7163589545634,0,0,39.7163589545634),(91.6866121094425,0,0,-91.6866121094425),(109.736584303247,-11.8227306028952,17.3487600561308,-57.3252396976219),(21.6663867607589,11.8227306028952,-17.3487600561308,5.35498654274275))
    and finite is:  4.53802110213843
    with Born:  0.0470112502716805
    factor:  0.000847773455546382 and AlphaQCD()= 0.113307297485655
    flavours:  (u,ub,Z,P)
Momenta are:  ((460.490385832261,0,0,460.490385832261),(504.201240686091,0,0,-504.201240686091),(507.865543923354,31.1556715696343,-92.6529014478357,-489.956116701432),(456.826082594998,-31.1556715696343,92.6529014478357,446.245261847602))
    and finite is:  8.49830417206507
    with Born:  0.107027588699655
    factor:  0.00193007308221628 and AlphaQCD()= 0.113307297485655
    flavours:  (u,ub,Z,P)
Momenta are:  ((178.414916031099,0,0,178.414916031099),(33.633247488333,0,0,-33.633247488333),(98.060024764605,15.8278253076896,-5.04054019074708,32.0103571315547),(113.988138754827,-15.8278253076896,5.04054019074708,112.771311411211))
    and finite is:  11.6881003137216
    with Born:  0.107282082800039
    factor:  0.00193466248032103 and AlphaQCD()= 0.113307297485655
    flavours:  (u,ub,Z,P)
Momenta are:  ((6.79181664202338,0,0,6.79181664202336),(455.770404916274,0,0,-455.770404916274),(357.40767821611,-7.58510749221701,14.9687923809574,-345.171655054493),(105.154543342187,7.58510749221701,-14.9687923809574,-103.806933219758))
    and finite is:  3.33909352978116
    with Born:  0.0694765710161476
    factor:  0.00125289994096061 and AlphaQCD()= 0.113307297485655
    flavours:  (u,ub,Z,P)
Momenta are:  ((11.8000691644365,0,0,11.8000691644365),(482.265538781737,0,0,-482.265538781737),(456.203094935555,17.5897092664972,22.988549861784,-446.058532188537),(37.8625130106179,-17.5897092664972,-22.988549861784,-24.4069374287637))
    and finite is:  7.54807238183657
    with Born:  0.0323692996500159
    factor:  0.000583729061859076 and AlphaQCD()= 0.113307297485655
    flavours:  (u,ub,Z,P)
Momenta are:  ((373.973232239094,0,0,373.973232239094),(119.079460284799,0,0,-119.079460284799),(137.05262502634,-12.2790897024105,13.8649098633783,-100.624211119448),(356.000067497552,12.2790897024105,-13.8649098633783,355.517983073743))
    and finite is:  33.0351538023743
    with Born:  0.582838811280971
    factor:  0.010510575026418 and AlphaQCD()= 0.113307297485655
    flavours:  (u,ub,Z,P)
Momenta are:  ((117.434217501892,0,0,117.434217501892),(109.030354159267,0,0,-109.030354159267),(132.710537912721,-65.9316091030107,-61.3881061947509,34.3719626764835),(93.7540337484385,65.9316091030107,61.3881061947509,-25.9680993338582))
    and finite is:  5.37858702277359
    with Born:  0.00503331208502326
    factor:  9.07678131192787e-05 and AlphaQCD()= 0.113307297485655
    flavours:  (u,ub,Z,P)
Momenta are:  ((662.981090099189,0,0,662.981090099189),(682.87888183631,0,0,-682.87888183631),(685.918307563003,5.31562533587358,20.0201944558465,-679.514298744017),(659.941664372496,-5.31562533587358,-20.0201944558465,659.616507006896))
    and finite is:  53.3788518070241
    with Born:  4.74277964745523
    factor:  0.0855285206707274 and AlphaQCD()= 0.113307297485655
    flavours:  (u,ub,Z,P)
Momenta are:  ((170.897682676859,0,0,170.89768267686),(854.515711074973,0,0,-854.515711074973),(824.194970609664,-28.5912023527928,-159.469279428457,-802.95346269326),(201.218423142168,28.5912023527928,159.469279428457,119.335434295146))
    and finite is:  1.72326070853901
    with Born:  0.0227755673603006
    factor:  0.000410721291850066 and AlphaQCD()= 0.113307297485655
    flavours:  (u,ub,Z,P)
Momenta are:  ((399.88260514859,0,0,399.88260514859),(406.360088204211,0,0,-406.360088204211),(405.218197212654,-30.5654664850594,-111.148606737937,377.621964982546),(401.024496140147,30.5654664850594,111.148606737937,-384.099448038167))
    and finite is:  5.58921717718441
    with Born:  0.0527504107726734
    factor:  0.000951270127124867 and AlphaQCD()= 0.113307297485655
    flavours:  (u,ub,Z,P)
Momenta are:  ((258.330994687423,0,0,258.330994687423),(178.642885247172,0,0,-178.642885247172),(195.850768093293,-90.5211683441007,-56.8160862911234,-136.455836772017),(241.123111841303,90.5211683441007,56.8160862911234,216.143946212268))
    and finite is:  5.88726565862552
    with Born:  0.0159570428575891
    factor:  0.000287759999691589 and AlphaQCD()= 0.113307297485655
    flavours:  (u,ub,Z,P)
Momenta are:  ((953.283835907422,0,0,953.283835907422),(316.842862015581,0,0,-316.842862015581),(780.911836846394,-218.806144669586,436.257040723999,602.753501861764),(489.214861076609,218.806144669586,-436.257040723999,33.6874720300764))
    and finite is:  -6.43807146676665
    with Born:  0.00345399461063511
    factor:  6.22873233444006e-05 and AlphaQCD()= 0.113307297485655
    flavours:  (u,ub,Z,P)
Momenta are:  ((696.689949838067,0,0,696.689949838067),(153.184305580505,0,0,-153.184305580505),(698.513881591109,1.72877378226083,29.8049413486746,691.892434699303),(151.360373827463,-1.72877378226083,-29.8049413486746,-148.386790441741))
    and finite is:  31.3339149055524
    with Born:  0.536381289493751
    factor:  0.00967278718725058 and AlphaQCD()= 0.113307297485655
    flavours:  (u,ub,Z,P)
Momenta are:  ((850.586985987329,0,0,850.586985987329),(334.425822080916,0,0,-334.425822080916),(341.363184952165,27.6840046766047,-28.4589373481403,-326.553717506027),(843.64962311608,-27.6840046766047,28.4589373481403,842.714881412441))
    and finite is:  30.8184909787025
    with Born:  0.80928349169919
    factor:  0.0145941462588108 and AlphaQCD()= 0.113307297485655
    flavours:  (u,ub,Z,P)
Momenta are:  ((61.5952650913023,0,0,61.595265091302),(615.6019505901,0,0,-615.6019505901),(210.869687643787,-3.74999682332104,152.592779520141,-113.367667063281),(466.327528037616,3.74999682332104,-152.592779520141,-440.639018435517))
    and finite is:  4.13395868270402
    with Born:  0.00509211278425069
    factor:  9.18281906179518e-05 and AlphaQCD()= 0.113307297485655
    flavours:  (u,ub,Z,P)
Momenta are:  ((353.75481724937,0,0,353.75481724937),(643.514281120943,0,0,-643.514281120944),(643.013014931336,-83.0865507839885,67.5678449067651,-627.440650891223),(354.256083438978,83.0865507839885,-67.5678449067651,337.681187019649))
    and finite is:  6.86139060869315
    with Born:  0.087017600212661
    factor:  0.00156922462600576 and AlphaQCD()= 0.113307297485655
    flavours:  (u,ub,Z,P)
Momenta are:  ((630.035323828393,0,0,630.035323828393),(529.050662329159,0,0,-529.050662329158),(615.951344455117,328.714879858756,283.757037756983,427.211132375002),(543.134641702435,-328.714879858756,-283.757037756983,-326.226470875767))
    and finite is:  -7.17662487949452
    with Born:  0.00570053454590058
    factor:  0.000102800113643242 and AlphaQCD()= 0.113307297485655
    flavours:  (u,ub,Z,P)
Momenta are:  ((35.8670698350964,0,0,35.8670698350964),(100.218176279983,0,0,-100.218176279984),(98.4293633175649,7.53851431926136,-17.4168517709459,-31.8274291388479),(37.6558827975149,-7.53851431926136,17.4168517709459,-32.5236773060393))
    and finite is:  4.77534685151229
    with Born:  0.05763943790001
    factor:  0.00103943598950992 and AlphaQCD()= 0.113307297485655
    flavours:  (u,ub,Z,P)
Momenta are:  ((867.33525336464,0,0,867.33525336464),(210.918118651836,0,0,-210.918118651835),(545.978105446567,-258.240481404596,334.833860189991,333.129183752272),(532.275266569909,258.240481404596,-334.833860189991,323.287950960532))
    and finite is:  -2.55532098428982
    with Born:  0.00235300252812449
    factor:  4.24326745757524e-05 and AlphaQCD()= 0.113307297485655
    flavours:  (u,ub,Z,P)
Momenta are:  ((841.42566006634,0,0,841.42566006634),(691.260085070573,0,0,-691.260085070573),(697.966674313591,-133.570345979043,194.569908316125,-650.495052641838),(834.719070823322,133.570345979043,-194.569908316125,800.660627637605))
    and finite is:  -5.97813311143331
    with Born:  0.0447113921843599
    factor:  0.000806299156805414 and AlphaQCD()= 0.113307297485655
    flavours:  (u,ub,Z,P)
Momenta are:  ((596.419508784594,0,0,596.419508784594),(40.8141353394475,0,0,-40.8141353394475),(169.333656498328,28.6045630612134,98.5842140043608,99.1041903783744),(467.899987625714,-28.6045630612134,-98.5842140043608,456.501183066772))
    and finite is:  5.62983093059661
    with Born:  0.00821576606861443
    factor:  0.00014815833124408 and AlphaQCD()= 0.113307297485655
    flavours:  (u,ub,Z,P)
Momenta are:  ((43.2551473885096,0,0,43.2551473885097),(468.266948703473,0,0,-468.266948703473),(251.370721674352,65.9841137228078,-107.404591191625,-197.439641026061),(260.151374417631,-65.9841137228078,107.404591191625,-227.572160288902))
    and finite is:  5.13028117341315
    with Born:  0.00354419557009623
    factor:  6.39139548135496e-05 and AlphaQCD()= 0.113307297485655
    flavours:  (u,ub,Z,P)
Momenta are:  ((7.27373394920402,0,0,7.27373394920369),(979.138160467477,0,0,-979.138160467477),(633.911077031092,-0.0158543502709753,59.7565767012262,-624.465552675685),(352.500817385589,0.0158543502709753,-59.7565767012262,-347.398873842589))
    and finite is:  4.98400342188804
    with Born:  0.00748454745595814
    factor:  0.000134971961461762 and AlphaQCD()= 0.113307297485655
    flavours:  (u,ub,Z,P)
Momenta are:  ((78.4640275517449,0,0,78.4640275517449),(42.5699775864454,0,0,-42.5699775864454),(94.5051903156379,-18.0409408795972,3.29404913887588,16.7250200383881),(26.5288148225524,18.0409408795972,-3.29404913887588,19.1690299269114))
    and finite is:  4.00618710498788
    with Born:  0.0597097009362559
    factor:  0.00107676990507237 and AlphaQCD()= 0.113307297485655
    flavours:  (u,ub,Z,P)
Momenta are:  ((202.495399133117,0,0,202.495399133117),(82.3353291935405,0,0,-82.3353291935405),(143.127403791403,79.2364644256212,-71.7898854406067,27.1674506728),(141.703324535255,-79.2364644256212,71.7898854406067,92.9926192667768))
    and finite is:  5.28296743698455
    with Born:  0.00441163966590866
    factor:  7.95569354692504e-05 and AlphaQCD()= 0.113307297485655
    flavours:  (u,ub,Z,P)
Momenta are:  ((518.611946210323,0,0,518.611946210323),(762.96598504845,0,0,-762.96598504845),(764.907696675212,-69.4621284695433,-14.2550339721956,-756.13518153446),(516.670234583562,69.4621284695433,14.2550339721956,511.781142696333))
    and finite is:  16.6009246532108
    with Born:  0.351630474198514
    factor:  0.00634109878941602 and AlphaQCD()= 0.113307297485655
    flavours:  (u,ub,Z,P)
Momenta are:  ((584.797830013155,0,0,584.797830013155),(665.707692759185,0,0,-665.707692759185),(588.426650050307,-32.561009981437,18.8930020274957,580.097904839385),(662.078872722032,32.561009981437,-18.8930020274957,-661.007767585416))
    and finite is:  34.2584819561932
    with Born:  1.23309659725208
    factor:  0.0222369445022954 and AlphaQCD()= 0.113307297485655
    flavours:  (u,ub,Z,P)
Momenta are:  ((197.947158455032,0,0,197.947158455032),(612.226308533445,0,0,-612.226308533445),(305.033215336505,-36.9038927310252,-288.731920377962,-1.43698326987462),(505.140251651972,36.9038927310252,288.731920377962,-412.842166808538))
    and finite is:  -0.464698383991951
    with Born:  0.00418540270627278
    factor:  7.54771101522379e-05 and AlphaQCD()= 0.113307297485655
    flavours:  (u,ub,Z,P)
Momenta are:  ((186.085922648616,0,0,186.085922648616),(287.548559106788,0,0,-287.548559106787),(244.147793054746,93.3277316250674,-201.616377484098,-43.9742799787811),(229.486688700657,-93.3277316250674,201.616377484098,-57.4883564793903))
    and finite is:  3.2838371049845
    with Born:  0.00263381298112021
    factor:  4.74966464274675e-05 and AlphaQCD()= 0.113307297485655
    flavours:  (u,ub,Z,P)
Momenta are:  ((287.032035088737,0,0,287.032035088737),(82.828869464664,0,0,-82.8288694646639),(170.127090514431,-100.955192876093,86.1329989047716,54.9290821347575),(199.73381403897,100.955192876093,-86.1329989047716,149.274083489316))
    and finite is:  4.94270569478599
    with Born:  0.00386869665808926
    factor:  6.97658180825879e-05 and AlphaQCD()= 0.113307297485655
    flavours:  (u,ub,Z,P)
Momenta are:  ((599.170965539986,0,0,599.170965539986),(923.141086940304,0,0,-923.141086940304),(925.2074680852,-32.7121684868503,13.8270262812836,-920.017612866172),(597.10458439509,32.7121684868503,-13.8270262812836,596.047491465855))
    and finite is:  38.2820905265424
    with Born:  1.96982440801707
    factor:  0.0355226639485958 and AlphaQCD()= 0.113307297485655
    flavours:  (u,ub,Z,P)
Momenta are:  ((376.118152826272,0,0,376.118152826272),(18.2378898951918,0,0,-18.2378898951919),(144.805025736754,24.6114438260418,5.72884413130562,109.611925731549),(249.55101698471,-24.6114438260418,-5.72884413130562,248.268337199531))
    and finite is:  10.2568806371377
    with Born:  0.0504957272663854
    factor:  0.000910610480418114 and AlphaQCD()= 0.113307297485655
    flavours:  (u,ub,Z,P)
Momenta are:  ((5.81420008984362,0,0,5.81420008984376),(608.296810019076,0,0,-608.296810019076),(511.162268142725,-19.2077295826507,-14.5024693811035,-502.386731000317),(102.948741966195,19.2077295826507,14.5024693811035,-100.095878928915))
    and finite is:  3.68362113132605
    with Born:  0.0346930823516757
    factor:  0.000625634803134622 and AlphaQCD()= 0.113307297485655
    flavours:  (u,ub,Z,P)
Momenta are:  ((760.944155116102,0,0,760.944155116102),(426.530448135773,0,0,-426.530448135774),(432.239213156553,54.0950992016958,-16.9303985992505,-418.691582005258),(755.235390095322,-54.0950992016958,16.9303985992505,753.105288985586))
    and finite is:  21.7676583834164
    with Born:  0.452036083038113
    factor:  0.00815175495087239 and AlphaQCD()= 0.113307297485655
    flavours:  (u,ub,Z,P)
Momenta are:  ((856.763406629014,0,0,856.763406629014),(523.039059694448,0,0,-523.039059694448),(750.674218395049,602.598126418639,-165.834803170934,405.673415277932),(629.128247928413,-602.598126418639,165.834803170934,-71.949068343367))
    and finite is:  -9.6202057914371
    with Born:  0.00291040432951668
    factor:  5.24845334087581e-05 and AlphaQCD()= 0.113307297485655
    flavours:  (u,ub,Z,P)
Momenta are:  ((658.945998261386,0,0,658.945998261386),(295.783073922596,0,0,-295.783073922596),(656.143679277281,12.8164755936722,110.805530109492,640.130628787811),(298.585392906702,-12.8164755936722,-110.805530109492,-276.967704449022))
    and finite is:  6.12607564790556
    with Born:  0.0682022054166772
    factor:  0.00122991877535346 and AlphaQCD()= 0.113307297485655
    flavours:  (u,ub,Z,P)
Momenta are:  ((211.180158331271,0,0,211.180158331271),(567.416555096979,0,0,-567.416555096979),(260.298515933975,193.644749097914,-92.74847467536,115.497058819132),(518.298197494275,-193.644749097914,92.74847467536,-471.73345558484))
    and finite is:  0.303291359279854
    with Born:  0.00944351945333081
    factor:  0.00017029891936936 and AlphaQCD()= 0.113307297485655
    flavours:  (u,ub,Z,P)
Momenta are:  ((545.098231063674,0,0,545.098231063674),(108.902024510446,0,0,-108.902024510446),(520.596598079884,7.7919815366919,117.527547408962,498.830833211375),(133.403657494236,-7.7919815366919,-117.527547408962,-62.6346266581463))
    and finite is:  5.18585700815003
    with Born:  0.0170164392490251
    factor:  0.000306864536039182 and AlphaQCD()= 0.113307297485655
    flavours:  (u,ub,Z,P)
Momenta are:  ((415.341453125229,0,0,415.34145312523),(733.162367766983,0,0,-733.162367766983),(734.929612428439,61.1696763218897,17.6126879618802,-726.467081671213),(413.574208463773,-61.1696763218897,-17.6126879618802,408.64616702946))
    and finite is:  18.5265244491981
    with Born:  0.335715269072578
    factor:  0.00605409326696405 and AlphaQCD()= 0.113307297485655
    flavours:  (u,ub,Z,P)
Momenta are:  ((309.539961239367,0,0,309.539961239367),(609.876889584357,0,0,-609.876889584357),(574.409417661254,278.46947261926,-80.4404756479563,-487.457776018459),(345.00743316247,-278.46947261926,80.4404756479563,187.12084767347))
    and finite is:  -2.71277198906337
    with Born:  0.00785706209646558
    factor:  0.000141689673120132 and AlphaQCD()= 0.113307297485655
    flavours:  (u,ub,Z,P)
Momenta are:  ((435.181125371403,0,0,435.181125371403),(300.489719875281,0,0,-300.489719875281),(317.900671220657,-115.385067617192,153.665147321724,-236.260379747332),(417.770174026026,115.385067617192,-153.665147321724,370.951785243454))
    and finite is:  0.646583929399028
    with Born:  0.0136801219100707
    factor:  0.000246699335945609 and AlphaQCD()= 0.113307297485655
    flavours:  (u,ub,Z,P)
Momenta are:  ((995.07208497395,0,0,995.072084973951),(994.287129504187,0,0,-994.287129504187),(997.159155754498,-82.015697619503,-58.3396389742153,987.866952266148),(992.200058723639,82.015697619503,58.3396389742153,-987.081996796384))
    and finite is:  9.24068121559912
    with Born:  0.436951243886729
    factor:  0.007879723763873 and AlphaQCD()= 0.113307297485655
    flavours:  (u,ub,Z,P)
Momenta are:  ((597.734673206361,0,0,597.734673206362),(176.636228852648,0,0,-176.636228852648),(552.663241715459,-44.2539457864132,200.399742077182,504.978229241036),(221.70766034355,44.2539457864132,-200.399742077182,-83.8797848873223))
    and finite is:  0.893650231952271
    with Born:  0.00902851373520179
    factor:  0.000162814948411419 and AlphaQCD()= 0.113307297485655
    flavours:  (u,ub,Z,P)
Momenta are:  ((251.079887236433,0,0,251.079887236433),(769.004475616659,0,0,-769.004475616659),(260.110544464754,1.75120603089116,33.2189015894052,241.320854471017),(759.973818388337,-1.75120603089116,-33.2189015894052,-759.245442851243))
    and finite is:  33.0472199871219
    with Born:  0.782485210907462
    factor:  0.0141108817002591 and AlphaQCD()= 0.113307297485655
    flavours:  (u,ub,Z,P)
Momenta are:  ((552.348528192368,0,0,552.348528192368),(626.943028839737,0,0,-626.943028839737),(630.22081574578,26.0121563655012,4.89552215824221,-623.026885286286),(549.070741286325,-26.0121563655012,-4.89552215824221,548.432384638917))
    and finite is:  43.7492271049685
    with Born:  2.22052257291681
    factor:  0.0400436083678133 and AlphaQCD()= 0.113307297485655
    flavours:  (u,ub,Z,P)
Momenta are:  ((859.583595996575,0,0,859.583595996575),(33.9166192028448,0,0,-33.9166192028451),(843.874054922696,48.0584348345982,-3.46179378365837,837.547995641421),(49.6261602767239,-48.0584348345982,3.46179378365837,-11.8810188476909))
    and finite is:  13.9564243621485
    with Born:  0.0545090739277854
    factor:  0.000982984832254705 and AlphaQCD()= 0.113307297485655
    flavours:  (u,ub,Z,P)
Momenta are:  ((224.224613797948,0,0,224.224613797948),(758.759332207437,0,0,-758.759332207437),(710.069623590641,-92.7583422665827,-223.097122399987,-661.443312664959),(272.914322414745,92.7583422665827,223.097122399987,126.908594255471))
    and finite is:  -1.49647225296077
    with Born:  0.0108591327236208
    factor:  0.000195827263051682 and AlphaQCD()= 0.113307297485655
    flavours:  (u,ub,Z,P)
Momenta are:  ((19.8059016800613,0,0,19.8059016800614),(893.293977603308,0,0,-893.293977603308),(884.049040811939,-23.4904119471394,-16.2230161873249,-878.870037297375),(29.0508384714301,23.4904119471394,16.2230161873249,5.38196137412822))
    and finite is:  17.6857854294338
    with Born:  0.096720887849548
    factor:  0.00174420805321828 and AlphaQCD()= 0.113307297485655
    flavours:  (u,ub,Z,P)
Momenta are:  ((824.454100068202,0,0,824.454100068202),(254.319836528323,0,0,-254.319836528323),(826.146245240771,-18.0889357221753,-29.6450888537219,820.363577472183),(252.627691355753,18.0889357221753,29.6450888537219,-250.229313932304))
    and finite is:  32.4910190782734
    with Born:  0.779621159580852
    factor:  0.014059233069857 and AlphaQCD()= 0.113307297485655
    flavours:  (u,ub,Z,P)
Momenta are:  ((931.562629143274,0,0,931.562629143274),(697.165518536864,0,0,-697.165518536864),(928.437454646968,239.250915092884,24.0869921882539,892.109715916221),(700.29069303317,-239.250915092884,-24.0869921882539,-657.712605309811))
    and finite is:  -6.6255314184814
    with Born:  0.0482610013842952
    factor:  0.000870310737860537 and AlphaQCD()= 0.113307297485655
    flavours:  (u,ub,Z,P)
Momenta are:  ((244.164966669467,0,0,244.164966669467),(192.500302003631,0,0,-192.500302003631),(229.316146960732,112.458465172533,-173.681386960558,38.1914427280626),(207.349121712366,-112.458465172533,173.681386960558,13.4732219377731))
    and finite is:  3.66394132517379
    with Born:  0.00269814578959304
    factor:  4.86567867561937e-05 and AlphaQCD()= 0.113307297485655
    flavours:  (u,ub,Z,P)
Momenta are:  ((633.099539140032,0,0,633.099539140032),(369.941702026146,0,0,-369.941702026146),(376.812573334831,64.0651237579569,17.0494432168256,-359.551823014891),(626.228667831347,-64.0651237579569,-17.0494432168256,622.709660128777))
    and finite is:  16.6756722343333
    with Born:  0.237405885476704
    factor:  0.00428123920837043 and AlphaQCD()= 0.113307297485655
    flavours:  (u,ub,Z,P)
Momenta are:  ((412.927011144525,0,0,412.927011144526),(15.4856338787991,0,0,-15.4856338787992),(157.023773644061,-0.388969111739534,17.5557697721942,126.621209701997),(271.388871379263,0.388969111739534,-17.5557697721942,270.820167563729))
    and finite is:  12.0875569032663
    with Born:  0.100858605240091
    factor:  0.00181882523421183 and AlphaQCD()= 0.113307297485655
    flavours:  (u,ub,Z,P)
Momenta are:  ((104.315497448427,0,0,104.315497448427),(384.660165505971,0,0,-384.660165505971),(125.281307528629,-6.81714534534549,22.6878845539641,82.5773216211899),(363.694355425768,6.81714534534549,-22.6878845539641,-362.921989678734))
    and finite is:  27.7242970949916
    with Born:  0.320132165053859
    factor:  0.00577307666209305 and AlphaQCD()= 0.113307297485655
    flavours:  (u,ub,Z,P)
Momenta are:  ((995.843277998738,0,0,995.843277998738),(997.767430809145,0,0,-997.767430809145),(999.849654945753,-27.3955108391124,42.0300620322749,-994.417977498802),(993.76105386213,27.3955108391124,-42.0300620322749,992.493824688395))
    and finite is:  30.2951235155557
    with Born:  1.77291779640612
    factor:  0.0319717650131147 and AlphaQCD()= 0.113307297485655
    flavours:  (u,ub,Z,P)
Momenta are:  ((5.81904875667764,0,0,5.81904875667713),(999.999512820915,0,0,-999.999512820914),(570.342588957088,-44.5762902483598,-10.9745943823756,-561.131003429992),(435.475972620505,44.5762902483598,10.9745943823756,-433.049460634245))
    and finite is:  5.05065063948896
    with Born:  0.0117525037634638
    factor:  0.000211937795087222 and AlphaQCD()= 0.113307297485655
    flavours:  (u,ub,Z,P)
Momenta are:  ((978.545861531838,0,0,978.545861531838),(6.27095216137072,0,0,-6.27095216137064),(802.851138288746,23.9225706954589,-39.6872687534018,796.308610507253),(181.965675404462,-23.9225706954589,39.6872687534018,175.966298863215))
    and finite is:  5.34575420766125
    with Born:  0.0120766512108356
    factor:  0.000217783281007653 and AlphaQCD()= 0.113307297485655
    flavours:  (u,ub,Z,P)
Momenta are:  ((43.2587277553698,0,0,43.2587277553697),(799.397877079563,0,0,-799.397877079563),(798.040027234375,-13.7237657085477,-22.1008439398741,-792.386217463684),(44.616577600558,13.7237657085477,22.1008439398741,36.2470681394902))
    and finite is:  24.8141371009465
    with Born:  0.228350320287707
    factor:  0.00411793642982626 and AlphaQCD()= 0.113307297485655
    flavours:  (u,ub,Z,P)
Momenta are:  ((291.086944694422,0,0,291.086944694422),(134.632045581806,0,0,-134.632045581806),(164.413595972708,18.7119564472665,-109.267642241152,-80.1691785656566),(261.30539430352,-18.7119564472665,109.267642241152,236.624077678272))
    and finite is:  5.50960103653481
    with Born:  0.0121316931243471
    factor:  0.000218775874758039 and AlphaQCD()= 0.113307297485655
    flavours:  (u,ub,Z,P)
Momenta are:  ((144.577939833785,0,0,144.577939833785),(151.673237370971,0,0,-151.673237370971),(165.346618951847,-6.27925897422396,-17.913604207152,-136.616249751233),(130.90455825291,6.27925897422396,17.913604207152,129.520952214047))
    and finite is:  25.1558041726281
    with Born:  0.273877650050457
    factor:  0.00493894972880709 and AlphaQCD()= 0.113307297485655
    flavours:  (u,ub,Z,P)
Momenta are:  ((349.6808182302,0,0,349.6808182302),(85.7862953212881,0,0,-85.7862953212881),(307.070126752242,-67.7740307054921,109.052221644314,263.611794247239),(128.396986799246,67.7740307054921,-109.052221644314,0.282728661672863))
    and finite is:  4.78459581077547
    with Born:  0.00597343542804323
    factor:  0.00010772144890956 and AlphaQCD()= 0.113307297485655
    flavours:  (u,ub,Z,P)
Momenta are:  ((48.4771766928191,0,0,48.477176692819),(418.364816123313,0,0,-418.364816123314),(233.644277256217,13.686200165939,-125.762508762277,-173.985485646522),(233.197715559915,-13.686200165939,125.762508762277,-195.902153783972))
    and finite is:  5.13112078598005
    with Born:  0.00351026040582718
    factor:  6.33019878628592e-05 and AlphaQCD()= 0.113307297485655
    flavours:  (u,ub,Z,P)
Momenta are:  ((458.859811734791,0,0,458.859811734791),(628.711223835765,0,0,-628.711223835765),(478.669087436323,306.12685655843,2.211294049784,356.497369900034),(608.901948134234,-306.12685655843,-2.211294049784,-526.348782001008))
    and finite is:  -5.07630194629316
    with Born:  0.0115947414386089
    factor:  0.000209092801377752 and AlphaQCD()= 0.113307297485655
    flavours:  (u,ub,Z,P)
Momenta are:  ((453.763995310233,0,0,453.763995310233),(309.838544025498,0,0,-309.838544025498),(319.318695086413,101.825652988168,-9.48153765138034,-288.428305606832),(444.283844249319,-101.825652988168,9.48153765138034,432.353756891566))
    and finite is:  7.2686125738634
    with Born:  0.058216523860873
    factor:  0.00104984282098878 and AlphaQCD()= 0.113307297485655
    flavours:  (u,ub,Z,P)
Momenta are:  ((457.545615631769,0,0,457.545615631769),(956.705801478254,0,0,-956.705801478253),(958.797824430804,-13.8874681108246,-9.45142991859676,-954.303881602421),(455.453592679219,13.8874681108246,9.45142991859676,455.143695755937))
    and finite is:  59.3281923214333
    with Born:  6.97342155023277
    factor:  0.12575461512845 and AlphaQCD()= 0.113307297485655
    flavours:  (u,ub,Z,P)
Momenta are:  ((634.362669100022,0,0,634.362669100022),(600.478020998727,0,0,-600.478020998727),(637.549625069321,-51.2517328013351,37.2634031010314,627.804941607234),(597.291065029429,51.2517328013351,-37.2634031010314,-593.920293505938))
    and finite is:  19.4064393695375
    with Born:  0.424366922595723
    factor:  0.00765278545687357 and AlphaQCD()= 0.113307297485655
    flavours:  (u,ub,Z,P)
Momenta are:  ((455.002770751106,0,0,455.002770751106),(13.7877876216307,0,0,-13.7877876216308),(425.842213172283,8.21678687793823,-32.6880624426065,414.596655935451),(42.9483452004532,-8.21678687793823,32.6880624426065,26.6183271940235))
    and finite is:  7.42185329124433
    with Born:  0.0253111723011454
    factor:  0.000456446911785246 and AlphaQCD()= 0.113307297485655
    flavours:  (u,ub,Z,P)
Momenta are:  ((422.70868010861,0,0,422.70868010861),(372.09325035795,0,0,-372.09325035795),(427.484849794129,-39.6474211783161,12.6604511180459,415.566978213074),(367.317080672431,39.6474211783161,-12.6604511180459,-364.951548462414))
    and finite is:  26.1091663035643
    with Born:  0.406142862373809
    factor:  0.0073241433888764 and AlphaQCD()= 0.113307297485655
    flavours:  (u,ub,Z,P)
Momenta are:  ((900.113145449997,0,0,900.113145449997),(134.88475877935,0,0,-134.884758779351),(895.477517654759,62.953775850168,18.13864147932,888.410163169502),(139.520386574588,-62.953775850168,-18.13864147932,-123.181776498855))
    and finite is:  14.7985305563394
    with Born:  0.12498918226337
    factor:  0.00225398197965318 and AlphaQCD()= 0.113307297485655
    flavours:  (u,ub,Z,P)
Momenta are:  ((192.191384250544,0,0,192.191384250544),(409.794737904358,0,0,-409.794737904358),(326.596223647376,-260.346044590339,69.2935059554846,-160.524957578345),(275.389898507526,260.346044590339,-69.2935059554846,-57.0783960754692))
    and finite is:  1.83115125758146
    with Born:  0.00263453878734462
    factor:  4.75097351933985e-05 and AlphaQCD()= 0.113307297485655
    flavours:  (u,ub,Z,P)
Momenta are:  ((210.405282886026,0,0,210.405282886026),(483.069657209548,0,0,-483.069657209548),(487.105297506836,19.6317426811647,2.26771033765932,-478.08560387716),(206.369642588738,-19.6317426811647,-2.26771033765932,205.421229553638))
    and finite is:  40.1645530208909
    with Born:  1.16854626119355
    factor:  0.0210728814080198 and AlphaQCD()= 0.113307297485655
    flavours:  (u,ub,Z,P)
Momenta are:  ((901.56002354745,0,0,901.56002354745),(732.191780679905,0,0,-732.191780679905),(887.09133320919,340.748055898889,-344.501356218915,737.44520679543),(746.660471018165,-340.748055898889,344.501356218915,-568.076963927885))
    and finite is:  -12.5876923993521
    with Born:  0.0103945892592615
    factor:  0.00018744995728433 and AlphaQCD()= 0.113307297485655
    flavours:  (u,ub,Z,P)
Momenta are:  ((334.154829171144,0,0,334.154829171144),(386.811848480537,0,0,-386.811848480537),(355.705156731868,-217.074387104257,239.069194103892,118.049189009115),(365.261520919813,217.074387104257,-239.069194103892,-170.706208318508))
    and finite is:  -0.761819743919999
    with Born:  0.00332709817112302
    factor:  5.99989470004406e-05 and AlphaQCD()= 0.113307297485655
    flavours:  (u,ub,Z,P)
Momenta are:  ((735.451367274119,0,0,735.451367274119),(595.030618065318,0,0,-595.030618065318),(599.59277979593,-112.787001405026,-20.8584084056905,-581.412368549634),(730.889205543507,112.787001405026,20.8584084056905,721.833117758435))
    and finite is:  5.83135706399938
    with Born:  0.147336147050366
    factor:  0.00265697410279307 and AlphaQCD()= 0.113307297485655
    flavours:  (u,ub,Z,P)
Momenta are:  ((563.82245667473,0,0,563.82245667473),(11.7314406588202,0,0,-11.7314406588204),(506.677372786103,-30.796116999191,27.0078602305601,496.718186060472),(68.876524547447,30.796116999191,-27.0078602305601,55.3728299554369))
    and finite is:  6.56229502242331
    with Born:  0.0172303585865724
    factor:  0.000310722232546988 and AlphaQCD()= 0.113307297485655
    flavours:  (u,ub,Z,P)
Momenta are:  ((815.352783569815,0,0,815.352783569815),(815.478193233185,0,0,-815.478193233185),(818.026190054216,153.129696698248,34.2493919617435,-797.640234918105),(812.804786748784,-153.129696698248,-34.2493919617435,797.514825254735))
    and finite is:  -0.311558325232944
    with Born:  0.119188469004394
    factor:  0.00214937530155429 and AlphaQCD()= 0.113307297485655
    flavours:  (u,ub,Z,P)
Momenta are:  ((840.149765850785,0,0,840.149765850785),(189.107470586224,0,0,-189.107470586224),(200.692247425658,23.7844808514915,2.04992049132715,-177.178712264216),(828.56498901135,-23.7844808514915,-2.04992049132715,828.221007528778))
    and finite is:  39.9173605631188
    with Born:  1.2516004802088
    factor:  0.0225706327302108 and AlphaQCD()= 0.113307297485655
    flavours:  (u,ub,Z,P)
Momenta are:  ((904.925003658227,0,0,904.925003658228),(819.554323186018,0,0,-819.554323186018),(825.395846884122,130.520621806266,-305.028843217016,-750.256554619013),(899.083479960123,-130.520621806266,305.028843217016,835.627235091222))
    and finite is:  -10.7297679798648
    with Born:  0.0280485568655432
    factor:  0.000505811307709785 and AlphaQCD()= 0.113307297485655
    flavours:  (u,ub,Z,P)
Momenta are:  ((596.814425017365,0,0,596.814425017365),(992.788813788232,0,0,-992.788813788232),(993.244315909931,14.3384479713733,-97.6000384008993,-984.117744026365),(596.358922895666,-14.3384479713733,97.6000384008993,588.143355255497))
    and finite is:  9.2584753744998
    with Born:  0.271552562866763
    factor:  0.00489702046326372 and AlphaQCD()= 0.113307297485655
    flavours:  (u,ub,Z,P)
Momenta are:  ((7.73024198073324,0,0,7.7302419807333),(410.974793983188,0,0,-410.974793983188),(389.320989591158,-7.12287110542266,13.5822304363432,-378.180436122849),(29.3840463727633,7.12287110542266,-13.5822304363432,-25.0641158796058))
    and finite is:  3.94833188895395
    with Born:  0.0844941460488414
    factor:  0.00152371812609327 and AlphaQCD()= 0.113307297485655
    flavours:  (u,ub,Z,P)
Momenta are:  ((7.38990514799692,0,0,7.38990514799695),(465.29377038343,0,0,-465.29377038343),(311.315173542081,2.46694945445931,15.1343512776136,-297.265578995569),(161.368501989345,-2.46694945445931,-15.1343512776136,-160.638286239863))
    and finite is:  4.99063386337694
    with Born:  0.0875460300558677
    factor:  0.00157875402145048 and AlphaQCD()= 0.113307297485655
    flavours:  (u,ub,Z,P)
Momenta are:  ((753.935531773466,0,0,753.935531773465),(14.7189248599588,0,0,-14.7189248599587),(750.01819217188,-17.0595730803563,5.57388528157875,744.237873911426),(18.6362644615441,17.0595730803563,-5.57388528157875,-5.02126699791906))
    and finite is:  18.3179310266896
    with Born:  0.15811637051846
    factor:  0.00285137836237546 and AlphaQCD()= 0.113307297485655
    flavours:  (u,ub,Z,P)
Momenta are:  ((669.597258759892,0,0,669.597258759892),(537.99347703213,0,0,-537.99347703213),(563.27920805285,232.143183595704,-375.670214723138,-337.564393724824),(644.311527739172,-232.143183595704,375.670214723138,469.168175452586))
    and finite is:  -7.77166684631324
    with Born:  0.00605842776708673
    factor:  0.000109254151157415 and AlphaQCD()= 0.113307297485655
    flavours:  (u,ub,Z,P)
Momenta are:  ((648.270317094908,0,0,648.270317094908),(679.564208768349,0,0,-679.564208768349),(668.093300240087,390.746049799694,-530.803968886455,-59.9845864556369),(659.74122562317,-390.746049799694,530.803968886455,28.6906947821955))
    and finite is:  -9.23915365503741
    with Born:  0.0023117218701165
    factor:  4.16882432771928e-05 and AlphaQCD()= 0.113307297485655
    flavours:  (u,ub,Z,P)
Momenta are:  ((724.082190557415,0,0,724.082190557415),(910.524289063252,0,0,-910.524289063253),(912.496020666517,47.2768345834565,-46.3414183837272,-905.511558839765),(722.11045895415,-47.2768345834565,46.3414183837272,719.069460333928))
    and finite is:  19.9958467612434
    with Born:  0.674233567846087
    factor:  0.0121587347359398 and AlphaQCD()= 0.113307297485655
    flavours:  (u,ub,Z,P)
Momenta are:  ((612.600806845784,0,0,612.600806845784),(162.846404779477,0,0,-162.846404779477),(339.220646602117,-264.604691367925,-138.975355067961,132.006350897286),(436.226565023144,264.604691367925,138.975355067961,317.748051169021))
    and finite is:  0.706451170266645
    with Born:  0.00277564348733355
    factor:  5.00543350160395e-05 and AlphaQCD()= 0.113307297485655
    flavours:  (u,ub,Z,P)
Momenta are:  ((571.836704995706,0,0,571.836704995706),(927.999750926256,0,0,-927.999750926256),(924.475802607549,17.7089852548147,-182.615121449635,-901.486794397062),(575.360653314413,-17.7089852548147,182.615121449635,545.323748466512))
    and finite is:  -2.37852583814732
    with Born:  0.0686432168939875
    factor:  0.00123787171899769 and AlphaQCD()= 0.113307297485655
    flavours:  (u,ub,Z,P)
Momenta are:  ((988.753080000431,0,0,988.753080000431),(975.334830011995,0,0,-975.334830011995),(981.580968495046,584.755853796416,-689.692163439399,-370.90609385533),(982.506941517379,-584.755853796416,689.692163439399,384.324343843765))
    and finite is:  -17.2203829698889
    with Born:  0.00305556231106447
    factor:  5.51022277458739e-05 and AlphaQCD()= 0.113307297485655
    flavours:  (u,ub,Z,P)
Momenta are:  ((649.505638741256,0,0,649.505638741256),(538.009687982406,0,0,-538.009687982406),(645.775001052854,204.470705363954,-197.903511161579,572.482405414297),(541.740325670808,-204.470705363954,197.903511161579,-460.986454655447))
    and finite is:  -5.57865432455025
    with Born:  0.0171581787617256
    factor:  0.00030942058370384 and AlphaQCD()= 0.113307297485655
    flavours:  (u,ub,Z,P)
Momenta are:  ((140.984596693407,0,0,140.984596693407),(567.564192980428,0,0,-567.564192980428),(156.354232908568,-14.0972100639627,16.0375797269274,125.201966676173),(552.194556765268,14.0972100639627,-16.0375797269274,-551.781562963194))
    and finite is:  36.1708478750923
    with Born:  0.787490240259473
    factor:  0.0142011394790747 and AlphaQCD()= 0.113307297485655
    flavours:  (u,ub,Z,P)
Momenta are:  ((628.995179949225,0,0,628.995179949225),(20.2380486574837,0,0,-20.2380486574838),(127.063504818815,-15.1051898164687,-7.55187666320478,86.8605679382382),(522.169723787893,15.1051898164687,7.55187666320478,521.896563353503))
    and finite is:  20.5194078584434
    with Born:  0.203817930773065
    factor:  0.00367553363237999 and AlphaQCD()= 0.113307297485655
    flavours:  (u,ub,Z,P)
Momenta are:  ((996.582164654631,0,0,996.582164654631),(816.833506254543,0,0,-816.833506254542),(820.17172565807,-91.2340258885122,-77.1137345958457,-806.285498835265),(993.243945251104,91.2340258885122,77.1137345958457,986.034157235353))
    and finite is:  5.0047842502
    with Born:  0.254275056954334
    factor:  0.0045854480033535 and AlphaQCD()= 0.113307297485655
    flavours:  (u,ub,Z,P)
Momenta are:  ((117.52992993977,0,0,117.52992993977),(424.483096806756,0,0,-424.483096806756),(424.679992862658,6.71497827674958,53.2596948331905,-411.286070657742),(117.333033883868,-6.71497827674958,-53.2596948331905,104.332903790756))
    and finite is:  14.9444858502608
    with Born:  0.0757386406881045
    factor:  0.00136582645140199 and AlphaQCD()= 0.113307297485655
    flavours:  (u,ub,Z,P)
Momenta are:  ((427.846786747768,0,0,427.846786747768),(41.5355197646112,0,0,-41.5355197646113),(130.25505964033,19.8617657548649,-71.9478793700054,55.4996854351794),(339.12724687205,-19.8617657548649,71.9478793700054,330.811581547978))
    and finite is:  7.03792222587626
    with Born:  0.0122922796894457
    factor:  0.000221671799168073 and AlphaQCD()= 0.113307297485655
    flavours:  (u,ub,Z,P)
Momenta are:  ((12.4638034135984,0,0,12.4638034135983),(500.723543141987,0,0,-500.723543141987),(220.369930843684,33.7990949121894,9.09111865212104,-197.541643131417),(292.817415711901,-33.7990949121894,-9.09111865212104,-290.718096596972))
    and finite is:  7.13255912266108
    with Born:  0.0232025427299121
    factor:  0.00041842111651835 and AlphaQCD()= 0.113307297485655
    flavours:  (u,ub,Z,P)
Momenta are:  ((12.1005122073962,0,0,12.1005122073963),(882.408094774553,0,0,-882.408094774554),(822.76717602334,-5.97856588077531,-46.8794119108888,-816.331565625488),(71.7414309586092,5.97856588077531,46.8794119108888,-53.976016941669))
    and finite is:  8.57994606536114
    with Born:  0.0200650041452855
    factor:  0.000361840576489588 and AlphaQCD()= 0.113307297485655
    flavours:  (u,ub,Z,P)
Momenta are:  ((974.288759961365,0,0,974.288759961364),(916.884883259999,0,0,-916.884883259999),(934.750842709029,-107.660823164142,-832.633809651324,-400.716914707406),(956.422800512334,107.660823164142,832.633809651324,458.120791408772))
    and finite is:  -16.4602135984091
    with Born:  0.00345063724882666
    factor:  6.22267786406239e-05 and AlphaQCD()= 0.113307297485655
    flavours:  (u,ub,Z,P)
Momenta are:  ((31.6030274135695,0,0,31.6030274135695),(607.773744317784,0,0,-607.773744317784),(260.98629608665,-64.6005528145671,-95.3256515224576,-215.727738339648),(378.390475644704,64.6005528145671,95.3256515224576,-360.442978564567))
    and finite is:  5.18838758506043
    with Born:  0.00434157036678065
    factor:  7.82933466153873e-05 and AlphaQCD()= 0.113307297485655
    flavours:  (u,ub,Z,P)
Momenta are:  ((661.224931431887,0,0,661.224931431887),(972.114896186717,0,0,-972.114896186717),(882.916818713161,7.56700602617034,-728.666702506836,-490.116830409263),(750.423008905443,-7.56700602617034,728.666702506836,179.226865654433))
    and finite is:  -13.0479737210634
    with Born:  0.00319502482350182
    factor:  5.76172133164537e-05 and AlphaQCD()= 0.113307297485655
    flavours:  (u,ub,Z,P)
Momenta are:  ((306.351436833352,0,0,306.351436833352),(13.7592443369542,0,0,-13.7592443369543),(240.302881506239,-6.96707961051164,32.1542453974663,219.881469821951),(79.8077996640671,6.96707961051164,-32.1542453974663,72.7107226744459))
    and finite is:  4.13341277211876
    with Born:  0.0195219783616921
    factor:  0.000352047966372919 and AlphaQCD()= 0.113307297485655
    flavours:  (u,ub,Z,P)
Momenta are:  ((220.007699173034,0,0,220.007699173034),(218.439750470458,0,0,-218.439750470458),(227.994306357602,-1.83539683119521,-65.8848900402144,-198.297851527909),(210.45314328589,1.83539683119521,65.8848900402144,199.865800230486))
    and finite is:  11.5799099237918
    with Born:  0.0475917812309303
    factor:  0.000858242412115939 and AlphaQCD()= 0.113307297485655
    flavours:  (u,ub,Z,P)
Momenta are:  ((355.228901407335,0,0,355.228901407335),(414.706482880634,0,0,-414.706482880634),(366.555803088156,185.20390226767,-119.091741484278,278.504308905468),(403.379581199813,-185.20390226767,119.091741484278,-337.981890378768))
    and finite is:  -0.498917312268846
    with Born:  0.0114178559237165
    factor:  0.000205902951217848 and AlphaQCD()= 0.113307297485655
    flavours:  (u,ub,Z,P)
Momenta are:  ((5.67775822883154,0,0,5.67775822883143),(677.68461514312,0,0,-677.68461514312),(597.820300753296,9.26876003249245,-23.5138308929403,-590.283934596902),(85.5420726186557,-9.26876003249245,23.5138308929403,-81.7229223173868))
    and finite is:  4.38955057564152
    with Born:  0.0327432014904029
    factor:  0.000590471789470619 and AlphaQCD()= 0.113307297485655
    flavours:  (u,ub,Z,P)
                                                            
         *******************************************        
         *              C O L L I E R              *        
         *                                         *        
         *        Complex One-Loop Library         *        
         *      In Extended Regularizations        *        
         *                                         *        
         *    by A.Denner, S.Dittmaier, L.Hofer    *        
         *                                         *        
         *               version 1.0               *        
         *                                         *        
         *******************************************        
                                                            
                                                           
 ***********************************************************
                                                            
   COLLIER: information on settings and internal parameters 
     is written to the file output_cll/InfOut.cll
                                                            
 ***********************************************************
                                                            
