(run){
  % general setting
  EVENTS 1M; ERROR 0.001; MI_HANDLER None; FRAGMENTATION Off;
  RANDOM_SEED 0;  SHOWER_GENERATOR None; INIT_ONLY 2; SHERPA_LDADD SherpaMain SherpaSM;
  ME_SIGNAL_GENERATOR Amegic Internal; PDF_SET None;

  SCALES VAR{sqr(91.2)};
  USE_DUMMY_VIRTUAL 1 1.0 1.0 1.0;

  % collider setup
  BEAM_1  11; BEAM_ENERGY_1 = 10000.;
  BEAM_2 -11; BEAM_ENERGY_2 = 10000.;

}(run)

(processes){
  Process 11 -11 -> 1 -1 21 21;
  Loop_Generator Internal;
  Integrator Rambo;
  NLO_QCD_Mode Fixed_Order;
  NLO_QCD_Part BVI;
  Order (*,2);
  End process;
}(processes)

(selector){
# NJetFinder 4 200.0 0.0 0.4 -1;
}(selector)
