1.0000000000000000e+03   0.0000000000000000e+00   0.0000000000000000e+00   8.6550913785022351e+02   1.0000000000000000e+03   0.0000000000000000e+00   0.0000000000000000e+00   -8.6550913785022351e+02   9.9999999999999955e+02   2.1842509791638344e+02   8.7593270704724500e+02   -3.9294703119517658e+02   1.0000000000000000e+03   -2.1842509791638346e+02   -8.7593270704724512e+02   3.9294703119517646e+02   1.6314632609909310e-02
1.0000000000000000e+03   0.0000000000000000e+00   0.0000000000000000e+00   8.6550913785022351e+02   1.0000000000000000e+03   0.0000000000000000e+00   0.0000000000000000e+00   -8.6550913785022351e+02   1.0000000000000000e+03   -5.5513021579817416e+02   -7.6952089952780159e+02   2.6276040169286534e+02   1.0000000000000003e+03   5.5513021579817428e+02   7.6952089952780182e+02   -2.6276040169286534e+02   1.4560058237066777e-02
1.0000000000000000e+03   0.0000000000000000e+00   0.0000000000000000e+00   8.6550913785022351e+02   1.0000000000000000e+03   0.0000000000000000e+00   0.0000000000000000e+00   -8.6550913785022351e+02   9.9999999999999807e+02   -4.7381573930422815e+02   5.5228776708888415e+02   -6.6321328960716653e+02   1.0000000000000023e+03   4.7381573930422786e+02   -5.5228776708888415e+02   6.6321328960716653e+02   2.4236782557512784e-02
1.0000000000000000e+03   0.0000000000000000e+00   0.0000000000000000e+00   8.6550913785022351e+02   1.0000000000000000e+03   0.0000000000000000e+00   0.0000000000000000e+00   -8.6550913785022351e+02   1.0000000000000001e+03   8.8815006632523989e+02   1.1909278166019713e+02   -4.0789872400255058e+02   1.0000000000000001e+03   -8.8815006632523989e+02   -1.1909278166019713e+02   4.0789872400255047e+02   1.6578734907592270e-02
1.0000000000000000e+03   0.0000000000000000e+00   0.0000000000000000e+00   8.6550913785022351e+02   1.0000000000000000e+03   0.0000000000000000e+00   0.0000000000000000e+00   -8.6550913785022351e+02   1.0000000000000013e+03   8.9739274338952202e+02   -4.0109242957602140e+02   -5.6445788581901759e+01   1.0000000000000013e+03   -8.9739274338952225e+02   4.0109242957602169e+02   5.6445788581902974e+01   1.3343383190588441e-02
1.0000000000000000e+03   0.0000000000000000e+00   0.0000000000000000e+00   8.6550913785022351e+02   1.0000000000000000e+03   0.0000000000000000e+00   0.0000000000000000e+00   -8.6550913785022351e+02   1.0000000000000003e+03   -3.6888879011545606e+02   8.7536587523925027e+02   -2.5890277131343311e+02   1.0000000000000000e+03   3.6888879011545606e+02   -8.7536587523925050e+02   2.5890277131343311e+02   1.4521221481749344e-02
1.0000000000000000e+03   0.0000000000000000e+00   0.0000000000000000e+00   8.6550913785022351e+02   1.0000000000000000e+03   0.0000000000000000e+00   0.0000000000000000e+00   -8.6550913785022351e+02   1.0000000000000001e+03   2.3131075816157502e+02   -9.5235168215821375e+02   9.4321824882354079e+01   1.0000000000000001e+03   -2.3131075816157482e+02   9.5235168215821375e+02   -9.4321824882354079e+01   1.3444619810864486e-02
1.0000000000000000e+03   0.0000000000000000e+00   0.0000000000000000e+00   8.6550913785022351e+02   1.0000000000000000e+03   0.0000000000000000e+00   0.0000000000000000e+00   -8.6550913785022351e+02   1.0000000000000000e+03   -2.6725374694361045e+02   9.1901127829789129e+02   -2.3101667711634229e+02   1.0000000000000002e+03   2.6725374694361039e+02   -9.1901127829789129e+02   2.3101667711634229e+02   1.4260422274957166e-02
1.0000000000000000e+03   0.0000000000000000e+00   0.0000000000000000e+00   8.6550913785022351e+02   1.0000000000000000e+03   0.0000000000000000e+00   0.0000000000000000e+00   -8.6550913785022351e+02   1.0000000000000010e+03   -3.6552508285498271e+02   -2.7817312755713311e+02   -8.7085367594615980e+02   9.9999999999999693e+02   3.6552508285498232e+02   2.7817312755713448e+02   8.7085367594615707e+02   4.0279733229940828e-02
1.0000000000000000e+03   0.0000000000000000e+00   0.0000000000000000e+00   8.6550913785022351e+02   1.0000000000000000e+03   0.0000000000000000e+00   0.0000000000000000e+00   -8.6550913785022351e+02   9.9999999999999977e+02   -3.1358233311571388e+02   4.0799062090023699e+02   8.3939548105475603e+02   1.0000000000000005e+03   3.1358233311571382e+02   -4.0799062090023710e+02   -8.3939548105475569e+02   3.6669097913999887e-02
1.0000000000000000e+03   0.0000000000000000e+00   0.0000000000000000e+00   8.6550913785022351e+02   1.0000000000000000e+03   0.0000000000000000e+00   0.0000000000000000e+00   -8.6550913785022351e+02   1.0000000000000001e+03   7.4572161854203145e+01   -5.8996672127140425e+02   -7.8469947143391141e+02   1.0000000000000001e+03   -7.4572161854203046e+01   5.8996672127140425e+02   7.8469947143391141e+02   3.1667867359581027e-02
1.0000000000000000e+03   0.0000000000000000e+00   0.0000000000000000e+00   8.6550913785022351e+02   1.0000000000000000e+03   0.0000000000000000e+00   0.0000000000000000e+00   -8.6550913785022351e+02   9.9999999999999898e+02   4.3013834635805688e+02   7.1373673704869066e+02   -5.2434327799585981e+02   9.9999999999999977e+02   -4.3013834635805637e+02   -7.1373673704868963e+02   5.2434327799586129e+02   1.9208941506298594e-02
1.0000000000000000e+03   0.0000000000000000e+00   0.0000000000000000e+00   8.6550913785022351e+02   1.0000000000000000e+03   0.0000000000000000e+00   0.0000000000000000e+00   -8.6550913785022351e+02   9.9999999999999955e+02   -7.7844781483263233e+01   -2.5793025954350435e+02   -9.4698847469630994e+02   1.0000000000000000e+03   7.7844781483263233e+01   2.5793025954350446e+02   9.4698847469630971e+02   5.2515403786582621e-02
1.0000000000000000e+03   0.0000000000000000e+00   0.0000000000000000e+00   8.6550913785022351e+02   1.0000000000000000e+03   0.0000000000000000e+00   0.0000000000000000e+00   -8.6550913785022351e+02   9.9999999999999920e+02   -1.3973707722278851e+02   9.7425438913289327e+02   -2.6017965034320635e+01   1.0000000000000005e+03   1.3973707722279048e+02   -9.7425438913289281e+02   2.6017965034320515e+01   1.3299143920211393e-02
1.0000000000000000e+03   0.0000000000000000e+00   0.0000000000000000e+00   8.6550913785022351e+02   1.0000000000000000e+03   0.0000000000000000e+00   0.0000000000000000e+00   -8.6550913785022351e+02   9.9999999999999989e+02   -8.7757648199743312e+02   -8.2160354348282041e+01   -4.3873020686792631e+02   9.9999999999999932e+02   8.7757648199743255e+02   8.2160354348282297e+01   4.3873020686792614e+02   1.7171256369267356e-02
1.0000000000000000e+03   0.0000000000000000e+00   0.0000000000000000e+00   8.6550913785022351e+02   1.0000000000000000e+03   0.0000000000000000e+00   0.0000000000000000e+00   -8.6550913785022351e+02   9.9999999999999989e+02   4.6532605488368677e+02   -8.1322189963801770e+02   3.0251744510939778e+02   1.0000000000000001e+03   -4.6532605488368682e+02   8.1322189963801793e+02   -3.0251744510939778e+02   1.5001328247829328e-02
1.0000000000000000e+03   0.0000000000000000e+00   0.0000000000000000e+00   8.6550913785022351e+02   1.0000000000000000e+03   0.0000000000000000e+00   0.0000000000000000e+00   -8.6550913785022351e+02   9.9999999999999943e+02   6.7446718482330448e+02   -5.2507182766283108e+02   4.8863953216183927e+02   1.0000000000000005e+03   -6.7446718482330471e+02   5.2507182766283108e+02   -4.8863953216183904e+02   1.8282271799553679e-02
1.0000000000000000e+03   0.0000000000000000e+00   0.0000000000000000e+00   8.6550913785022351e+02   1.0000000000000000e+03   0.0000000000000000e+00   0.0000000000000000e+00   -8.6550913785022351e+02   9.9999999999999875e+02   -3.8334906223818933e+02   6.7919898753096390e+02   6.0092198480169895e+02   1.0000000000000030e+03   3.8334906223818729e+02   -6.7919898753096675e+02   -6.0092198480169634e+02   2.1654256298075672e-02
1.0000000000000000e+03   0.0000000000000000e+00   0.0000000000000000e+00   8.6550913785022351e+02   1.0000000000000000e+03   0.0000000000000000e+00   0.0000000000000000e+00   -8.6550913785022351e+02   1.0000000000000000e+03   2.2199586301253981e+02   9.5873106158177575e+02   -3.0456335360623761e+01   9.9999999999999989e+02   -2.2199586301253981e+02   -9.5873106158177575e+02   3.0456335360623751e+01   1.3303556499845005e-02
1.0000000000000000e+03   0.0000000000000000e+00   0.0000000000000000e+00   8.6550913785022351e+02   1.0000000000000000e+03   0.0000000000000000e+00   0.0000000000000000e+00   -8.6550913785022351e+02   1.0000000000000008e+03   5.3177651075413121e+02   -8.2574150632246335e+02   -6.8845532509175570e+01   9.9999999999999852e+02   -5.3177651075413132e+02   8.2574150632246301e+02   6.8845532509173836e+01   1.3370848714149343e-02
1.0000000000000000e+03   0.0000000000000000e+00   0.0000000000000000e+00   8.6550913785022351e+02   1.0000000000000000e+03   0.0000000000000000e+00   0.0000000000000000e+00   -8.6550913785022351e+02   1.0000000000000003e+03   -2.2769393177754640e+02   9.3046141395281370e+02   2.2753467994267078e+02   9.9999999999999977e+02   2.2769393177754665e+02   -9.3046141395281359e+02   -2.2753467994267066e+02   1.4230264211620495e-02
1.0000000000000000e+03   0.0000000000000000e+00   0.0000000000000000e+00   8.6550913785022351e+02   1.0000000000000000e+03   0.0000000000000000e+00   0.0000000000000000e+00   -8.6550913785022351e+02   9.9999999999999989e+02   4.6887600604171774e+02   -8.4268841512681036e+02   -1.9851077041166178e+02   9.9999999999999989e+02   -4.6887600604171774e+02   8.4268841512681036e+02   1.9851077041166178e+02   1.3998939941688890e-02
1.0000000000000000e+03   0.0000000000000000e+00   0.0000000000000000e+00   8.6550913785022351e+02   1.0000000000000000e+03   0.0000000000000000e+00   0.0000000000000000e+00   -8.6550913785022351e+02   9.9999999999999966e+02   8.9778854638934206e+02   3.9781336514737745e+02   -7.1381037273435354e+01   9.9999999999999977e+02   -8.9778854638934206e+02   -3.9781336514737757e+02   7.1381037273435169e+01   1.3377142385167145e-02
1.0000000000000000e+03   0.0000000000000000e+00   0.0000000000000000e+00   8.6550913785022351e+02   1.0000000000000000e+03   0.0000000000000000e+00   0.0000000000000000e+00   -8.6550913785022351e+02   9.9999999999999966e+02   -3.4309408279855319e+02   -3.4400628916218415e+02   -8.5634170946269103e+02   1.0000000000000002e+03   3.4309408279855279e+02   3.4400628916218415e+02   8.5634170946269103e+02   3.8534692072130276e-02
1.0000000000000000e+03   0.0000000000000000e+00   0.0000000000000000e+00   8.6550913785022351e+02   1.0000000000000000e+03   0.0000000000000000e+00   0.0000000000000000e+00   -8.6550913785022351e+02   9.9999999999999966e+02   4.4189764512583088e+02   -8.6890870597507353e+02   1.3819960894651322e+02   1.0000000000000008e+03   -4.4189764512583076e+02   8.6890870597507376e+02   -1.3819960894651359e+02   1.3627438912811086e-02
1.0000000000000000e+03   0.0000000000000000e+00   0.0000000000000000e+00   8.6550913785022351e+02   1.0000000000000000e+03   0.0000000000000000e+00   0.0000000000000000e+00   -8.6550913785022351e+02   1.0000000000000005e+03   6.3473890287742427e+02   2.8322052050033039e+02   -6.9732894815968052e+02   1.0000000000000003e+03   -6.3473890287742381e+02   -2.8322052050033039e+02   6.9732894815968052e+02   2.5947129601513338e-02
1.0000000000000000e+03   0.0000000000000000e+00   0.0000000000000000e+00   8.6550913785022351e+02   1.0000000000000000e+03   0.0000000000000000e+00   0.0000000000000000e+00   -8.6550913785022351e+02   9.9999999999999704e+02   -8.5603140789094664e+02   -1.8342511195193200e+02   -4.5048913084519495e+02   1.0000000000000018e+03   8.5603140789094823e+02   1.8342511195193356e+02   4.5048913084519506e+02   1.7415307539534901e-02
1.0000000000000000e+03   0.0000000000000000e+00   0.0000000000000000e+00   8.6550913785022351e+02   1.0000000000000000e+03   0.0000000000000000e+00   0.0000000000000000e+00   -8.6550913785022351e+02   9.9999999999999682e+02   2.9576828241615317e+02   9.0317034972663407e+02   -2.5725365399010974e+02   1.0000000000000009e+03   -2.9576828241615596e+02   -9.0317034972663248e+02   2.5725365399011542e+02   1.4504827081528794e-02
1.0000000000000000e+03   0.0000000000000000e+00   0.0000000000000000e+00   8.6550913785022351e+02   1.0000000000000000e+03   0.0000000000000000e+00   0.0000000000000000e+00   -8.6550913785022351e+02   9.9999999999999886e+02   -1.9793562425144049e+01   -9.6447779552088036e+02   -1.9689031675962337e+02   9.9999999999999943e+02   1.9793562425144238e+01   9.6447779552087991e+02   1.9689031675962428e+02   1.3987060524471049e-02
1.0000000000000000e+03   0.0000000000000000e+00   0.0000000000000000e+00   8.6550913785022351e+02   1.0000000000000000e+03   0.0000000000000000e+00   0.0000000000000000e+00   -8.6550913785022351e+02   9.9999999999999841e+02   -4.4878213400888626e+02   6.0391221318210762e+02   -6.3502727103953146e+02   9.9999999999999704e+02   4.4878213400889223e+02   -6.0391221318210683e+02   6.3502727103953021e+02   2.2990533622712358e-02
1.0000000000000000e+03   0.0000000000000000e+00   0.0000000000000000e+00   8.6550913785022351e+02   1.0000000000000000e+03   0.0000000000000000e+00   0.0000000000000000e+00   -8.6550913785022351e+02   1.0000000000000000e+03   -8.0651844352307558e+02   5.6101990680592417e+02   -6.4495460495972765e+01   1.0000000000000000e+03   8.0651844352307558e+02   -5.6101990680592417e+02   6.4495460495972807e+01   1.3360587534359043e-02
1.0000000000000000e+03   0.0000000000000000e+00   0.0000000000000000e+00   8.6550913785022351e+02   1.0000000000000000e+03   0.0000000000000000e+00   0.0000000000000000e+00   -8.6550913785022351e+02   9.9999999999999909e+02   2.4562340230682551e+02   -9.3924412508832836e+02   1.6390429441072604e+02   9.9999999999999852e+02   -2.4562340230682472e+02   9.3924412508832802e+02   -1.6390429441072601e+02   1.3768288493512323e-02
1.0000000000000000e+03   0.0000000000000000e+00   0.0000000000000000e+00   8.6550913785022351e+02   1.0000000000000000e+03   0.0000000000000000e+00   0.0000000000000000e+00   -8.6550913785022351e+02   1.0000000000000005e+03   5.8954139670222457e+02   -4.2727411125405524e+02   6.6276147702355718e+02   1.0000000000000000e+03   -5.8954139670222469e+02   4.2727411125405513e+02   -6.6276147702355718e+02   2.4215685994666419e-02
1.0000000000000000e+03   0.0000000000000000e+00   0.0000000000000000e+00   8.6550913785022351e+02   1.0000000000000000e+03   0.0000000000000000e+00   0.0000000000000000e+00   -8.6550913785022351e+02   1.0000000000000000e+03   7.7311010042444889e+02   2.2483338276710074e+02   5.6667955902361734e+02   1.0000000000000003e+03   -7.7311010042444889e+02   -2.2483338276710083e+02   -5.6667955902361780e+02   2.0475185337017206e-02
1.0000000000000000e+03   0.0000000000000000e+00   0.0000000000000000e+00   8.6550913785022351e+02   1.0000000000000000e+03   0.0000000000000000e+00   0.0000000000000000e+00   -8.6550913785022351e+02   9.9999999999999989e+02   2.9079843875574704e+02   3.3799480513776808e+02   -8.7782161041814300e+02   9.9999999999999977e+02   -2.9079843875574704e+02   -3.3799480513776803e+02   8.7782161041814300e+02   4.1171245693306949e-02
1.0000000000000000e+03   0.0000000000000000e+00   0.0000000000000000e+00   8.6550913785022351e+02   1.0000000000000000e+03   0.0000000000000000e+00   0.0000000000000000e+00   -8.6550913785022351e+02   1.0000000000000008e+03   2.3560110574155053e+02   -9.5426756423558322e+02   5.6925695614949575e+01   1.0000000000000005e+03   -2.3560110574155064e+02   9.5426756423558356e+02   -5.6925695614950271e+01   1.3344344092928293e-02
1.0000000000000000e+03   0.0000000000000000e+00   0.0000000000000000e+00   8.6550913785022351e+02   1.0000000000000000e+03   0.0000000000000000e+00   0.0000000000000000e+00   -8.6550913785022351e+02   9.9999999999999966e+02   6.4885730982192297e+02   -1.3423988497893214e+02   7.2824367128832637e+02   9.9999999999999977e+02   -6.4885730982192274e+02   1.3423988497893191e+02   -7.2824367128832637e+02   2.7722694213682637e-02
1.0000000000000000e+03   0.0000000000000000e+00   0.0000000000000000e+00   8.6550913785022351e+02   1.0000000000000000e+03   0.0000000000000000e+00   0.0000000000000000e+00   -8.6550913785022351e+02   1.0000000000000003e+03   8.9082939684823975e+02   -2.0153071150927568e+02   3.6767289542413494e+02   1.0000000000000003e+03   -8.9082939684823975e+02   2.0153071150927568e+02   -3.6767289542413482e+02   1.5900327392774211e-02
1.0000000000000000e+03   0.0000000000000000e+00   0.0000000000000000e+00   8.6550913785022351e+02   1.0000000000000000e+03   0.0000000000000000e+00   0.0000000000000000e+00   -8.6550913785022351e+02   9.9999999999999989e+02   -8.2869996049754388e+02   -1.9096539427859256e+02   -4.9614876162234924e+02   1.0000000000000000e+03   8.2869996049754400e+02   1.9096539427859256e+02   4.9614876162234935e+02   1.8467391606325396e-02
1.0000000000000000e+03   0.0000000000000000e+00   0.0000000000000000e+00   8.6550913785022351e+02   1.0000000000000000e+03   0.0000000000000000e+00   0.0000000000000000e+00   -8.6550913785022351e+02   1.0000000000000009e+03   -6.3810659569896359e+02   -6.2230885730732632e+02   -4.1824234439177746e+02   1.0000000000000005e+03   6.3810659569896302e+02   6.2230885730732666e+02   4.1824234439177781e+02   1.6770135169502834e-02
1.0000000000000000e+03   0.0000000000000000e+00   0.0000000000000000e+00   8.6550913785022351e+02   1.0000000000000000e+03   0.0000000000000000e+00   0.0000000000000000e+00   -8.6550913785022351e+02   1.0000000000000000e+03   8.5527625912424162e+02   -2.1792882730865659e+02   -4.3633077682684404e+02   1.0000000000000001e+03   -8.5527625912424162e+02   2.1792882730865651e+02   4.3633077682684410e+02   1.7122720658063303e-02
1.0000000000000000e+03   0.0000000000000000e+00   0.0000000000000000e+00   8.6550913785022351e+02   1.0000000000000000e+03   0.0000000000000000e+00   0.0000000000000000e+00   -8.6550913785022351e+02   1.0000000000000006e+03   6.2259270777753602e+02   -6.7833021138154345e+02   3.4874266235909084e+02   1.0000000000000006e+03   -6.2259270777753579e+02   6.7833021138154379e+02   -3.4874266235909084e+02   1.5615010307718970e-02
1.0000000000000000e+03   0.0000000000000000e+00   0.0000000000000000e+00   8.6550913785022351e+02   1.0000000000000000e+03   0.0000000000000000e+00   0.0000000000000000e+00   -8.6550913785022351e+02   1.0000000000000000e+03   4.3450451865414954e+02   -2.7485003090511508e+01   8.8307723211180075e+02   9.9999999999999909e+02   -4.3450451865414954e+02   2.7485003090511498e+01   -8.8307723211180064e+02   4.1868476735821933e-02
1.0000000000000000e+03   0.0000000000000000e+00   0.0000000000000000e+00   8.6550913785022351e+02   1.0000000000000000e+03   0.0000000000000000e+00   0.0000000000000000e+00   -8.6550913785022351e+02   9.9999999999999966e+02   4.8769447987080594e+02   -5.5951942140400467e+02   -6.4689033952847967e+02   9.9999999999999966e+02   -4.8769447987080594e+02   5.5951942140400467e+02   6.4689033952847990e+02   2.3498217489163045e-02
1.0000000000000000e+03   0.0000000000000000e+00   0.0000000000000000e+00   8.6550913785022351e+02   1.0000000000000000e+03   0.0000000000000000e+00   0.0000000000000000e+00   -8.6550913785022351e+02   1.0000000000000016e+03   3.7474490463948609e+02   1.2446019846158183e+02   9.0191513760755095e+02   9.9999999999999920e+02   -3.7474490463948644e+02   -1.2446019846158089e+02   -9.0191513760755083e+02   4.4559468631674690e-02
1.0000000000000000e+03   0.0000000000000000e+00   0.0000000000000000e+00   8.6550913785022351e+02   1.0000000000000000e+03   0.0000000000000000e+00   0.0000000000000000e+00   -8.6550913785022351e+02   1.0000000000000007e+03   -9.4477384957400363e+02   -1.1917218551393817e+02   2.5015068131218476e+02   1.0000000000000018e+03   9.4477384957400261e+02   1.1917218551394022e+02   -2.5015068131218825e+02   1.4435626970436060e-02
1.0000000000000000e+03   0.0000000000000000e+00   0.0000000000000000e+00   8.6550913785022351e+02   1.0000000000000000e+03   0.0000000000000000e+00   0.0000000000000000e+00   -8.6550913785022351e+02   9.9999999999999875e+02   4.6575637974191267e+01   -2.7617395309937123e+01   9.8307832313788219e+02   9.9999999999999875e+02   -4.6575637974189519e+01   2.7617395309937702e+01   -9.8307832313788185e+02   6.1056845908432016e-02
1.0000000000000000e+03   0.0000000000000000e+00   0.0000000000000000e+00   8.6550913785022351e+02   1.0000000000000000e+03   0.0000000000000000e+00   0.0000000000000000e+00   -8.6550913785022351e+02   9.9999999999999977e+02   2.2318599068603939e+02   9.4840293578854607e+02   -1.4175642824633357e+02   1.0000000000000001e+03   -2.2318599068603930e+02   -9.4840293578854607e+02   1.4175642824633351e+02   1.3645417036155261e-02
1.0000000000000000e+03   0.0000000000000000e+00   0.0000000000000000e+00   8.6550913785022351e+02   1.0000000000000000e+03   0.0000000000000000e+00   0.0000000000000000e+00   -8.6550913785022351e+02   1.0000000000000001e+03   2.7179951498087678e+02   -6.0738322534858059e+02   7.2566220875922409e+02   1.0000000000000002e+03   -2.7179951498087678e+02   6.0738322534858071e+02   -7.2566220875922409e+02   2.7565218281583467e-02
1.0000000000000000e+03   0.0000000000000000e+00   0.0000000000000000e+00   8.6550913785022351e+02   1.0000000000000000e+03   0.0000000000000000e+00   0.0000000000000000e+00   -8.6550913785022351e+02   1.0000000000000001e+03   -5.8513115279290753e+02   -4.1980980179824320e+02   -6.7138384277949569e+02   1.0000000000000003e+03   5.8513115279290753e+02   4.1980980179824320e+02   6.7138384277949615e+02   2.4624985088183848e-02
1.0000000000000000e+03   0.0000000000000000e+00   0.0000000000000000e+00   8.6550913785022351e+02   1.0000000000000000e+03   0.0000000000000000e+00   0.0000000000000000e+00   -8.6550913785022351e+02   1.0000000000000000e+03   5.6278465964809845e+02   -4.6351899536597273e+02   -6.6166348531537801e+02   1.0000000000000005e+03   -5.6278465964809891e+02   4.6351899536597244e+02   6.6166348531537801e+02   2.4164576257313043e-02
1.0000000000000000e+03   0.0000000000000000e+00   0.0000000000000000e+00   8.6550913785022351e+02   1.0000000000000000e+03   0.0000000000000000e+00   0.0000000000000000e+00   -8.6550913785022351e+02   1.0000000000000015e+03   4.1717291632370916e+02   2.2423647890393759e+01   8.9153740129130813e+02   1.0000000000000015e+03   -4.1717291632371047e+02   -2.2423647890395380e+01   -8.9153740129130813e+02   4.3038381312195603e-02
1.0000000000000000e+03   0.0000000000000000e+00   0.0000000000000000e+00   8.6550913785022351e+02   1.0000000000000000e+03   0.0000000000000000e+00   0.0000000000000000e+00   -8.6550913785022351e+02   9.9999999999999989e+02   -2.0956634510614253e+02   -1.0900726268908511e+02   -9.5581084095122389e+02   9.9999999999999989e+02   2.0956634510614305e+02   1.0900726268908507e+02   9.5581084095122378e+02   5.4389885526111237e-02
1.0000000000000000e+03   0.0000000000000000e+00   0.0000000000000000e+00   8.6550913785022351e+02   1.0000000000000000e+03   0.0000000000000000e+00   0.0000000000000000e+00   -8.6550913785022351e+02   1.0000000000000002e+03   4.9031682056510283e+02   5.5020183618631563e+02   -6.5287238793514280e+02   1.0000000000000000e+03   -4.9031682056510283e+02   -5.5020183618631540e+02   6.5287238793514280e+02   2.3763344990262517e-02
1.0000000000000000e+03   0.0000000000000000e+00   0.0000000000000000e+00   8.6550913785022351e+02   1.0000000000000000e+03   0.0000000000000000e+00   0.0000000000000000e+00   -8.6550913785022351e+02   9.9999999999999875e+02   9.6233347695845816e+02   6.0805605433583203e+01   -1.9897727878553169e+02   9.9999999999999579e+02   -9.6233347695846066e+02   -6.0805605433581235e+01   1.9897727878552917e+02   1.4002379876100658e-02
1.0000000000000000e+03   0.0000000000000000e+00   0.0000000000000000e+00   8.6550913785022351e+02   1.0000000000000000e+03   0.0000000000000000e+00   0.0000000000000000e+00   -8.6550913785022351e+02   1.0000000000000006e+03   -8.5202986176170555e+02   -2.9285192120673651e+02   3.9706154045922443e+02   1.0000000000000002e+03   8.5202986176170555e+02   2.9285192120673668e+02   -3.9706154045922466e+02   1.6385860046523957e-02
1.0000000000000000e+03   0.0000000000000000e+00   0.0000000000000000e+00   8.6550913785022351e+02   1.0000000000000000e+03   0.0000000000000000e+00   0.0000000000000000e+00   -8.6550913785022351e+02   9.9999999999999966e+02   -4.9222824498993822e+02   4.0632592835781389e+02   -7.4965698474588055e+02   9.9999999999999943e+02   4.9222824498993782e+02   -4.0632592835781361e+02   7.4965698474588066e+02   2.9100636924673944e-02
1.0000000000000000e+03   0.0000000000000000e+00   0.0000000000000000e+00   8.6550913785022351e+02   1.0000000000000000e+03   0.0000000000000000e+00   0.0000000000000000e+00   -8.6550913785022351e+02   9.9999999999999943e+02   -7.7006688827119592e+02   7.5602250469244581e+01   6.0881547887048816e+02   9.9999999999999966e+02   7.7006688827119638e+02   -7.5602250469244510e+01   -6.0881547887048828e+02   2.1948224823210214e-02
1.0000000000000000e+03   0.0000000000000000e+00   0.0000000000000000e+00   8.6550913785022351e+02   1.0000000000000000e+03   0.0000000000000000e+00   0.0000000000000000e+00   -8.6550913785022351e+02   9.9999999999999989e+02   7.0693167128644291e+02   -6.8031934997493784e+02   8.2390498128335253e+01   1.0000000000000006e+03   -7.0693167128644291e+02   6.8031934997493818e+02   -8.2390498128335281e+01   1.3407151113174261e-02
1.0000000000000000e+03   0.0000000000000000e+00   0.0000000000000000e+00   8.6550913785022351e+02   1.0000000000000000e+03   0.0000000000000000e+00   0.0000000000000000e+00   -8.6550913785022351e+02   1.0000000000000002e+03   -2.8009086718133091e+02   -4.8474421185269716e+02   8.0990564586062669e+02   1.0000000000000002e+03   2.8009086718133096e+02   4.8474421185269671e+02   -8.0990564586062692e+02   3.3800524339749484e-02
1.0000000000000000e+03   0.0000000000000000e+00   0.0000000000000000e+00   8.6550913785022351e+02   1.0000000000000000e+03   0.0000000000000000e+00   0.0000000000000000e+00   -8.6550913785022351e+02   9.9999999999999966e+02   -8.3973699184605959e+00   -8.4417516520710501e+02   -5.0662883319646289e+02   9.9999999999999966e+02   8.3973699184606527e+00   8.4417516520710512e+02   5.0662883319646204e+02   1.8734262077569556e-02
1.0000000000000000e+03   0.0000000000000000e+00   0.0000000000000000e+00   8.6550913785022351e+02   1.0000000000000000e+03   0.0000000000000000e+00   0.0000000000000000e+00   -8.6550913785022351e+02   9.9999999999999898e+02   2.6193571965470625e+02   8.6481118150650582e+02   3.9098120045635608e+02   1.0000000000000003e+03   -2.6193571965470630e+02   -8.6481118150650559e+02   -3.9098120045635608e+02   1.6280983755947359e-02
1.0000000000000000e+03   0.0000000000000000e+00   0.0000000000000000e+00   8.6550913785022351e+02   1.0000000000000000e+03   0.0000000000000000e+00   0.0000000000000000e+00   -8.6550913785022351e+02   9.9999999999999932e+02   2.9870085838263458e+02   9.3814608195017047e+02   5.8928874943324772e+00   9.9999999999999977e+02   -2.9870085838263458e+02   -9.3814608195017058e+02   -5.8928874943327463e+00   1.3287845046769074e-02
1.0000000000000000e+03   0.0000000000000000e+00   0.0000000000000000e+00   8.6550913785022351e+02   1.0000000000000000e+03   0.0000000000000000e+00   0.0000000000000000e+00   -8.6550913785022351e+02   9.9999999999999955e+02   -2.2960508419881638e+01   3.3830889735794273e+02   -9.2433484464319133e+02   1.0000000000000002e+03   2.2960508419881524e+01   -3.3830889735794290e+02   9.2433484464319156e+02   4.8212999011467812e-02
1.0000000000000000e+03   0.0000000000000000e+00   0.0000000000000000e+00   8.6550913785022351e+02   1.0000000000000000e+03   0.0000000000000000e+00   0.0000000000000000e+00   -8.6550913785022351e+02   9.9999999999999659e+02   -2.8637849664791679e+02   -9.2064238518928710e+02   1.9944912948081225e+02   9.9999999999999318e+02   2.8637849664791372e+02   9.2064238518929244e+02   -1.9944912948081543e+02   1.4005868310610360e-02
1.0000000000000000e+03   0.0000000000000000e+00   0.0000000000000000e+00   8.6550913785022351e+02   1.0000000000000000e+03   0.0000000000000000e+00   0.0000000000000000e+00   -8.6550913785022351e+02   9.9999999999999966e+02   -9.2141966457353249e+02   -2.7830271979117629e+02   -2.0714342348728522e+02   9.9999999999999955e+02   9.2141966457353226e+02   2.7830271979117617e+02   2.0714342348728493e+02   1.4064051147180481e-02
1.0000000000000000e+03   0.0000000000000000e+00   0.0000000000000000e+00   8.6550913785022351e+02   1.0000000000000000e+03   0.0000000000000000e+00   0.0000000000000000e+00   -8.6550913785022351e+02   9.9999999999999909e+02   -8.7272506754603739e+02   -3.8402615915195031e+02   -2.4545848032546425e+02   9.9999999999999909e+02   8.7272506754608753e+02   3.8402615915194275e+02   2.4545848032546320e+02   1.4391160420277589e-02
1.0000000000000000e+03   0.0000000000000000e+00   0.0000000000000000e+00   8.6550913785022351e+02   1.0000000000000000e+03   0.0000000000000000e+00   0.0000000000000000e+00   -8.6550913785022351e+02   1.0000000000000011e+03   2.4570066498795251e+02   9.4517312763332177e+02   1.2511571453786995e+02   1.0000000000000005e+03   -2.4570066498795390e+02   -9.4517312763332154e+02   -1.2511571453786979e+02   1.3565423073419909e-02
1.0000000000000000e+03   0.0000000000000000e+00   0.0000000000000000e+00   8.6550913785022351e+02   1.0000000000000000e+03   0.0000000000000000e+00   0.0000000000000000e+00   -8.6550913785022351e+02   1.0000000000000001e+03   6.2670103096223295e+02   -6.3868995122265278e+02   -4.1072614233583909e+02   9.9999999999999989e+02   -6.2670103096223295e+02   6.3868995122265289e+02   4.1072614233583903e+02   1.6630335018525795e-02
1.0000000000000000e+03   0.0000000000000000e+00   0.0000000000000000e+00   8.6550913785022351e+02   1.0000000000000000e+03   0.0000000000000000e+00   0.0000000000000000e+00   -8.6550913785022351e+02   1.0000000000000005e+03   9.2839557171069453e+02   -3.2779832490487047e+02   -2.2182464998844647e+00   1.0000000000000002e+03   -9.2839557171069453e+02   3.2779832490487047e+02   2.2182464998844647e+00   1.3287320890531138e-02
1.0000000000000000e+03   0.0000000000000000e+00   0.0000000000000000e+00   8.6550913785022351e+02   1.0000000000000000e+03   0.0000000000000000e+00   0.0000000000000000e+00   -8.6550913785022351e+02   1.0000000000000001e+03   -5.2958837303807104e+02   -1.2956155993795005e+02   8.1983227390078650e+02   1.0000000000000001e+03   5.2958837303807093e+02   1.2956155993795014e+02   -8.1983227390078639e+02   3.4717302384750320e-02
1.0000000000000000e+03   0.0000000000000000e+00   0.0000000000000000e+00   8.6550913785022351e+02   1.0000000000000000e+03   0.0000000000000000e+00   0.0000000000000000e+00   -8.6550913785022351e+02   9.9999999999999966e+02   -7.4141250565733014e+02   -3.7016279501589668e+02   5.3165966711886119e+02   9.9999999999999977e+02   7.4141250565733014e+02   3.7016279501589668e+02   -5.3165966711886131e+02   1.9414044983159712e-02
1.0000000000000000e+03   0.0000000000000000e+00   0.0000000000000000e+00   8.6550913785022351e+02   1.0000000000000000e+03   0.0000000000000000e+00   0.0000000000000000e+00   -8.6550913785022351e+02   9.9999999999999989e+02   -4.2144231716506965e+02   6.0235413070551920e+02   6.5492814455063308e+02   9.9999999999999989e+02   4.2144231716506965e+02   -6.0235413070551908e+02   -6.5492814455063319e+02   2.3855916913409336e-02
1.0000000000000000e+03   0.0000000000000000e+00   0.0000000000000000e+00   8.6550913785022351e+02   1.0000000000000000e+03   0.0000000000000000e+00   0.0000000000000000e+00   -8.6550913785022351e+02   9.9999999999999977e+02   -7.5338566594579856e+02   4.1162618108056984e+02   4.8202585552689112e+02   9.9999999999999977e+02   7.5338566594579868e+02   -4.1162618108056984e+02   -4.8202585552689118e+02   1.8123321143667260e-02
1.0000000000000000e+03   0.0000000000000000e+00   0.0000000000000000e+00   8.6550913785022351e+02   1.0000000000000000e+03   0.0000000000000000e+00   0.0000000000000000e+00   -8.6550913785022351e+02   1.0000000000000002e+03   -9.5078512421244432e+02   -1.1119733288304765e+02   2.3025594614694256e+02   1.0000000000000005e+03   9.5078512421244432e+02   1.1119733288304747e+02   -2.3025594614694268e+02   1.4253788662060467e-02
1.0000000000000000e+03   0.0000000000000000e+00   0.0000000000000000e+00   8.6550913785022351e+02   1.0000000000000000e+03   0.0000000000000000e+00   0.0000000000000000e+00   -8.6550913785022351e+02   9.9999999999999841e+02   -6.1868754273438742e+02   -2.0884122722288805e+02   7.3687588254557829e+02   1.0000000000000010e+03   6.1868754273438753e+02   2.0884122722288856e+02   -7.3687588254557875e+02   2.8262438191159492e-02
1.0000000000000000e+03   0.0000000000000000e+00   0.0000000000000000e+00   8.6550913785022351e+02   1.0000000000000000e+03   0.0000000000000000e+00   0.0000000000000000e+00   -8.6550913785022351e+02   1.0000000000000000e+03   -6.2449646746220571e+02   -3.3218504557162902e+02   6.8485929768515291e+02   9.9999999999999989e+02   6.2449646746220571e+02   3.3218504557162896e+02   -6.8485929768515291e+02   2.5294047274569284e-02
1.0000000000000000e+03   0.0000000000000000e+00   0.0000000000000000e+00   8.6550913785022351e+02   1.0000000000000000e+03   0.0000000000000000e+00   0.0000000000000000e+00   -8.6550913785022351e+02   9.9999999999999989e+02   6.4666381736819673e+01   -9.7729622509726050e+02   1.0042583075938194e+02   9.9999999999999966e+02   -6.4666381736819758e+01   9.7729622509726062e+02   -1.0042583075938212e+02   1.3465791800930701e-02
1.0000000000000000e+03   0.0000000000000000e+00   0.0000000000000000e+00   8.6550913785022351e+02   1.0000000000000000e+03   0.0000000000000000e+00   0.0000000000000000e+00   -8.6550913785022351e+02   1.0000000000000005e+03   2.1265043071999848e+01   2.1931477047623696e+02   9.5959565932433304e+02   9.9999999999999977e+02   -2.1265043071999926e+01   -2.1931477047623758e+02   -9.5959565932433304e+02   5.5232703530151084e-02
1.0000000000000000e+03   0.0000000000000000e+00   0.0000000000000000e+00   8.6550913785022351e+02   1.0000000000000000e+03   0.0000000000000000e+00   0.0000000000000000e+00   -8.6550913785022351e+02   1.0000000000000005e+03   -4.2989763445295290e+02   4.5800268094015519e+02   7.5815339354472735e+02   1.0000000000000000e+03   4.2989763445295267e+02   -4.5800268094015519e+02   -7.5815339354472724e+02   2.9685247624007649e-02
1.0000000000000000e+03   0.0000000000000000e+00   0.0000000000000000e+00   8.6550913785022351e+02   1.0000000000000000e+03   0.0000000000000000e+00   0.0000000000000000e+00   -8.6550913785022351e+02   1.0000000000000000e+03   3.0398728905591906e+02   -8.8247410433028904e+02   -3.1337865798245974e+02   1.0000000000000005e+03   -3.0398728905591923e+02   8.8247410433028892e+02   3.1337865798245969e+02   1.5135409967551475e-02
1.0000000000000000e+03   0.0000000000000000e+00   0.0000000000000000e+00   8.6550913785022351e+02   1.0000000000000000e+03   0.0000000000000000e+00   0.0000000000000000e+00   -8.6550913785022351e+02   1.0000000000000000e+03   2.4064376874400622e+01   6.5333887907361586e+01   -9.8210355302104222e+02   1.0000000000000000e+03   -2.4064376874400669e+01   -6.5333887907361557e+01   9.8210355302104222e+02   6.0792530495861391e-02
1.0000000000000000e+03   0.0000000000000000e+00   0.0000000000000000e+00   8.6550913785022351e+02   1.0000000000000000e+03   0.0000000000000000e+00   0.0000000000000000e+00   -8.6550913785022351e+02   9.9999999999999977e+02   3.5074030746844852e+02   -9.0911297257073647e+02   1.4096041934010216e+02   9.9999999999999966e+02   -3.5074030746844846e+02   9.0911297257073636e+02   -1.4096041934010228e+02   1.3641351772164688e-02
1.0000000000000000e+03   0.0000000000000000e+00   0.0000000000000000e+00   8.6550913785022351e+02   1.0000000000000000e+03   0.0000000000000000e+00   0.0000000000000000e+00   -8.6550913785022351e+02   1.0000000000000000e+03   -1.2210615990170034e+02   -2.0954966438600786e+02   -9.5422954464309680e+02   1.0000000000000000e+03   1.2210615990170055e+02   2.0954966438600795e+02   9.5422954464309680e+02   5.4044812698431144e-02
1.0000000000000000e+03   0.0000000000000000e+00   0.0000000000000000e+00   8.6550913785022351e+02   1.0000000000000000e+03   0.0000000000000000e+00   0.0000000000000000e+00   -8.6550913785022351e+02   1.0000000000000002e+03   -9.3585482256829118e+02   3.0365527488141419e+02   -3.6663675652679949e+01   1.0000000000000003e+03   9.3585482256829118e+02   -3.0365527488141424e+02   3.6663675652679906e+01   1.3310894358781617e-02
1.0000000000000000e+03   0.0000000000000000e+00   0.0000000000000000e+00   8.6550913785022351e+02   1.0000000000000000e+03   0.0000000000000000e+00   0.0000000000000000e+00   -8.6550913785022351e+02   9.9999999999999943e+02   8.2786486048470309e+01   9.7799986762649462e+02   -7.7702359361247773e+01   1.0000000000000007e+03   -8.2786486048470394e+01   -9.7799986762649462e+02   7.7702359361247773e+01   1.3393838838049343e-02
1.0000000000000000e+03   0.0000000000000000e+00   0.0000000000000000e+00   8.6550913785022351e+02   1.0000000000000000e+03   0.0000000000000000e+00   0.0000000000000000e+00   -8.6550913785022351e+02   9.9999999999999943e+02   -8.9551660672453761e+02   -2.7492598384242086e+02   -3.0305232302169526e+02   1.0000000000000011e+03   8.9551660672453818e+02   2.7492598384242109e+02   3.0305232302169526e+02   1.5007791217878732e-02
1.0000000000000000e+03   0.0000000000000000e+00   0.0000000000000000e+00   8.6550913785022351e+02   1.0000000000000000e+03   0.0000000000000000e+00   0.0000000000000000e+00   -8.6550913785022351e+02   1.0000000000000015e+03   7.9362946761345029e+02   -2.4770298525645194e+02   -5.2741871338684382e+02   1.0000000000000006e+03   -7.9362946761345029e+02   2.4770298525645188e+02   5.2741871338684405e+02   1.9294494235889113e-02
1.0000000000000000e+03   0.0000000000000000e+00   0.0000000000000000e+00   8.6550913785022351e+02   1.0000000000000000e+03   0.0000000000000000e+00   0.0000000000000000e+00   -8.6550913785022351e+02   1.0000000000000001e+03   -6.0969922949999000e+02   -2.5544158718141301e+02   -7.2965159157323808e+02   1.0000000000000002e+03   6.0969922949998988e+02   2.5544158718141287e+02   7.2965159157323808e+02   2.7809333519850314e-02
1.0000000000000000e+03   0.0000000000000000e+00   0.0000000000000000e+00   8.6550913785022351e+02   1.0000000000000000e+03   0.0000000000000000e+00   0.0000000000000000e+00   -8.6550913785022351e+02   1.0000000000000002e+03   1.8951081932312530e+02   7.9472741478767341e+02   5.4942605102450250e+02   1.0000000000000002e+03   -1.8951081932312536e+02   -7.9472741478767341e+02   -5.4942605102450250e+02   1.9935402875526746e-02
1.0000000000000000e+03   0.0000000000000000e+00   0.0000000000000000e+00   8.6550913785022351e+02   1.0000000000000000e+03   0.0000000000000000e+00   0.0000000000000000e+00   -8.6550913785022351e+02   1.0000000000000002e+03   -4.2506967090766886e+02   3.2282785401776687e+02   8.2732880497703502e+02   1.0000000000000002e+03   4.2506967090766926e+02   -3.2282785401776630e+02   -8.2732880497703525e+02   3.5441496863951344e-02
1.0000000000000000e+03   0.0000000000000000e+00   0.0000000000000000e+00   8.6550913785022351e+02   1.0000000000000000e+03   0.0000000000000000e+00   0.0000000000000000e+00   -8.6550913785022351e+02   9.9999999999997681e+02   -1.1544321690314162e+02   1.7726250952025737e+02   9.6157468060970416e+02   1.0000000000000064e+03   1.1544321690314200e+02   -1.7726250952025504e+02   -9.6157468060970052e+02   5.5683145990772474e-02
1.0000000000000000e+03   0.0000000000000000e+00   0.0000000000000000e+00   8.6550913785022351e+02   1.0000000000000000e+03   0.0000000000000000e+00   0.0000000000000000e+00   -8.6550913785022351e+02   1.0000000000000000e+03   7.3549596494013622e+02   4.7856877677128523e+02   4.4653399809691274e+02   9.9999999999999977e+02   -7.3549596494013622e+02   -4.7856877677128523e+02   -4.4653399809691274e+02   1.7332059717090207e-02
1.0000000000000000e+03   0.0000000000000000e+00   0.0000000000000000e+00   8.6550913785022351e+02   1.0000000000000000e+03   0.0000000000000000e+00   0.0000000000000000e+00   -8.6550913785022351e+02   9.9999999999999807e+02   -4.2111468260947913e+02   -5.0698609168367011e+02   7.3143866928815805e+02   9.9999999999999704e+02   4.2111468260947919e+02   5.0698609168367153e+02   -7.3143866928816067e+02   2.7920078796142209e-02
1.0000000000000000e+03   0.0000000000000000e+00   0.0000000000000000e+00   8.6550913785022351e+02   1.0000000000000000e+03   0.0000000000000000e+00   0.0000000000000000e+00   -8.6550913785022351e+02   1.0000000000000033e+03   -2.9466132203097936e+02   7.1593522673659572e+02   -6.0826512017095013e+02   1.0000000000000041e+03   2.9466132203097686e+02   -7.1593522673659311e+02   6.0826512017094922e+02   2.1927441836565170e-02
1.0000000000000000e+03   0.0000000000000000e+00   0.0000000000000000e+00   8.6550913785022351e+02   1.0000000000000000e+03   0.0000000000000000e+00   0.0000000000000000e+00   -8.6550913785022351e+02   1.0000000000000002e+03   6.5509350921224552e+02   2.0677812843892059e+02   7.0531574474648096e+02   1.0000000000000000e+03   -6.5509350921224552e+02   -2.0677812843892059e+02   -7.0531574474648085e+02   2.6383665535347638e-02
1.0000000000000000e+03   0.0000000000000000e+00   0.0000000000000000e+00   8.6550913785022351e+02   1.0000000000000000e+03   0.0000000000000000e+00   0.0000000000000000e+00   -8.6550913785022351e+02   1.0000000000000003e+03   -3.7906309802236899e+02   9.0469923290842610e+02   8.4885014534896428e+01   1.0000000000000002e+03   3.7906309802236888e+02   -9.0469923290842621e+02   -8.4885014534896200e+01   1.3414558051584939e-02
1.0000000000000000e+03   0.0000000000000000e+00   0.0000000000000000e+00   8.6550913785022351e+02   1.0000000000000000e+03   0.0000000000000000e+00   0.0000000000000000e+00   -8.6550913785022351e+02   1.0000000000000022e+03   -7.8352855315432998e+02   5.9616805241670647e+02   -6.4544302272018292e+00   9.9999999999999886e+02   7.8352855315432828e+02   -5.9616805241670545e+02   6.4544302272024270e+00   1.3287966982322971e-02
1.0000000000000000e+03   0.0000000000000000e+00   0.0000000000000000e+00   8.6550913785022351e+02   1.0000000000000000e+03   0.0000000000000000e+00   0.0000000000000000e+00   -8.6550913785022351e+02   1.0000000000000000e+03   -3.3463331549069312e+02   3.9880264407942434e+02   -8.3567457496262659e+02   1.0000000000000001e+03   3.3463331549069312e+02   -3.9880264407942428e+02   8.3567457496262659e+02   3.6282079982233650e-02
1.0000000000000000e+03   0.0000000000000000e+00   0.0000000000000000e+00   8.6550913785022351e+02   1.0000000000000000e+03   0.0000000000000000e+00   0.0000000000000000e+00   -8.6550913785022351e+02   1.0000000000000010e+03   -3.2355643357102912e+02   -5.9931575451627339e+02   -7.1099005666984192e+02   9.9999999999999943e+02   3.2355643357102900e+02   5.9931575451627339e+02   7.1099005666984169e+02   2.6702888854938059e-02
