1.0020787945984401e+03   0.0000000000000000e+00   0.0000000000000000e+00   9.9792120540156009e+02   9.9792120540156009e+02   0.0000000000000000e+00   0.0000000000000000e+00   -9.9792120540156009e+02   9.9382337593848683e+02   2.1845012003549843e+02   8.7603305125100894e+02   -3.9299204601954546e+02   1.0061766240615132e+03   -2.1845012003549846e+02   -8.7603305125100906e+02   3.9299204601954534e+02   1.2884771725710873e-03
1.0020787945984401e+03   0.0000000000000000e+00   0.0000000000000000e+00   9.9792120540156009e+02   9.9792120540156009e+02   0.0000000000000000e+00   0.0000000000000000e+00   -9.9792120540156009e+02   9.9382337593848695e+02   -5.5519380983803717e+02   -7.6960905351648273e+02   2.6279050273039519e+02   1.0061766240615131e+03   5.5519380983803728e+02   7.6960905351648296e+02   -2.6279050273039519e+02   1.2916980795323150e-03
1.0020787945984401e+03   0.0000000000000000e+00   0.0000000000000000e+00   9.9792120540156009e+02   9.9792120540156009e+02   0.0000000000000000e+00   0.0000000000000000e+00   -9.9792120540156009e+02   9.9382337593848490e+02   -4.7387001820340453e+02   5.5235103550641327e+02   -6.6328926531732725e+02   1.0061766240615151e+03   4.7387001820340424e+02   -5.5235103550641327e+02   6.6328926531732725e+02   1.2729391656101901e-03
1.0020787945984401e+03   0.0000000000000000e+00   0.0000000000000000e+00   9.9792120540156009e+02   9.9792120540156009e+02   0.0000000000000000e+00   0.0000000000000000e+00   -9.9792120540156009e+02   9.9382337593848717e+02   8.8825181011276027e+02   1.1910642456935390e+02   -4.0794545164766186e+02   1.0061766240615129e+03   -8.8825181011276027e+02   -1.1910642456935390e+02   4.0794545164766168e+02   1.2880353193245099e-03
1.0020787945984401e+03   0.0000000000000000e+00   0.0000000000000000e+00   9.9792120540156009e+02   9.9792120540156009e+02   0.0000000000000000e+00   0.0000000000000000e+00   -9.9792120540156009e+02   9.9382337593848706e+02   8.9749554599019348e+02   -4.0113837751261195e+02   -5.6452254840856845e+01   1.0061766240615129e+03   -8.9749554599019370e+02   4.0113837751261218e+02   5.6452254840858068e+01   1.2932344993838256e-03
1.0020787945984401e+03   0.0000000000000000e+00   0.0000000000000000e+00   9.9792120540156009e+02   9.9792120540156009e+02   0.0000000000000000e+00   0.0000000000000000e+00   -9.9792120540156009e+02   9.9382337593848729e+02   -3.6893104890043304e+02   8.7546615450847492e+02   -2.5893243043248486e+02   1.0061766240615127e+03   3.6893104890043304e+02   -8.7546615450847514e+02   2.5893243043248486e+02   1.2913747938888027e-03
1.0020787945984401e+03   0.0000000000000000e+00   0.0000000000000000e+00   9.9792120540156009e+02   9.9792120540156009e+02   0.0000000000000000e+00   0.0000000000000000e+00   -9.9792120540156009e+02   9.9382337593848717e+02   2.3133725642298589e+02   -9.5246078068882036e+02   9.4332630105562671e+01   1.0061766240615129e+03   -2.3133725642298572e+02   9.5246078068882036e+02   -9.4332630105562671e+01   1.2931875602362104e-03
1.0020787945984401e+03   0.0000000000000000e+00   0.0000000000000000e+00   9.9792120540156009e+02   9.9792120540156009e+02   0.0000000000000000e+00   0.0000000000000000e+00   -9.9792120540156009e+02   9.9382337593848706e+02   -2.6728436272519292e+02   9.1911655745258963e+02   -2.3104314168871736e+02   1.0061766240615131e+03   2.6728436272519286e+02   -9.1911655745258963e+02   2.3104314168871736e+02   1.2917839032851660e-03
1.0020787945984401e+03   0.0000000000000000e+00   0.0000000000000000e+00   9.9792120540156009e+02   9.9792120540156009e+02   0.0000000000000000e+00   0.0000000000000000e+00   -9.9792120540156009e+02   9.9382337593848922e+02   -3.6556695630382188e+02   -2.7820499422995954e+02   -8.7095343831147090e+02   1.0061766240615109e+03   3.6556695630382154e+02   2.7820499422996090e+02   8.7095343831146818e+02   1.2138641535206064e-03
1.0020787945984401e+03   0.0000000000000000e+00   0.0000000000000000e+00   9.9792120540156009e+02   9.9792120540156009e+02   0.0000000000000000e+00   0.0000000000000000e+00   -9.9792120540156009e+02   9.9382337593848683e+02   -3.1361825616011862e+02   4.0803735907277911e+02   8.3949163966432900e+02   1.0061766240615133e+03   3.1361825616011856e+02   -4.0803735907277922e+02   -8.3949163966432877e+02   1.2438547982240339e-03
1.0020787945984401e+03   0.0000000000000000e+00   0.0000000000000000e+00   9.9792120540156009e+02   9.9792120540156009e+02   0.0000000000000000e+00   0.0000000000000000e+00   -9.9792120540156009e+02   9.9382337593848717e+02   7.4580704615700682e+01   -5.9003430607605503e+02   -7.8478936423391906e+02   1.0061766240615129e+03   -7.4580704615700583e+01   5.9003430607605503e+02   7.8478936423391906e+02   1.2521423230210703e-03
1.0020787945984401e+03   0.0000000000000000e+00   0.0000000000000000e+00   9.9792120540156009e+02   9.9792120540156009e+02   0.0000000000000000e+00   0.0000000000000000e+00   -9.9792120540156009e+02   9.9382337593848672e+02   4.3018762170709516e+02   7.1381850057230417e+02   -5.2440334517716997e+02   1.0061766240615133e+03   -4.3018762170709465e+02   -7.1381850057230315e+02   5.2440334517717145e+02   1.2833829612534091e-03
1.0020787945984401e+03   0.0000000000000000e+00   0.0000000000000000e+00   9.9792120540156009e+02   9.9792120540156009e+02   0.0000000000000000e+00   0.0000000000000000e+00   -9.9792120540156009e+02   9.9382337593848683e+02   -7.7853699146175302e+01   -2.5795980725454683e+02   -9.4709695883407812e+02   1.0061766240615132e+03   7.7853699146175302e+01   2.5795980725454694e+02   9.4709695883407790e+02   1.0879387488611676e-03
1.0020787945984401e+03   0.0000000000000000e+00   0.0000000000000000e+00   9.9792120540156009e+02   9.9792120540156009e+02   0.0000000000000000e+00   0.0000000000000000e+00   -9.9792120540156009e+02   9.9382337593848638e+02   -1.3975308508005585e+02   9.7436599677141896e+02   -2.6020945573766099e+01   1.0061766240615134e+03   1.3975308508005782e+02   -9.7436599677141851e+02   2.6020945573765975e+01   1.2933168171314271e-03
1.0020787945984401e+03   0.0000000000000000e+00   0.0000000000000000e+00   9.9792120540156009e+02   9.9792120540156009e+02   0.0000000000000000e+00   0.0000000000000000e+00   -9.9792120540156009e+02   9.9382337593848740e+02   -8.7767701450708785e+02   -8.2169766390179461e+01   -4.3878046647453903e+02   1.0061766240615127e+03   8.7767701450708728e+02   8.2169766390179731e+01   4.3878046647453885e+02   1.2870281627709462e-03
1.0020787945984401e+03   0.0000000000000000e+00   0.0000000000000000e+00   9.9792120540156009e+02   9.9792120540156009e+02   0.0000000000000000e+00   0.0000000000000000e+00   -9.9792120540156009e+02   9.9382337593848706e+02   4.6537936123027271e+02   -8.1331505988120284e+02   3.0255210059367175e+02   1.0061766240615131e+03   -4.6537936123027276e+02   8.1331505988120318e+02   -3.0255210059367175e+02   1.2910792986860643e-03
1.0020787945984401e+03   0.0000000000000000e+00   0.0000000000000000e+00   9.9792120540156009e+02   9.9792120540156009e+02   0.0000000000000000e+00   0.0000000000000000e+00   -9.9792120540156009e+02   9.9382337593848661e+02   6.7454444974569105e+02   -5.2513197830458898e+02   4.8869550922992653e+02   1.0061766240615134e+03   -6.7454444974569128e+02   5.2513197830458898e+02   -4.8869550922992630e+02   1.2861384547751891e-03
1.0020787945984401e+03   0.0000000000000000e+00   0.0000000000000000e+00   9.9792120540156009e+02   9.9792120540156009e+02   0.0000000000000000e+00   0.0000000000000000e+00   -9.9792120540156009e+02   9.9382337593848490e+02   -3.8339297754824008e+02   6.7927679451436802e+02   6.0099082460823138e+02   1.0061766240615151e+03   3.8339297754823798e+02   -6.7927679451437086e+02   -6.0099082460822876e+02   1.2804269086667110e-03
1.0020787945984401e+03   0.0000000000000000e+00   0.0000000000000000e+00   9.9792120540156009e+02   9.9792120540156009e+02   0.0000000000000000e+00   0.0000000000000000e+00   -9.9792120540156009e+02   9.9382337593848717e+02   2.2202129418771301e+02   9.5884089091481007e+02   -3.0459824346360605e+01   1.0061766240615129e+03   -2.2202129418771301e+02   -9.5884089091481007e+02   3.0459824346360595e+01   1.2933077260642303e-03
1.0020787945984401e+03   0.0000000000000000e+00   0.0000000000000000e+00   9.9792120540156009e+02   9.9792120540156009e+02   0.0000000000000000e+00   0.0000000000000000e+00   -9.9792120540156009e+02   9.9382337593848820e+02   5.3183742946412201e+02   -8.2583610077395508e+02   -6.8853419245321817e+01   1.0061766240615117e+03   -5.3183742946412212e+02   8.2583610077395474e+02   6.8853419245320083e+01   1.2931874111853116e-03
1.0020787945984401e+03   0.0000000000000000e+00   0.0000000000000000e+00   9.9792120540156009e+02   9.9792120540156009e+02   0.0000000000000000e+00   0.0000000000000000e+00   -9.9792120540156009e+02   9.9382337593848752e+02   -2.2772001570625716e+02   9.3056800480044933e+02   2.2756074562797264e+02   1.0061766240615127e+03   2.2772001570625741e+02   -9.3056800480044922e+02   -2.2756074562797249e+02   1.2921521316724210e-03
1.0020787945984401e+03   0.0000000000000000e+00   0.0000000000000000e+00   9.9792120540156009e+02   9.9792120540156009e+02   0.0000000000000000e+00   0.0000000000000000e+00   -9.9792120540156009e+02   9.9382337593848706e+02   4.6892971905998013e+02   -8.4278495096495931e+02   -1.9853351120560089e+02   1.0061766240615129e+03   -4.6892971905998013e+02   8.4278495096495931e+02   1.9853351120560089e+02   1.2921924757350388e-03
1.0020787945984401e+03   0.0000000000000000e+00   0.0000000000000000e+00   9.9792120540156009e+02   9.9792120540156009e+02   0.0000000000000000e+00   0.0000000000000000e+00   -9.9792120540156009e+02   9.9382337593848706e+02   8.9789139433201058e+02   3.9785893744425738e+02   -7.1389214469344836e+01   1.0061766240615131e+03   -8.9789139433201058e+02   -3.9785893744425749e+02   7.1389214469344651e+01   1.2931768052294788e-03
1.0020787945984401e+03   0.0000000000000000e+00   0.0000000000000000e+00   9.9792120540156009e+02   9.9792120540156009e+02   0.0000000000000000e+00   0.0000000000000000e+00   -9.9792120540156009e+02   9.9382337593848683e+02   -3.4313338661981419e+02   -3.4404569748304942e+02   -8.5643980938097741e+02   1.0061766240615132e+03   3.4313338661981379e+02   3.4404569748304942e+02   8.5643980938097741e+02   1.2234480345978077e-03
1.0020787945984401e+03   0.0000000000000000e+00   0.0000000000000000e+00   9.9792120540156009e+02   9.9792120540156009e+02   0.0000000000000000e+00   0.0000000000000000e+00   -9.9792120540156009e+02   9.9382337593848661e+02   4.4194826758459777e+02   -8.6900824553050143e+02   1.3821544067606118e+02   1.0061766240615135e+03   -4.4194826758459766e+02   8.6900824553050165e+02   -1.3821544067606155e+02   1.2929564129298677e-03
1.0020787945984401e+03   0.0000000000000000e+00   0.0000000000000000e+00   9.9792120540156009e+02   9.9792120540156009e+02   0.0000000000000000e+00   0.0000000000000000e+00   -9.9792120540156009e+02   9.9382337593848717e+02   6.3481161664789363e+02   2.8325296538723825e+02   -6.9740883205658406e+02   1.0061766240615128e+03   -6.3481161664789317e+02   -2.8325296538723825e+02   6.9740883205658406e+02   1.2688119216068751e-03
1.0020787945984401e+03   0.0000000000000000e+00   0.0000000000000000e+00   9.9792120540156009e+02   9.9792120540156009e+02   0.0000000000000000e+00   0.0000000000000000e+00   -9.9792120540156009e+02   9.9382337593848467e+02   -8.5612947226202311e+02   -1.8344612457842840e+02   -4.5054073751860193e+02   1.0061766240615153e+03   8.5612947226202482e+02   1.8344612457842996e+02   4.5054073751860204e+02   1.2866067385770899e-03
1.0020787945984401e+03   0.0000000000000000e+00   0.0000000000000000e+00   9.9792120540156009e+02   9.9792120540156009e+02   0.0000000000000000e+00   0.0000000000000000e+00   -9.9792120540156009e+02   9.9382337593848501e+02   2.9580216473674597e+02   9.0327381419242931e+02   -2.5728312419126507e+02   1.0061766240615149e+03   -2.9580216473674881e+02   -9.0327381419242761e+02   2.5728312419127070e+02   1.2914005765414763e-03
1.0020787945984401e+03   0.0000000000000000e+00   0.0000000000000000e+00   9.9792120540156009e+02   9.9792120540156009e+02   0.0000000000000000e+00   0.0000000000000000e+00   -9.9792120540156009e+02   9.9382337593848683e+02   -1.9795829915837380e+01   -9.6458828318238841e+02   -1.9691287191928944e+02   1.0061766240615132e+03   1.9795829915837569e+01   9.6458828318238795e+02   1.9691287191929035e+02   1.2922110208640756e-03
1.0020787945984401e+03   0.0000000000000000e+00   0.0000000000000000e+00   9.9792120540156009e+02   9.9792120540156009e+02   0.0000000000000000e+00   0.0000000000000000e+00   -9.9792120540156009e+02   9.9382337593848763e+02   -4.4883354513389520e+02   6.0398139554016848e+02   -6.3510001784458768e+02   1.0061766240615123e+03   4.4883354513390111e+02   -6.0398139554016768e+02   6.3510001784458655e+02   1.2757468540808500e-03
1.0020787945984401e+03   0.0000000000000000e+00   0.0000000000000000e+00   9.9792120540156009e+02   9.9792120540156009e+02   0.0000000000000000e+00   0.0000000000000000e+00   -9.9792120540156009e+02   9.9382337593848717e+02   -8.0661083583858681e+02   5.6108417555099004e+02   -6.4502848901015497e+01   1.0061766240615129e+03   8.0661083583858681e+02   -5.6108417555099004e+02   6.4502848901015540e+01   1.2932048325111883e-03
1.0020787945984401e+03   0.0000000000000000e+00   0.0000000000000000e+00   9.9792120540156009e+02   9.9792120540156009e+02   0.0000000000000000e+00   0.0000000000000000e+00   -9.9792120540156009e+02   9.9382337593848740e+02   2.4565154018149576e+02   -9.3935172205681067e+02   1.6392307079135890e+02   1.0061766240615126e+03   -2.4565154018149499e+02   9.3935172205681033e+02   -1.6392307079135887e+02   1.2927725971268349e-03
1.0020787945984401e+03   0.0000000000000000e+00   0.0000000000000000e+00   9.9792120540156009e+02   9.9792120540156009e+02   0.0000000000000000e+00   0.0000000000000000e+00   -9.9792120540156009e+02   9.9382337593848729e+02   5.8960893278297794e+02   -4.2732305848497555e+02   6.6283740097543375e+02   1.0061766240615126e+03   -5.8960893278297806e+02   4.2732305848497543e+02   -6.6283740097543375e+02   1.2756029953304925e-03
1.0020787945984401e+03   0.0000000000000000e+00   0.0000000000000000e+00   9.9792120540156009e+02   9.9792120540156009e+02   0.0000000000000000e+00   0.0000000000000000e+00   -9.9792120540156009e+02   9.9382337593848695e+02   7.7319866558113790e+02   2.2485913899996169e+02   5.6674447612133713e+02   1.0061766240615131e+03   -7.7319866558113790e+02   -2.2485913899996177e+02   -5.6674447612133758e+02   1.2825018640299506e-03
1.0020787945984401e+03   0.0000000000000000e+00   0.0000000000000000e+00   9.9792120540156009e+02   9.9792120540156009e+02   0.0000000000000000e+00   0.0000000000000000e+00   -9.9792120540156009e+02   9.9382337593848717e+02   2.9083175174606919e+02   3.3803352480119088e+02   -8.7792217100896869e+02   1.0061766240615129e+03   -2.9083175174606919e+02   -3.3803352480119082e+02   8.7792217100896869e+02   1.2084836823752717e-03
1.0020787945984401e+03   0.0000000000000000e+00   0.0000000000000000e+00   9.9792120540156009e+02   9.9792120540156009e+02   0.0000000000000000e+00   0.0000000000000000e+00   -9.9792120540156009e+02   9.9382337593848729e+02   2.3562809549221419e+02   -9.5437688224384999e+02   5.6932216850604078e+01   1.0061766240615127e+03   -2.3562809549221430e+02   9.5437688224385033e+02   -5.6932216850604775e+01   1.2933056272280100e-03
1.0020787945984401e+03   0.0000000000000000e+00   0.0000000000000000e+00   9.9792120540156009e+02   9.9792120540156009e+02   0.0000000000000000e+00   0.0000000000000000e+00   -9.9792120540156009e+02   9.9382337593848706e+02   6.4893164095442512e+02   -1.3425526309446911e+02   7.2832709668248469e+02   1.0061766240615131e+03   -6.4893164095442489e+02   1.3425526309446889e+02   -7.2832709668248469e+02   1.2682040425794851e-03
1.0020787945984401e+03   0.0000000000000000e+00   0.0000000000000000e+00   9.9792120540156009e+02   9.9792120540156009e+02   0.0000000000000000e+00   0.0000000000000000e+00   -9.9792120540156009e+02   9.9382337593848706e+02   8.9093144757176742e+02   -2.0155379825854024e+02   3.6771501491989056e+02   1.0061766240615128e+03   -8.9093144757176742e+02   2.0155379825854024e+02   -3.6771501491989045e+02   1.2897836628927243e-03
1.0020787945984401e+03   0.0000000000000000e+00   0.0000000000000000e+00   9.9792120540156009e+02   9.9792120540156009e+02   0.0000000000000000e+00   0.0000000000000000e+00   -9.9792120540156009e+02   9.9382337593848706e+02   -8.2879489386060504e+02   -1.9098727069704475e+02   -4.9620559892506992e+02   1.0061766240615131e+03   8.2879489386060516e+02   1.9098727069704475e+02   4.9620559892507003e+02   1.2847436746541718e-03
1.0020787945984401e+03   0.0000000000000000e+00   0.0000000000000000e+00   9.9792120540156009e+02   9.9792120540156009e+02   0.0000000000000000e+00   0.0000000000000000e+00   -9.9792120540156009e+02   9.9382337593848729e+02   -6.3817969526214483e+02   -6.2238014712933978e+02   -4.1829025697078077e+02   1.0061766240615126e+03   6.3817969526214426e+02   6.2238014712934012e+02   4.1829025697078112e+02   1.2877124124345300e-03
1.0020787945984401e+03   0.0000000000000000e+00   0.0000000000000000e+00   9.9792120540156009e+02   9.9792120540156009e+02   0.0000000000000000e+00   0.0000000000000000e+00   -9.9792120540156009e+02   9.9382337593848717e+02   8.5537423698775706e+02   -2.1795379257651052e+02   -4.3638076156200236e+02   1.0061766240615131e+03   -8.5537423698775706e+02   2.1795379257651044e+02   4.3638076156200242e+02   1.2871115079482660e-03
1.0020787945984401e+03   0.0000000000000000e+00   0.0000000000000000e+00   9.9792120540156009e+02   9.9792120540156009e+02   0.0000000000000000e+00   0.0000000000000000e+00   -9.9792120540156009e+02   9.9382337593848706e+02   6.2266403011660157e+02   -6.7840791884057751e+02   3.4878261326455549e+02   1.0061766240615128e+03   -6.2266403011660134e+02   6.7840791884057785e+02   -3.4878261326455549e+02   1.2901997251292064e-03
1.0020787945984401e+03   0.0000000000000000e+00   0.0000000000000000e+00   9.9792120540156009e+02   9.9792120540156009e+02   0.0000000000000000e+00   0.0000000000000000e+00   -9.9792120540156009e+02   9.9382337593848752e+02   4.3455429417869095e+02   -2.7488151689403161e+01   8.8317839477076473e+02   1.0061766240615125e+03   -4.3455429417869095e+02   2.7488151689403150e+01   -8.8317839477076461e+02   1.2247379759284813e-03
1.0020787945984401e+03   0.0000000000000000e+00   0.0000000000000000e+00   9.9792120540156009e+02   9.9792120540156009e+02   0.0000000000000000e+00   0.0000000000000000e+00   -9.9792120540156009e+02   9.9382337593848706e+02   4.8775034867655893e+02   -5.5958351825799764e+02   -6.4696444533080944e+02   1.0061766240615129e+03   -4.8775034867655893e+02   5.5958351825799764e+02   6.4696444533080967e+02   1.2746222568000146e-03
1.0020787945984401e+03   0.0000000000000000e+00   0.0000000000000000e+00   9.9792120540156009e+02   9.9792120540156009e+02   0.0000000000000000e+00   0.0000000000000000e+00   -9.9792120540156009e+02   9.9382337593848820e+02   3.7478783428324505e+02   1.2447445624578643e+02   9.0201845828003763e+02   1.0061766240615117e+03   -3.7478783428324539e+02   -1.2447445624578549e+02   -9.0201845828003752e+02   1.2130024684488822e-03
1.0020787945984401e+03   0.0000000000000000e+00   0.0000000000000000e+00   9.9792120540156009e+02   9.9792120540156009e+02   0.0000000000000000e+00   0.0000000000000000e+00   -9.9792120540156009e+02   9.9382337593848649e+02   -9.4488208001100918e+02   -1.1918583751936031e+02   2.5017933781825536e+02   1.0061766240615135e+03   9.4488208001100816e+02   1.1918583751936237e+02   -2.5017933781825886e+02   1.2918703041247641e-03
1.0020787945984401e+03   0.0000000000000000e+00   0.0000000000000000e+00   9.9792120540156009e+02   9.9792120540156009e+02   0.0000000000000000e+00   0.0000000000000000e+00   -9.9792120540156009e+02   9.9382337593848706e+02   4.6580973538521448e+01   -2.7620559075281356e+01   9.8319094161962187e+02   1.0061766240615129e+03   -4.6580973538519707e+01   2.7620559075281935e+01   -9.8319094161962153e+02   1.2814049418035189e-03
1.0020787945984401e+03   0.0000000000000000e+00   0.0000000000000000e+00   9.9792120540156009e+02   9.9792120540156009e+02   0.0000000000000000e+00   0.0000000000000000e+00   -9.9792120540156009e+02   9.9382337593848695e+02   2.2321155819864214e+02   9.4851158196270217e+02   -1.4177266743435146e+02   1.0061766240615131e+03   -2.2321155819864205e+02   -9.4851158196270217e+02   1.4177266743435140e+02   1.2927456705481169e-03
1.0020787945984401e+03   0.0000000000000000e+00   0.0000000000000000e+00   9.9792120540156009e+02   9.9792120540156009e+02   0.0000000000000000e+00   0.0000000000000000e+00   -9.9792120540156009e+02   9.9382337593848706e+02   2.7183065151190777e+02   -6.0745280533530388e+02   7.2574533842883613e+02   1.0061766240615129e+03   -2.7183065151190777e+02   6.0745280533530399e+02   -7.2574533842883613e+02   1.2685580641505268e-03
1.0020787945984401e+03   0.0000000000000000e+00   0.0000000000000000e+00   9.9792120540156009e+02   9.9792120540156009e+02   0.0000000000000000e+00   0.0000000000000000e+00   -9.9792120540156009e+02   9.9382337593848706e+02   -5.8519818364944683e+02   -4.1985789394043019e+02   -6.7146075448353577e+02   1.0061766240615131e+03   5.8519818364944683e+02   4.1985789394043019e+02   6.7146075448353622e+02   1.2720312751963959e-03
1.0020787945984401e+03   0.0000000000000000e+00   0.0000000000000000e+00   9.9792120540156009e+02   9.9792120540156009e+02   0.0000000000000000e+00   0.0000000000000000e+00   -9.9792120540156009e+02   9.9382337593848695e+02   5.6284913055791651e+02   -4.6357209470128129e+02   -6.6173928348464290e+02   1.0061766240615132e+03   -5.6284913055791696e+02   4.6357209470128106e+02   6.6173928348464290e+02   1.2731062417429941e-03
1.0020787945984401e+03   0.0000000000000000e+00   0.0000000000000000e+00   9.9792120540156009e+02   9.9792120540156009e+02   0.0000000000000000e+00   0.0000000000000000e+00   -9.9792120540156009e+02   9.9382337593848706e+02   4.1722070639226456e+02   2.2426216675729556e+01   8.9163953312168417e+02   1.0061766240615129e+03   -4.1722070639226587e+02   -2.2426216675731176e+01   -8.9163953312168417e+02   1.2197998249077054e-03
1.0020787945984401e+03   0.0000000000000000e+00   0.0000000000000000e+00   9.9792120540156009e+02   9.9792120540156009e+02   0.0000000000000000e+00   0.0000000000000000e+00   -9.9792120540156009e+02   9.9382337593848706e+02   -2.0959035239330760e+02   -1.0901975023166801e+02   -9.5592033575260803e+02   1.0061766240615129e+03   2.0959035239330811e+02   1.0901975023166797e+02   9.5592033575260791e+02   1.0514648443689142e-03
1.0020787945984401e+03   0.0000000000000000e+00   0.0000000000000000e+00   9.9792120540156009e+02   9.9792120540156009e+02   0.0000000000000000e+00   0.0000000000000000e+00   -9.9792120540156009e+02   9.9382337593848717e+02   4.9037298977828056e+02   5.5026486564590448e+02   -6.5294717902285925e+02   1.0061766240615127e+03   -4.9037298977828056e+02   -5.5026486564590425e+02   6.5294717902285925e+02   1.2740245991552999e-03
1.0020787945984401e+03   0.0000000000000000e+00   0.0000000000000000e+00   9.9792120540156009e+02   9.9792120540156009e+02   0.0000000000000000e+00   0.0000000000000000e+00   -9.9792120540156009e+02   9.9382337593848854e+02   9.6244371897331393e+02   6.0812571139981266e+01   -1.9900007302126082e+02   1.0061766240615116e+03   -9.6244371897331644e+02   -6.0812571139979298e+01   1.9900007302125829e+02   1.2921871055713967e-03
1.0020787945984401e+03   0.0000000000000000e+00   0.0000000000000000e+00   9.9792120540156009e+02   9.9792120540156009e+02   0.0000000000000000e+00   0.0000000000000000e+00   -9.9792120540156009e+02   9.9382337593848729e+02   -8.5212746772774983e+02   -2.9288546943780221e+02   3.9710702662933988e+02   1.0061766240615127e+03   8.5212746772774983e+02   2.9288546943780239e+02   -3.9710702662934011e+02   1.2890655004287692e-03
1.0020787945984401e+03   0.0000000000000000e+00   0.0000000000000000e+00   9.9792120540156009e+02   9.9792120540156009e+02   0.0000000000000000e+00   0.0000000000000000e+00   -9.9792120540156009e+02   9.9382337593848717e+02   -4.9228463317012182e+02   4.0637247582820942e+02   -7.4974286318451561e+02   1.0061766240615128e+03   4.9228463317012148e+02   -4.0637247582820913e+02   7.4974286318451573e+02   1.2602377582875358e-03
1.0020787945984401e+03   0.0000000000000000e+00   0.0000000000000000e+00   9.9792120540156009e+02   9.9792120540156009e+02   0.0000000000000000e+00   0.0000000000000000e+00   -9.9792120540156009e+02   9.9382337593848695e+02   -7.7015510480669798e+02   7.5610911234580854e+01   6.0888522293184701e+02   1.0061766240615131e+03   7.7015510480669843e+02   -7.5610911234580783e+01   -6.0888522293184712e+02   1.2798958056797970e-03
1.0020787945984401e+03   0.0000000000000000e+00   0.0000000000000000e+00   9.9792120540156009e+02   9.9792120540156009e+02   0.0000000000000000e+00   0.0000000000000000e+00   -9.9792120540156009e+02   9.9382337593848683e+02   7.0701265524228756e+02   -6.8039728530367813e+02   8.2399936534808546e+01   1.0061766240615133e+03   -7.0701265524228756e+02   6.8039728530367847e+02   -8.2399936534808575e+01   1.2932329854951948e-03
1.0020787945984401e+03   0.0000000000000000e+00   0.0000000000000000e+00   9.9792120540156009e+02   9.9792120540156009e+02   0.0000000000000000e+00   0.0000000000000000e+00   -9.9792120540156009e+02   9.9382337593848706e+02   -2.8012295354461270e+02   -4.8479974268466168e+02   8.0999842620380093e+02   1.0061766240615128e+03   2.8012295354461276e+02   4.8479974268466123e+02   -8.0999842620380116e+02   1.2526766553467583e-03
1.0020787945984401e+03   0.0000000000000000e+00   0.0000000000000000e+00   9.9792120540156009e+02   9.9792120540156009e+02   0.0000000000000000e+00   0.0000000000000000e+00   -9.9792120540156009e+02   9.9382337593848706e+02   -8.3983318957807729e+00   -8.4427187136285022e+02   -5.0668687106451142e+02   1.0061766240615129e+03   8.3983318957808279e+00   8.4427187136285033e+02   5.0668687106451051e+02   1.2842586516861006e-03
1.0020787945984401e+03   0.0000000000000000e+00   0.0000000000000000e+00   9.9792120540156009e+02   9.9792120540156009e+02   0.0000000000000000e+00   0.0000000000000000e+00   -9.9792120540156009e+02   9.9382337593848638e+02   2.6196572621915419e+02   8.6491025166191423e+02   3.9102599008109650e+02   1.0061766240615135e+03   -2.6196572621915425e+02   -8.6491025166191400e+02   -3.9102599008109650e+02   1.2892217005305822e-03
1.0020787945984401e+03   0.0000000000000000e+00   0.0000000000000000e+00   9.9792120540156009e+02   9.9792120540156009e+02   0.0000000000000000e+00   0.0000000000000000e+00   -9.9792120540156009e+02   9.9382337593848683e+02   2.9873507665026739e+02   9.3825355313014848e+02   5.8935625657149400e+00   1.0061766240615132e+03   -2.9873507665026739e+02   -9.3825355313014859e+02   -5.8935625657152082e+00   1.2933531341784738e-03
1.0020787945984401e+03   0.0000000000000000e+00   0.0000000000000000e+00   9.9792120540156009e+02   9.9792120540156009e+02   0.0000000000000000e+00   0.0000000000000000e+00   -9.9792120540156009e+02   9.9382337593848672e+02   -2.2963138706337286e+01   3.3834765300282100e+02   -9.2444073364956205e+02   1.0061766240615133e+03   2.2963138706337169e+01   -3.3834765300282118e+02   9.2444073364956228e+02   1.1490974179663093e-03
1.0020787945984401e+03   0.0000000000000000e+00   0.0000000000000000e+00   9.9792120540156009e+02   9.9792120540156009e+02   0.0000000000000000e+00   0.0000000000000000e+00   -9.9792120540156009e+02   9.9382337593848877e+02   -2.8641130330303002e+02   -9.2074785119866647e+02   1.9947197777033156e+02   1.0061766240615112e+03   2.8641130330302701e+02   9.2074785119867192e+02   -1.9947197777033472e+02   1.2924562014158065e-03
1.0020787945984401e+03   0.0000000000000000e+00   0.0000000000000000e+00   9.9792120540156009e+02   9.9792120540156009e+02   0.0000000000000000e+00   0.0000000000000000e+00   -9.9792120540156009e+02   9.9382337593848717e+02   -9.2152521962568471e+02   -2.7833460130969723e+02   -2.0716715321187203e+02   1.0061766240615129e+03   9.2152521962568449e+02   2.7833460130969712e+02   2.0716715321187172e+02   1.2920908203038870e-03
1.0020787945984401e+03   0.0000000000000000e+00   0.0000000000000000e+00   9.9792120540156009e+02   9.9792120540156009e+02   0.0000000000000000e+00   0.0000000000000000e+00   -9.9792120540156009e+02   9.9382337593848706e+02   -8.7282504429231449e+02   -3.8407015202817792e+02   -2.4548659930717065e+02   1.0061766240615129e+03   8.7282504429236462e+02   3.8407015202817036e+02   2.4548659930716960e+02   1.2915790806695658e-03
1.0020787945984401e+03   0.0000000000000000e+00   0.0000000000000000e+00   9.9792120540156009e+02   9.9792120540156009e+02   0.0000000000000000e+00   0.0000000000000000e+00   -9.9792120540156009e+02   9.9382337593848740e+02   2.4572881171360149e+02   9.4528140381041555e+02   1.2513004741601519e+02   1.0061766240615125e+03   -2.4572881171360288e+02   -9.4528140381041533e+02   -1.2513004741601502e+02   1.2930360529427563e-03
1.0020787945984401e+03   0.0000000000000000e+00   0.0000000000000000e+00   9.9792120540156009e+02   9.9792120540156009e+02   0.0000000000000000e+00   0.0000000000000000e+00   -9.9792120540156009e+02   9.9382337593848729e+02   6.2677282393838721e+02   -6.3876311761328043e+02   -4.1077319388144986e+02   1.0061766240615128e+03   -6.2677282393838721e+02   6.3876311761328054e+02   4.1077319388144986e+02   1.2879484906448415e-03
1.0020787945984401e+03   0.0000000000000000e+00   0.0000000000000000e+00   9.9792120540156009e+02   9.9792120540156009e+02   0.0000000000000000e+00   0.0000000000000000e+00   -9.9792120540156009e+02   9.9382337593848717e+02   9.2850192590168558e+02   -3.2783587649033234e+02   -2.2185006154997291e+00   1.0061766240615127e+03   -9.2850192590168558e+02   3.2783587649033234e+02   2.2185006154997291e+00   1.2933487231987992e-03
1.0020787945984401e+03   0.0000000000000000e+00   0.0000000000000000e+00   9.9792120540156009e+02   9.9792120540156009e+02   0.0000000000000000e+00   0.0000000000000000e+00   -9.9792120540156009e+02   9.9382337593848717e+02   -5.2964904108161750e+02   -1.2957640211870861e+02   8.1992619140846989e+02   1.0061766240615129e+03   5.2964904108161738e+02   1.2957640211870870e+02   -8.1992619140846978e+02   1.2499749737870075e-03
1.0020787945984401e+03   0.0000000000000000e+00   0.0000000000000000e+00   9.9792120540156009e+02   9.9792120540156009e+02   0.0000000000000000e+00   0.0000000000000000e+00   -9.9792120540156009e+02   9.9382337593848706e+02   -7.4149743963335618e+02   -3.7020519974702512e+02   5.3172057244359814e+02   1.0061766240615131e+03   7.4149743963335618e+02   3.7020519974702512e+02   -5.3172057244359826e+02   1.2842965728064725e-03
1.0020787945984401e+03   0.0000000000000000e+00   0.0000000000000000e+00   9.9792120540156009e+02   9.9792120540156009e+02   0.0000000000000000e+00   0.0000000000000000e+00   -9.9792120540156009e+02   9.9382337593848706e+02   -4.2149059632328363e+02   6.0242313457435887e+02   6.5500317113961501e+02   1.0061766240615129e+03   4.2149059632328363e+02   -6.0242313457435876e+02   -6.5500317113961512e+02   1.2763081706940627e-03
1.0020787945984401e+03   0.0000000000000000e+00   0.0000000000000000e+00   9.9792120540156009e+02   9.9792120540156009e+02   0.0000000000000000e+00   0.0000000000000000e+00   -9.9792120540156009e+02   9.9382337593848706e+02   -7.5347197153088325e+02   4.1167333573189933e+02   4.8208107495217035e+02   1.0061766240615129e+03   7.5347197153088337e+02   -4.1167333573189933e+02   -4.8208107495217041e+02   1.2863913439540896e-03
1.0020787945984401e+03   0.0000000000000000e+00   0.0000000000000000e+00   9.9792120540156009e+02   9.9792120540156009e+02   0.0000000000000000e+00   0.0000000000000000e+00   -9.9792120540156009e+02   9.9382337593848706e+02   -9.5089404328290664e+02   -1.1121007131345331e+02   2.3028232357227677e+02   1.0061766240615131e+03   9.5089404328290664e+02   1.1121007131345313e+02   -2.3028232357227685e+02   1.2921200095383173e-03
1.0020787945984401e+03   0.0000000000000000e+00   0.0000000000000000e+00   9.9792120540156009e+02   9.9792120540156009e+02   0.0000000000000000e+00   0.0000000000000000e+00   -9.9792120540156009e+02   9.9382337593848570e+02   -6.1875841770954810e+02   -2.0886515144273983e+02   7.3696029681977086e+02   1.0061766240615142e+03   6.1875841770954821e+02   2.0886515144274037e+02   -7.3696029681977132e+02   1.2669739589216322e-03
1.0020787945984401e+03   0.0000000000000000e+00   0.0000000000000000e+00   9.9792120540156009e+02   9.9792120540156009e+02   0.0000000000000000e+00   0.0000000000000000e+00   -9.9792120540156009e+02   9.9382337593848717e+02   -6.2456800789022793e+02   -3.3222309968655355e+02   6.8493775309658304e+02   1.0061766240615129e+03   6.2456800789022793e+02   3.3222309968655350e+02   -6.8493775309658304e+02   1.2734318213875808e-03
1.0020787945984401e+03   0.0000000000000000e+00   0.0000000000000000e+00   9.9792120540156009e+02   9.9792120540156009e+02   0.0000000000000000e+00   0.0000000000000000e+00   -9.9792120540156009e+02   9.9382337593848717e+02   6.4673789722083228e+01   -9.7740818119932158e+02   1.0043733523905692e+02   1.0061766240615128e+03   -6.4673789722083313e+01   9.7740818119932180e+02   -1.0043733523905711e+02   1.2931614773851465e-03
1.0020787945984401e+03   0.0000000000000000e+00   0.0000000000000000e+00   9.9792120540156009e+02   9.9792120540156009e+02   0.0000000000000000e+00   0.0000000000000000e+00   -9.9792120540156009e+02   9.9382337593848740e+02   2.1267479131069102e+01   2.1933989451355166e+02   9.5970558770307161e+02   1.0061766240615125e+03   -2.1267479131069177e+01   -2.1933989451355228e+02   -9.5970558770307161e+02   1.1628102939949187e-03
1.0020787945984401e+03   0.0000000000000000e+00   0.0000000000000000e+00   9.9792120540156009e+02   9.9792120540156009e+02   0.0000000000000000e+00   0.0000000000000000e+00   -9.9792120540156009e+02   9.9382337593848729e+02   -4.2994688222676234e+02   4.5805514834315392e+02   7.5824024530627673e+02   1.0061766240615126e+03   4.2994688222676211e+02   -4.5805514834315392e+02   -7.5824024530627662e+02   1.2636027001839598e-03
1.0020787945984401e+03   0.0000000000000000e+00   0.0000000000000000e+00   9.9792120540156009e+02   9.9792120540156009e+02   0.0000000000000000e+00   0.0000000000000000e+00   -9.9792120540156009e+02   9.9382337593848695e+02   3.0402211292107347e+02   -8.8257519789675644e+02   -3.1341455769445673e+02   1.0061766240615132e+03   -3.0402211292107364e+02   8.8257519789675632e+02   3.1341455769445668e+02   1.2904008865066510e-03
1.0020787945984401e+03   0.0000000000000000e+00   0.0000000000000000e+00   9.9792120540156009e+02   9.9792120540156009e+02   0.0000000000000000e+00   0.0000000000000000e+00   -9.9792120540156009e+02   9.9382337593848717e+02   2.4067133616690420e+01   6.5341372360114747e+01   -9.8221605983606185e+02   1.0061766240615129e+03   -2.4067133616690462e+01   -6.5341372360114718e+01   9.8221605983606185e+02   1.0776877618571719e-03
1.0020787945984401e+03   0.0000000000000000e+00   0.0000000000000000e+00   9.9792120540156009e+02   9.9792120540156009e+02   0.0000000000000000e+00   0.0000000000000000e+00   -9.9792120540156009e+02   9.9382337593848717e+02   3.5078048721810018e+02   -9.0921711780544479e+02   1.4097656733974543e+02   1.0061766240615129e+03   -3.5078048721810012e+02   9.0921711780544467e+02   -1.4097656733974554e+02   1.2929384216114810e-03
1.0020787945984401e+03   0.0000000000000000e+00   0.0000000000000000e+00   9.9792120540156009e+02   9.9792120540156009e+02   0.0000000000000000e+00   0.0000000000000000e+00   -9.9792120540156009e+02   9.9382337593848717e+02   -1.2212014801436173e+02   -2.0957366976228002e+02   -9.5433885829595465e+02   1.0061766240615129e+03   1.2212014801436194e+02   2.0957366976228010e+02   9.5433885829595465e+02   1.0587049807786533e-03
1.0020787945984401e+03   0.0000000000000000e+00   0.0000000000000000e+00   9.9792120540156009e+02   9.9792120540156009e+02   0.0000000000000000e+00   0.0000000000000000e+00   -9.9792120540156009e+02   9.9382337593848706e+02   -9.3596203126851810e+02   3.0369006071202807e+02   -3.6667875732561441e+01   1.0061766240615129e+03   9.3596203126851810e+02   -3.0369006071202813e+02   3.6667875732561399e+01   1.2932933474138558e-03
1.0020787945984401e+03   0.0000000000000000e+00   0.0000000000000000e+00   9.9792120540156009e+02   9.9792120540156009e+02   0.0000000000000000e+00   0.0000000000000000e+00   -9.9792120540156009e+02   9.9382337593848649e+02   8.2795969818123027e+01   9.7811190433571710e+02   -7.7711260708711947e+01   1.0061766240615135e+03   -8.2795969818123126e+01   -9.7811190433571710e+02   7.7711260708711947e+01   1.2931489086665416e-03
1.0020787945984401e+03   0.0000000000000000e+00   0.0000000000000000e+00   9.9792120540156009e+02   9.9792120540156009e+02   0.0000000000000000e+00   0.0000000000000000e+00   -9.9792120540156009e+02   9.9382337593848627e+02   -8.9561919440066356e+02   -2.7495747853227613e+02   -3.0308703977996629e+02   1.0061766240615137e+03   8.9561919440066413e+02   2.7495747853227635e+02   3.0308703977996629e+02   1.2906046472149831e-03
1.0020787945984401e+03   0.0000000000000000e+00   0.0000000000000000e+00   9.9792120540156009e+02   9.9792120540156009e+02   0.0000000000000000e+00   0.0000000000000000e+00   -9.9792120540156009e+02   9.9382337593848752e+02   7.9372038340683218e+02   -2.4773136136185963e+02   -5.2747913288073710e+02   1.0061766240615124e+03   -7.9372038340683218e+02   2.4773136136185957e+02   5.2747913288073732e+02   1.2832233306737564e-03
1.0020787945984401e+03   0.0000000000000000e+00   0.0000000000000000e+00   9.9792120540156009e+02   9.9792120540156009e+02   0.0000000000000000e+00   0.0000000000000000e+00   -9.9792120540156009e+02   9.9382337593848706e+02   -6.0976907480114983e+02   -2.5547084979767064e+02   -7.2973517825448903e+02   1.0061766240615129e+03   6.0976907480114971e+02   2.5547084979767047e+02   7.2973517825448903e+02   1.2639135873654861e-03
1.0020787945984401e+03   0.0000000000000000e+00   0.0000000000000000e+00   9.9792120540156009e+02   9.9792120540156009e+02   0.0000000000000000e+00   0.0000000000000000e+00   -9.9792120540156009e+02   9.9382337593848706e+02   1.8953252910986637e+02   7.9481845635856598e+02   5.4948899161248755e+02   1.0061766240615128e+03   -1.8953252910986643e+02   -7.9481845635856598e+02   -5.4948899161248755e+02   1.2834231866079963e-03
1.0020787945984401e+03   0.0000000000000000e+00   0.0000000000000000e+00   9.9792120540156009e+02   9.9792120540156009e+02   0.0000000000000000e+00   0.0000000000000000e+00   -9.9792120540156009e+02   9.9382337593848706e+02   -4.2511836560456516e+02   3.2286483620110522e+02   8.2742358126466308e+02   1.0061766240615128e+03   4.2511836560456555e+02   -3.2286483620110465e+02   -8.2742358126466331e+02   1.2477643655162880e-03
1.0020787945984401e+03   0.0000000000000000e+00   0.0000000000000000e+00   9.9792120540156009e+02   9.9792120540156009e+02   0.0000000000000000e+00   0.0000000000000000e+00   -9.9792120540156009e+02   9.9382337593847228e+02   -1.1545644172919019e+02   1.7728281617764466e+02   9.6168483569914906e+02   1.0061766240615277e+03   1.1545644172919057e+02   -1.7728281617764230e+02   -9.6168483569914542e+02   1.1622659489093955e-03
1.0020787945984401e+03   0.0000000000000000e+00   0.0000000000000000e+00   9.9792120540156009e+02   9.9792120540156009e+02   0.0000000000000000e+00   0.0000000000000000e+00   -9.9792120540156009e+02   9.9382337593848717e+02   7.3558022113513800e+02   4.7862360016406984e+02   4.4658515168226467e+02   1.0061766240615128e+03   -7.3558022113513800e+02   -4.7862360016406984e+02   -4.4658515168226467e+02   1.2876295068187606e-03
1.0020787945984401e+03   0.0000000000000000e+00   0.0000000000000000e+00   9.9792120540156009e+02   9.9792120540156009e+02   0.0000000000000000e+00   0.0000000000000000e+00   -9.9792120540156009e+02   9.9382337593848752e+02   -4.2116292423486948e+02   -5.0704417047817230e+02   7.3152246069163323e+02   1.0061766240615125e+03   4.2116292423486959e+02   5.0704417047817378e+02   -7.3152246069163584e+02   1.2677572158420491e-03
1.0020787945984401e+03   0.0000000000000000e+00   0.0000000000000000e+00   9.9792120540156009e+02   9.9792120540156009e+02   0.0000000000000000e+00   0.0000000000000000e+00   -9.9792120540156009e+02   9.9382337593848672e+02   -2.9469507754153432e+02   7.1601724211254054e+02   -6.0833480118487694e+02   1.0061766240615133e+03   2.9469507754153182e+02   -7.1601724211253793e+02   6.0833480118487603e+02   1.2780208048172675e-03
1.0020787945984401e+03   0.0000000000000000e+00   0.0000000000000000e+00   9.9792120540156009e+02   9.9792120540156009e+02   0.0000000000000000e+00   0.0000000000000000e+00   -9.9792120540156009e+02   9.9382337593848717e+02   6.5516855474490308e+02   2.0680181631641045e+02   7.0539654358666473e+02   1.0061766240615127e+03   -6.5516855474490308e+02   -2.0680181631641045e+02   -7.0539654358666462e+02   1.2711464727567059e-03
1.0020787945984401e+03   0.0000000000000000e+00   0.0000000000000000e+00   9.9792120540156009e+02   9.9792120540156009e+02   0.0000000000000000e+00   0.0000000000000000e+00   -9.9792120540156009e+02   9.9382337593848717e+02   -3.7910652234531193e+02   9.0480287251845687e+02   8.4894738705630573e+01   1.0061766240615128e+03   3.7910652234531182e+02   -9.0480287251845698e+02   -8.4894738705630346e+01   1.2932240935291444e-03
1.0020787945984401e+03   0.0000000000000000e+00   0.0000000000000000e+00   9.9792120540156009e+02   9.9792120540156009e+02   0.0000000000000000e+00   0.0000000000000000e+00   -9.9792120540156009e+02   9.9382337593848877e+02   -7.8361831181747777e+02   5.9623634762711185e+02   -6.4551696272227241e+00   1.0061766240615112e+03   7.8361831181747607e+02   -5.9623634762711094e+02   6.4551696272233228e+00   1.2933451154529558e-03
1.0020787945984401e+03   0.0000000000000000e+00   0.0000000000000000e+00   9.9792120540156009e+02   9.9792120540156009e+02   0.0000000000000000e+00   0.0000000000000000e+00   -9.9792120540156009e+02   9.9382337593848717e+02   -3.3467165007202061e+02   3.9884832970510888e+02   -8.3577030731644277e+02   1.0061766240615131e+03   3.3467165007202061e+02   -3.9884832970510882e+02   8.3577030731644277e+02   1.2342471783100689e-03
1.0020787945984401e+03   0.0000000000000000e+00   0.0000000000000000e+00   9.9792120540156009e+02   9.9792120540156009e+02   0.0000000000000000e+00   0.0000000000000000e+00   -9.9792120540156009e+02   9.9382337593848774e+02   -3.2359349921823923e+02   -5.9938441031791888e+02   -7.1107150554205123e+02   1.0061766240615120e+03   3.2359349921823912e+02   5.9938441031791888e+02   7.1107150554205100e+02   1.2668779283735723e-03
