Welcome to Sherpa, Stephan Braeuer. Initialization of framework underway.
The local time is Tue Apr 19 18:05:56 2016.
Run_Parameter::Init(): Seed mode '*'
Run_Parameter::Init(): Setting memory limit to 7.47797 GB.
Random::SetSeed(): Seed set to 1234
-----------------------------------------------------------------------------
-----------    Event generation run with SHERPA started .......   -----------
-----------------------------------------------------------------------------
................................................ |       +                   
................................................ ||  |       +  +            
...................................        ....  | |         /   +           
................. ................   _,_ |  ....  ||         +|  +  +        
...............................  __.'  ,\|  ...  ||    /    +|          +    
.............................. (  \    \   ...  | |  |   + + \         +   
.............................  (    \   -/  .... ||       +    |          +  
........ ...................  <S   /()))))~~~~~~~~##     +     /\    +       
............................ (!H   (~~)))))~~~~~~#/     +  +    |  +         
................ ........... (!E   (~~~)))))     /|/    +         +          
............................ (!R   (~~~)))))   |||   + +            +        
..... ...................... (!P    (~~~~)))   /|  + +          +            
............................ (!A>    (~~~~~~~~~##        + +        +        
............................. ~~(!    '~~~~~~~ \       +     + +      +      
...............................  `~~~QQQQQDb //   |         + + +        +   
........................ ..........   IDDDDP||     \  + + + + +             +
....................................  IDDDI||       \                      + 
.................................... IHD HD||         \ + +  + + + + +      +
...................................  IHD ##|            :-) + +\          +  
......... ............... ......... IHI ## /      /   +  + + + +\       +    
................................... IHI/ /       /      + + + +        +     
................................... ## | | /    / + +      + + /      +      
....................... /TT\ .....  ##/ ///  / + + + + + + +/       +        
......................./TTT/T\ ... /TT\/\\\ / + + + + + + +/   \         +   
....................../TTT/TTTT\...|TT/T\\\/   +    ++  + /              
-----------------------------------------------------------------------------

     SHERPA version 2.2.0 (Cho Oyu)
                                                                             
     Authors:        Stefan Hoeche, Frank Krauss, Silvan Kuttimalai,         
                     Marek Schoenherr, Holger Schulz, Steffen Schumann,      
                     Frank Siegert, Korinna Zapp.
     Former Authors: Timo Fischer, Tanju Gleisberg, Hendrik Hoeth,           
                     Ralf Kuhn, Thomas Laubrich, Andreas Schaelicke,         
                     Jan Winter                                              
                                                                             
     This program uses a lot of genuine and original research work           
     by other people. Users are encouraged to refer to                       
     the various original publications.                                      
                                                                             
     Users are kindly asked to refer to the documentation                    
     published under JHEP 02(2009)007                                        
                                                                             
     Please visit also our homepage                                          
                                                                             
       http://sherpa.hepforge.org                                            
                                                                             
     for news, bugreports, updates and new releases.                         
                                                                             
-----------------------------------------------------------------------------

SVN branch branches/RecolaInterface, revision 27892.
===> AMEGIC++/DipoleSubtraction has revision 27892M, first seen was 27892 <===
===> PHASIC++/Process has revision 27892M, first seen was 27892 <===

Beam_Spectra_Handler : 
   type = Monochromatic*Monochromatic
   for    P+  ((1000,0,0,1000))
   and    P+  ((1000,0,0,-1000))
PDF set 'NNPDF30NNLO' loaded for beam 1 (P+).
PDF set 'NNPDF30NNLO' loaded for beam 2 (P+).
Initialized the ISR: (SF)*(SF)
Standard_Model::FixEWParameters() {
  Scheme:     3
              Gmu scheme, input: GF, m_W, m_Z, m_h, widths
  Parameters: sin^2(\theta_W) = 0.222928 - 0.00110708 i
              vev             = 246.218
}
Running_AlphaQED::PrintSummary() {
  Setting \alpha according to EW scheme
  1/\alpha(0)   = 137.036
  1/\alpha(def) = 132.168
}
One_Running_AlphaS::PrintSummary() {
  Setting \alpha_s according to PDF
  perturbative order 2
  \alpha_s(M_Z) = 0.118
}
One_Running_AlphaS::PrintSummary() {
  Setting \alpha_s according to PDF
  perturbative order 2
  \alpha_s(M_Z) = 0.118
}
 List of Particle Data 
  IDName     kfc  MASS[<kfc>]   WIDTH[<kfc>]  STABLE[<kfc>] MASSIVE[<kfc>]  ACTIVE[<kfc>]  YUKAWA[<kfc>]
       d       1         0.01              0              1              0              1              0
       u       2        0.005              0              1              0              1              0
       s       3          0.2              0              1              0              1              0
       c       4         1.42              0              1              0              1              0
       b       5          4.8              0              1              0              1              0
       t       6       173.21              2              0              1              1         173.21
      e-      11     0.000511              0              1              0              1              0
      ve      12            0              0              1              0              1              0
     mu-      13        0.105              0              1              0              1              0
     vmu      14            0              0              1              0              1              0
    tau-      15        1.777    2.26735e-12              0              0              1              0
    vtau      16            0              0              1              0              1              0
       G      21            0              0              1              0              1              0
       P      22            0              0              1              0              1              0
       Z      23      91.1876         2.4952              0              1              1        91.1876
      W+      24       80.385          2.085              0              1              1         80.385
      h0      25          125        0.00407              0              1              1            125

 List of Particle Containers 
    IDName     kfc     Constituents
         l      90     {e-,e+,mu-,mu+,tau-,tau+}
        nu      91     {ve,veb,vmu,vmub,vtau,vtaub}
         f      92     {d,db,u,ub,s,sb,c,cb,b,bb,e-,e+,mu-,mu+,tau-,tau+,ve,veb,vmu,vmub,vtau,vtaub}
         j      93     {d,db,u,ub,s,sb,c,cb,b,bb,G}
         Q      94     {d,db,u,ub,s,sb,c,cb,b,bb}
       ewj      98     {d,db,u,ub,s,sb,c,cb,b,bb,G,P}
         r      99     {d,db,u,ub,s,sb,c,cb,b,bb,G,d,db,u,ub,s,sb,c,cb,b,bb,G,P}

Shower_Handler::Shower_Handler(): No shower selected.
Shower_Handler::Shower_Handler(): No shower selected.
Initialized the Shower_Handler.
+-----------------------------------------+
|   X   X   X XXXX  XXX  XXX  XXX         |
|  X X  XX XX X    X      X  X     X   X  |
| X   X X X X XXX  X XXX  X  X    XXX XXX |
| XXXXX X   X X    X   X  X  X     X   X  |
| X   X X   X XXXX  XXX  XXX  XXX         |
+-----------------------------------------+
| please cite: JHEP 0202:044,2002         |
+-----------------------------------------+
ME_Generators::ME_Generators(): Try loading 'OpenLoops' from 'libSherpaOpenLoops'.
ME_Generator_Base::SetPSMasses(): Massive PS flavours for Amegic: (c,cb,b,bb,e-,e+,mu-,mu+,tau-,tau+)
Amegic::Initialize(): Set gauge 1.
Initialising OpenLoops generator from /work1/Stephan/programs/OpenLoops
 #########################################################
 #     ___                                 version 1.2.4 #
 #    /   \ ___  ____  _  _  |     __   __  ___   __     #
 #    |   | |__| |__   |\ |  |    /  \ /  \ |__| /__     #
 #    \___/ |    |___  | \|  |___ \__/ \__/ |    __/     #
 #                                                       #
 #########################################################
 #  You are using OpenLoops to evaluate loop amplitudes  #
 #                     Authors:                          #
 # F. Cascioli, J. Lindert, P. Maierhoefer, S. Pozzorini #
 #    Please cite Phys. Rev. Lett. 108 (2012) 111601     #
 #########################################################

Matrix_Element_Handler::BuildProcesses(): Looking for processes 
Momenta are:  ((1000,0,0,1000),(1000,-0,-0,-1000),(1000,-894.662762329698,-207.703072901809,-395.522407971709),(1000,894.662762329698,207.703072901809,395.522407971709))
flavour:  (G,G,P,G)
    and born is:  0.000136495227137937
    and born*sym_factor is:  0.0349427781473117
mu:  1
AlphaQED():  0.00756613379127384
AlphaQCD():  0.118
. done ( 31 MB, 3s / 6s ).
Matrix_Element_Handler::InitializeProcesses(): Performing tests  done ( 31 MB, 0s / 0s ).
Initialized the Matrix_Element_Handler for the hard processes.
Beam_Remnant_Handler::Beam_Remnant_Handler(): Set remnants 0.
Initialized the Beam_Remnant_Handler.
Single_Process::CalculateTotalXSec(): Calculate xs for '2_2__G__G__P__G' (Amegic)
Starting the calculation at 18:06:00. Lean back and enjoy ... .

Momenta are:  ((28.2430595252654,0,0,28.2430595252654),(147.230679542577,0,0,-147.230679542577),(90.8761314498115,47.8275841880151,-43.1183180974231,-64.1233506803192),(84.5976076180305,-47.8275841880151,43.1183180974231,-54.8642693369922))
flavour:  (G,G,P,G)
    and born is:  1.08309697517938e-05
    and born*sym_factor is:  0.00277272825645921
mu:  120
AlphaQED():  0.00756613379127384
AlphaQCD():  0.113307297485655

Momenta are:  ((263.424555578897,0,0,263.424555578897),(1.20589008257705,0,0,-1.20589008257705),(84.1742169635017,-12.9923354499963,10.2972010022646,82.5255455752483),(180.456228697975,12.9923354499963,-10.2972010022646,179.693119921075))
flavour:  (G,G,P,G)
    and born is:  1.29400642891532e-05
    and born*sym_factor is:  0.00331265645802323
mu:  120
AlphaQED():  0.00756613379127384
AlphaQCD():  0.113307297485655

Momenta are:  ((899.261494649761,0,0,899.261494649761),(5.98329167505603,0,0,-5.98329167505597),(95.8505905082458,-30.6896464784129,-31.7101222350558,85.0878924856334),(809.394195816581,30.6896464784136,31.7101222350552,808.190310489081))
flavour:  (G,G,P,G)
    and born is:  3.11430386915563e-05
    and born*sym_factor is:  0.00797261790503841
mu:  120
AlphaQED():  0.00756613379127384
AlphaQCD():  0.113307297485655

Momenta are:  ((826.033269409823,0,0,826.033269409823),(998.151754450435,0,0,-998.151754450435),(870.519503876805,621.413892082021,-495.927254493189,354.549206187578),(953.665519983453,-621.413892082021,495.927254493189,-526.66769122819))
flavour:  (G,G,P,G)
    and born is:  0.000132887307733082
    and born*sym_factor is:  0.0340191507796689
mu:  120
AlphaQED():  0.00756613379127384
AlphaQCD():  0.113307297485655

Momenta are:  ((151.228889125061,0,0,151.228889125061),(46.5787421637637,0,0,-46.5787421637637),(104.392966851514,-52.1407896579116,-65.1756824778138,62.7005581750429),(93.41466443731,52.1407896579118,65.1756824778136,41.9495887862543))
flavour:  (G,G,P,G)
    and born is:  1.07911673946423e-05
    and born*sym_factor is:  0.00276253885302843
mu:  120
AlphaQED():  0.00756613379127384
AlphaQCD():  0.113307297485655

Momenta are:  ((431.710708835282,0,0,431.710708835282),(506.932706195655,0,0,-506.932706195656),(437.949119045018,-247.381962598642,73.3520720203514,353.865891240554),(500.694295985921,247.381962598643,-73.3520720203514,-429.087888600927))
flavour:  (G,G,P,G)
    and born is:  0.000201335326019844
    and born*sym_factor is:  0.0515418434610801
mu:  120
AlphaQED():  0.00756613379127384
AlphaQCD():  0.113307297485655

Momenta are:  ((223.118729350046,0,0,223.118729350046),(26.3491997642086,0,0,-26.3491997642086),(176.857255157052,-62.5371526338026,17.8325594224935,164.467604915334),(72.6106739572025,62.5371526338026,-17.8325594224935,32.3019246705034))
flavour:  (G,G,P,G)
    and born is:  1.57442194792705e-05
    and born*sym_factor is:  0.00403052018669325
mu:  120
AlphaQED():  0.00756613379127384
AlphaQCD():  0.113307297485655

Momenta are:  ((695.972400848719,0,0,695.972400848719),(0.857946471601004,0,0,-0.857946471600862),(166.682107274298,19.7381887611526,-6.6524883682024,165.375551966851),(530.148240046031,-19.7381887611526,6.6524883682024,529.738902410276))
flavour:  (G,G,P,G)
    and born is:  1.5756157165527e-05
    and born*sym_factor is:  0.0040335762343749
mu:  120
AlphaQED():  0.00756613379127384
AlphaQCD():  0.113307297485655

Momenta are:  ((300.551759144022,0,0,300.551759144022),(451.322141481594,0,0,-451.322141481594),(351.245992558649,-278.647508684646,-208.445830800434,47.7456680157196),(400.627908066967,278.647508684646,208.445830800434,-198.516050353291))
flavour:  (G,G,P,G)
    and born is:  7.22835860712144e-05
    and born*sym_factor is:  0.0185045980342309
mu:  120
AlphaQED():  0.00756613379127384
AlphaQCD():  0.113307297485655

Momenta are:  ((7.0582300351066,0,0,7.05823003510667),(406.285843756681,0,0,-406.285843756681),(51.0699101831118,-24.3939585918025,23.0233623650689,-38.5096779490462),(362.274163608676,24.3939585918025,-23.0233623650689,-360.717935772529))
flavour:  (G,G,P,G)
    and born is:  2.90838086762546e-05
    and born*sym_factor is:  0.00744545502112117
mu:  120
AlphaQED():  0.00756613379127384
AlphaQCD():  0.113307297485655

Momenta are:  ((340.500383018899,0,0,340.500383018899),(168.689545733506,0,0,-168.689545733506),(237.106554151601,233.614351377225,21.9705592036808,34.0756126947414),(272.083374600804,-233.614351377225,-21.9705592036808,137.735224590652))
flavour:  (G,G,P,G)
    and born is:  3.17288012897781e-05
    and born*sym_factor is:  0.00812257313018319
mu:  120
AlphaQED():  0.00756613379127384
AlphaQCD():  0.113307297485655

Momenta are:  ((148.219900537134,0,0,148.219900537134),(261.871744213846,0,0,-261.871744213846),(238.217097154777,106.580039731073,119.286882736431,-176.518327985499),(171.874547596202,-106.580039731073,-119.286882736431,62.8664843087873))
flavour:  (G,G,P,G)
    and born is:  2.07714604008838e-05
    and born*sym_factor is:  0.00531749386262626
mu:  120
AlphaQED():  0.00756613379127384
AlphaQCD():  0.113307297485655

Momenta are:  ((331.31175951098,0,0,331.31175951098),(22.5965012310381,0,0,-22.5965012310381),(217.081514957615,-83.5485172567897,0.43191696239851,200.359284407343),(136.826745784404,83.5485172567897,-0.431916962398513,108.355973872599))
flavour:  (G,G,P,G)
    and born is:  1.15731066139108e-05
    and born*sym_factor is:  0.00296271529316116
mu:  120
AlphaQED():  0.00756613379127384
AlphaQCD():  0.113307297485655

Momenta are:  ((879.53535786617,0,0,879.53535786617),(106.261972093563,0,0,-106.261972093563),(596.947043311498,141.322164616647,-258.303420364772,519.281389358664),(388.850286648237,-141.322164616647,258.303420364772,253.991996413944))
flavour:  (G,G,P,G)
    and born is:  5.46039992146421e-05
    and born*sym_factor is:  0.0139786237989484
mu:  120
AlphaQED():  0.00756613379127384
AlphaQCD():  0.113307297485655

Momenta are:  ((21.8229405806271,0,0,21.8229405806271),(51.092806778501,0,0,-51.092806778501),(38.3213791903457,-28.8673562448598,-16.2355450963359,-19.2772125035613),(34.5943681687824,28.8673562448598,16.2355450963359,-9.99265369431265))
flavour:  (G,G,P,G)
    and born is:  1.10876877129618e-05
    and born*sym_factor is:  0.00283844805451822
mu:  120
AlphaQED():  0.00756613379127384
AlphaQCD():  0.113307297485655

Momenta are:  ((992.682342710975,0,0,992.682342710975),(923.065050116733,0,0,-923.065050116733),(988.291113754574,-361.083958119978,293.64420932387,871.84332253291),(927.456279073136,361.083958119979,-293.64420932387,-802.226029938667))
flavour:  (G,G,P,G)
    and born is:  0.0003778565636803
    and born*sym_factor is:  0.0967312803021567
mu:  120
AlphaQED():  0.00756613379127384
AlphaQCD():  0.113307297485655

Momenta are:  ((158.979797149526,0,0,158.979797149526),(187.896222586068,0,0,-187.896222586068),(179.155819576902,85.6006660978196,-133.687567197976,-83.0479863004975),(167.720200158692,-85.6006660978195,133.687567197976,54.1315608639558))
flavour:  (G,G,P,G)
    and born is:  6.6586572635958e-06
    and born*sym_factor is:  0.00170461625948053
mu:  120
AlphaQED():  0.00756613379127384
AlphaQCD():  0.113307297485655

Momenta are:  ((558.02008610743,0,0,558.02008610743),(747.985651449252,0,0,-747.985651449252),(625.387372935202,-593.486793186083,-172.86402577762,94.8726574543316),(680.61836462148,593.486793186083,172.86402577762,-284.838222796154))
flavour:  (G,G,P,G)
    and born is:  0.000101259471498489
    and born*sym_factor is:  0.0259224247036131
mu:  120
AlphaQED():  0.00756613379127384
AlphaQCD():  0.113307297485655

Momenta are:  ((85.7379157053863,0,0,85.7379157053863),(27.7501427142524,0,0,-27.7501427142524),(82.3015367397352,-21.3264217675057,-8.70292442181108,79.0125672967578),(31.1865216799035,21.3264217675057,8.70292442181106,-21.024794305624))
flavour:  (G,G,P,G)
    and born is:  4.75286369576466e-05
    and born*sym_factor is:  0.0121673310611575
mu:  120
AlphaQED():  0.00756613379127384
AlphaQCD():  0.113307297485655

Momenta are:  ((218.328325029021,0,0,218.328325029021),(830.493137419025,0,0,-830.493137419025),(351.750156120547,-337.367870236065,99.0240347494954,-10.2631868900904),(697.0713063275,337.367870236066,-99.0240347494954,-601.901625499914))
flavour:  (G,G,P,G)
    and born is:  0.000105559123991661
    and born*sym_factor is:  0.0270231357418651
mu:  120
AlphaQED():  0.00756613379127384
AlphaQCD():  0.113307297485655

Momenta are:  ((627.865893030126,0,0,627.865893030126),(329.509224329408,0,0,-329.509224329408),(408.744948714263,-281.379700202985,286.765610866748,-75.2554439049063),(548.630168645273,281.379700202984,-286.765610866748,373.612112605624))
flavour:  (G,G,P,G)
    and born is:  9.92256123385591e-05
    and born*sym_factor is:  0.0254017567586711
mu:  120
AlphaQED():  0.00756613379127384
AlphaQCD():  0.113307297485655

Momenta are:  ((420.446640716903,0,0,420.446640716903),(172.773461259783,0,0,-172.773461259783),(331.822388652604,105.751919878729,235.765321568835,208.176228706898),(261.397713324081,-105.751919878729,-235.765321568835,39.4969507502216))
flavour:  (G,G,P,G)
    and born is:  4.37478773655279e-05
    and born*sym_factor is:  0.0111994566055752
mu:  120
AlphaQED():  0.00756613379127384
AlphaQCD():  0.113307297485655

Momenta are:  ((101.15053582087,0,0,101.15053582087),(29.3188007138945,0,0,-29.3188007138945),(36.3989325118713,-26.5643796239503,-18.6632409585989,-16.4590236684834),(94.0704040228935,26.5643796239503,18.6632409585989,88.2907587754594))
flavour:  (G,G,P,G)
    and born is:  3.18202301552137e-05
    and born*sym_factor is:  0.00814597891973471
mu:  120
AlphaQED():  0.00756613379127384
AlphaQCD():  0.113307297485655

Momenta are:  ((208.857815783837,0,0,208.857815783837),(48.0593099656132,0,0,-48.0593099656132),(67.5272950175486,-53.9222136841699,36.9443675871788,-16.9541778735858),(189.389830731901,53.9222136841699,-36.9443675871788,177.752683691809))
flavour:  (G,G,P,G)
    and born is:  2.62698996853639e-05
    and born*sym_factor is:  0.00672509431945317
mu:  120
AlphaQED():  0.00756613379127384
AlphaQCD():  0.113307297485655

Momenta are:  ((911.84778347305,0,0,911.84778347305),(748.727203830118,0,0,-748.727203830118),(774.306521684723,-381.370724676453,-464.372871313214,-488.328574088771),(886.268465618446,381.370724676453,464.372871313214,651.449153731703))
flavour:  (G,G,P,G)
    and born is:  0.000188780272090881
    and born*sym_factor is:  0.0483277496552654
mu:  120
AlphaQED():  0.00756613379127384
AlphaQCD():  0.113307297485655

Momenta are:  ((898.062672084635,0,0,898.062672084635),(823.946863039403,0,0,-823.946863039403),(865.049464223607,-15.4728203293657,-854.927856935059,131.032541076764),(856.960070900428,15.4728203293675,854.92785693506,-56.9167320315326))
flavour:  (G,G,P,G)
    and born is:  9.86082803840307e-05
    and born*sym_factor is:  0.0252437197783119
mu:  120
AlphaQED():  0.00756613379127384
AlphaQCD():  0.113307297485655

Momenta are:  ((583.773380600266,0,0,583.773380600266),(881.983857651725,0,0,-881.983857651725),(668.189296816336,-213.21202657363,-610.332548541841,168.854222022123),(797.567941435655,213.212026573631,610.332548541841,-467.064699073582))
flavour:  (G,G,P,G)
    and born is:  0.00011907384126716
    and born*sym_factor is:  0.030482903364393
mu:  120
AlphaQED():  0.00756613379127384
AlphaQCD():  0.113307297485655

Momenta are:  ((120.555572783392,0,0,120.555572783392),(70.7773434428008,0,0,-70.7773434428007),(106.420578185534,-35.0008825648127,75.5946673424152,66.2247986060902),(84.9123380406586,35.0008825648127,-75.5946673424152,-16.4465692654987))
flavour:  (G,G,P,G)
    and born is:  1.35167486842329e-05
    and born*sym_factor is:  0.00346028766316362
mu:  120
AlphaQED():  0.00756613379127384
AlphaQCD():  0.113307297485655

Momenta are:  ((34.6234495736758,0,0,34.6234495736758),(34.9024689912418,0,0,-34.9024689912418),(34.6799756629031,-11.6698267524099,-25.3908211958484,20.5383070029821),(34.8459429020145,11.6698267524099,25.3908211958484,-20.8173264205481))
flavour:  (G,G,P,G)
    and born is:  1.78606700173175e-05
    and born*sym_factor is:  0.00457233152443327
mu:  120
AlphaQED():  0.00756613379127384
AlphaQCD():  0.113307297485655

Momenta are:  ((58.2060129264884,0,0,58.2060129264884),(7.26920910115147,0,0,-7.26920910115147),(25.2388806838247,18.5027459947197,6.63929650431351,15.8293787229643),(40.2363413438152,-18.5027459947197,-6.63929650431351,35.1074251023727))
flavour:  (G,G,P,G)
    and born is:  1.21389639093686e-05
    and born*sym_factor is:  0.00310757476079836
mu:  120
AlphaQED():  0.00756613379127384
AlphaQCD():  0.113307297485655

Momenta are:  ((328.182055393646,0,0,328.182055393645),(604.396533525117,0,0,-604.396533525117),(431.879229754659,100.871595418953,-419.361068511497,-21.9290799626529),(500.699359164105,-100.871595418953,419.361068511497,-254.285398168819))
flavour:  (G,G,P,G)
    and born is:  8.18070172868416e-05
    and born*sym_factor is:  0.0209425964254315
mu:  120
AlphaQED():  0.00756613379127384
AlphaQCD():  0.113307297485655

Momenta are:  ((574.23457495518,0,0,574.23457495518),(179.567502061908,0,0,-179.567502061908),(243.547771604972,200.25417831285,126.185548390494,-57.3671378001629),(510.254305412116,-200.25417831285,-126.185548390494,452.034210693435))
flavour:  (G,G,P,G)
    and born is:  8.87331890377386e-05
    and born*sym_factor is:  0.0227156963936611
mu:  120
AlphaQED():  0.00756613379127384
AlphaQCD():  0.113307297485655

Momenta are:  ((685.444285710317,0,0,685.444285710317),(456.066368757076,0,0,-456.066368757076),(645.823436723033,-25.6031473600996,421.930829252015,488.269152817084),(495.68721774436,25.6031473600996,-421.930829252015,-258.891235863843))
flavour:  (G,G,P,G)
    and born is:  0.00014961938506358
    and born*sym_factor is:  0.0383025625762764
mu:  120
AlphaQED():  0.00756613379127384
AlphaQCD():  0.113307297485655

Momenta are:  ((994.80399411851,0,0,994.80399411851),(984.50356766767,0,0,-984.50356766767),(992.897878073,-641.880723320344,-422.831862362053,628.528877206972),(986.409683713179,641.880723320344,422.831862362053,-618.228450756132))
flavour:  (G,G,P,G)
    and born is:  0.000172645801486853
    and born*sym_factor is:  0.0441973251806344
mu:  120
AlphaQED():  0.00756613379127384
AlphaQCD():  0.113307297485655

Momenta are:  ((15.1199055859386,0,0,15.1199055859386),(67.0139607779121,0,0,-67.0139607779121),(23.9239272886452,0.901351666528149,23.8775259935404,1.18558614762291),(58.2099390752054,-0.901351666528132,-23.8775259935403,-53.0796413395964))
flavour:  (G,G,P,G)
    and born is:  2.05683160440984e-05
    and born*sym_factor is:  0.00526548890728919
mu:  120
AlphaQED():  0.00756613379127384
AlphaQCD():  0.113307297485655

Momenta are:  ((13.3960040320741,0,0,13.3960040320741),(151.379970131451,0,0,-151.379970131451),(118.529211457837,-27.998664737661,26.2198044124796,-112.150660266875),(46.2467627056878,27.998664737661,-26.2198044124796,-25.8333058325018))
flavour:  (G,G,P,G)
    and born is:  1.57606931409614e-05
    and born*sym_factor is:  0.00403473744408611
mu:  120
AlphaQED():  0.00756613379127384
AlphaQCD():  0.113307297485655

Momenta are:  ((56.6131300290181,0,0,56.6131300290181),(60.4508813181904,0,0,-60.4508813181904),(57.7677354933818,52.9476159459557,-8.71569886565205,21.3938734911697),(59.2962758538267,-52.9476159459556,8.71569886565205,-25.231624780342))
flavour:  (G,G,P,G)
    and born is:  1.3309119728233e-05
    and born*sym_factor is:  0.00340713465042766
mu:  120
AlphaQED():  0.00756613379127384
AlphaQCD():  0.113307297485655

Momenta are:  ((54.3127169961056,0,0,54.3127169961056),(42.503931853433,0,0,-42.503931853433),(44.1007871573642,0.633198533468381,32.8545969946556,-29.4117993981177),(52.7158616921744,-0.633198533468405,-32.8545969946556,41.2205845407903))
flavour:  (G,G,P,G)
    and born is:  2.46732584626777e-05
    and born*sym_factor is:  0.0063163541664455
mu:  120
AlphaQED():  0.00756613379127384
AlphaQCD():  0.113307297485655

Momenta are:  ((447.295467913239,0,0,447.295467913239),(201.0999510907,0,0,-201.0999510907),(233.965265726597,189.713538908209,75.0214694558223,-114.543868636123),(414.430153277342,-189.713538908209,-75.0214694558223,360.739385458662))
flavour:  (G,G,P,G)
    and born is:  8.78641803398292e-05
    and born*sym_factor is:  0.0224932301669963
mu:  120
AlphaQED():  0.00756613379127384
AlphaQCD():  0.113307297485655

Momenta are:  ((201.110282005209,0,0,201.110282005209),(125.540493022444,0,0,-125.540493022444),(176.49570673374,99.674234706938,110.657596120563,94.7136624349776),(150.155068293913,-99.674234706938,-110.657596120563,-19.1438734522132))
flavour:  (G,G,P,G)
    and born is:  8.58170404693927e-06
    and born*sym_factor is:  0.00219691623601645
mu:  120
AlphaQED():  0.00756613379127384
AlphaQCD():  0.113307297485655

Momenta are:  ((738.505143817353,0,0,738.505143817353),(546.471124131933,0,0,-546.471124131933),(645.226782896738,20.0813501344235,-634.696900628084,114.342402795974),(639.749485052553,-20.0813501344233,634.69690062808,77.6916168894495))
flavour:  (G,G,P,G)
    and born is:  9.11744953043159e-05
    and born*sym_factor is:  0.0233406707979049
mu:  120
AlphaQED():  0.00756613379127384
AlphaQCD():  0.113307297485655

Momenta are:  ((13.2247461276071,0,0,13.2247461276071),(45.3015432803011,0,0,-45.3015432803011),(29.6680313077087,-18.094257622121,16.4717164273234,-16.7771416134378),(28.8582581001996,18.094257622121,-16.4717164273234,-15.2996555392562))
flavour:  (G,G,P,G)
    and born is:  1.08780257383865e-05
    and born*sym_factor is:  0.00278477458902693
mu:  120
AlphaQED():  0.00756613379127384
AlphaQCD():  0.113307297485655

Momenta are:  ((970.548364950218,0,0,970.548364950218),(669.501145391222,0,0,-669.501145391222),(743.026749656036,-602.514086521377,-341.661958140164,-268.947267336098),(897.022760685404,602.514086521377,341.661958140164,569.994486895094))
flavour:  (G,G,P,G)
    and born is:  0.000135403563429434
    and born*sym_factor is:  0.0346633122379352
mu:  120
AlphaQED():  0.00756613379127384
AlphaQCD():  0.113307297485655

Momenta are:  ((720.873685093361,0,0,720.873685093361),(371.892371373224,0,0,-371.892371373224),(520.450293510293,-313.690255347053,-404.678130090703,93.287420060498),(572.315762956288,313.690255347058,404.678130090704,255.693893659639))
flavour:  (G,G,P,G)
    and born is:  8.59369598666956e-05
    and born*sym_factor is:  0.0219998617258741
mu:  120
AlphaQED():  0.00756613379127384
AlphaQCD():  0.113307297485655

Momenta are:  ((27.3415091918027,0,0,27.3415091918027),(10.2766248863626,0,0,-10.2766248863626),(21.1949808733569,-8.68178723993449,13.5511886540898,13.791992988823),(16.4231532048084,8.68178723993449,-13.5511886540898,3.27289131661699))
flavour:  (G,G,P,G)
    and born is:  1.20057235082094e-05
    and born*sym_factor is:  0.00307346521810161
mu:  120
AlphaQED():  0.00756613379127384
AlphaQCD():  0.113307297485655

Momenta are:  ((54.9361841189513,0,0,54.9361841189513),(54.0208634128109,0,0,-54.0208634128109),(54.4522594825643,51.5433670250911,17.3553331832775,-2.66876161743585),(54.5047880491979,-51.5433670250911,-17.3553331832775,3.5840823235763))
flavour:  (G,G,P,G)
    and born is:  1.08763981426064e-05
    and born*sym_factor is:  0.00278435792450723
mu:  120
AlphaQED():  0.00756613379127384
AlphaQCD():  0.113307297485655

Momenta are:  ((35.3230153042195,0,0,35.3230153042195),(13.7061439513787,0,0,-13.7061439513787),(22.7584810309455,-5.69647614563474,-20.9502284217628,6.82543386416455),(26.2706782246526,5.69647614563474,20.9502284217628,14.7914374886762))
flavour:  (G,G,P,G)
    and born is:  1.12350681348015e-05
    and born*sym_factor is:  0.00287617744250918
mu:  120
AlphaQED():  0.00756613379127384
AlphaQCD():  0.113307297485655

Momenta are:  ((302.201576067252,0,0,302.201576067252),(28.6012651424698,0,0,-28.6012651424698),(90.2940291452592,56.2892190966391,-53.5674602769258,45.9898109612931),(240.508812064462,-56.2892190966391,53.5674602769258,227.610499963489))
flavour:  (G,G,P,G)
    and born is:  1.60229136935419e-05
    and born*sym_factor is:  0.00410186590554672
mu:  120
AlphaQED():  0.00756613379127384
AlphaQCD():  0.113307297485655

Momenta are:  ((3.7999525328922,0,0,3.79995253289225),(131.611075178581,0,0,-131.611075178581),(34.628858532571,-18.7752267263935,3.69158214204392,-28.8621018972956),(100.782169178902,18.7752267263935,-3.69158214204391,-98.9490207483931))
flavour:  (G,G,P,G)
    and born is:  1.56273071769827e-05
    and born*sym_factor is:  0.00400059063730757
mu:  120
AlphaQED():  0.00756613379127384
AlphaQCD():  0.113307297485655

Momenta are:  ((547.371985530363,0,0,547.371985530363),(917.915239964544,0,0,-917.915239964544),(800.226784322676,7.27442789182699,-659.948137828787,-452.524523559303),(665.060441172229,-7.27442789182655,659.948137828787,81.9812691251224))
flavour:  (G,G,P,G)
    and born is:  0.000110506958231211
    and born*sym_factor is:  0.0282897813071901
mu:  120
AlphaQED():  0.00756613379127384
AlphaQCD():  0.113307297485655

Momenta are:  ((639.134996441518,0,0,639.134996441518),(473.427586325923,0,0,-473.427586325923),(528.048419678973,-300.152570204533,-421.139151271161,-106.702312025947),(584.51416308847,300.152570204533,421.139151271162,272.409722141542))
flavour:  (G,G,P,G)
    and born is:  9.86782577993797e-05
    and born*sym_factor is:  0.0252616339966412
mu:  120
AlphaQED():  0.00756613379127384
AlphaQCD():  0.113307297485655

Momenta are:  ((683.359773757752,0,0,683.359773757752),(929.070471196034,0,0,-929.070471196033),(846.344675689547,318.450978820182,682.451018541773,-386.197995136961),(766.085569264239,-318.450978820182,-682.451018541773,140.487297698679))
flavour:  (G,G,P,G)
    and born is:  0.000109688307840625
    and born*sym_factor is:  0.0280802068071999
mu:  120
AlphaQED():  0.00756613379127384
AlphaQCD():  0.113307297485655

Momenta are:  ((9.88786631620761,0,0,9.88786631620761),(51.7550347790027,0,0,-51.7550347790027),(44.1820184865662,-3.01759791472863,-17.1517729636463,-40.6049448291194),(17.4608826086442,3.01759791472864,17.1517729636463,-1.26222363367569))
flavour:  (G,G,P,G)
    and born is:  1.95442574517152e-05
    and born*sym_factor is:  0.00500332990763909
mu:  120
AlphaQED():  0.00756613379127384
AlphaQCD():  0.113307297485655

Momenta are:  ((934.884835754561,0,0,934.884835754561),(220.531670802884,0,0,-220.531670802884),(721.421833434879,-382.855234120978,161.912645684364,589.62329213677),(433.994673122565,382.855234120978,-161.912645684364,124.729872814907))
flavour:  (G,G,P,G)
    and born is:  9.26898846806799e-05
    and born*sym_factor is:  0.0237286104782541
mu:  120
AlphaQED():  0.00756613379127384
AlphaQCD():  0.113307297485655

Momenta are:  ((328.106885075921,0,0,328.106885075921),(5.16902571309914,0,0,-5.16902571309908),(203.304796591995,-8.96645878996179,-39.0914164471189,199.309568496443),(129.971114197025,8.96645878996174,39.091416447119,123.628290866379))
flavour:  (G,G,P,G)
    and born is:  1.15879449157056e-05
    and born*sym_factor is:  0.00296651389842063
mu:  120
AlphaQED():  0.00756613379127384
AlphaQCD():  0.113307297485655

Momenta are:  ((8.9165277852483,0,0,8.9165277852483),(93.2864536951443,0,0,-93.2864536951443),(36.4643565142211,22.4915087461746,-15.0260599163995,-24.4540150835348),(65.7386249661715,-22.4915087461746,15.0260599163995,-59.9159108263613))
flavour:  (G,G,P,G)
    and born is:  1.26891283499043e-05
    and born*sym_factor is:  0.00324841685757551
mu:  120
AlphaQED():  0.00756613379127384
AlphaQCD():  0.113307297485655

Momenta are:  ((951.319729377978,0,0,951.319729377979),(0.421008430565765,0,0,-0.42100843056599),(405.02541814569,10.3594698818421,-16.8612708555073,404.541676805981),(546.71531966282,-10.3594698818421,16.8612708555073,546.357044141396))
flavour:  (G,G,P,G)
    and born is:  1.11765391307878e-05
    and born*sym_factor is:  0.00286119401748169
mu:  120
AlphaQED():  0.00756613379127384
AlphaQCD():  0.113307297485655

Momenta are:  ((95.3366789166109,0,0,95.3366789166109),(9.35234090825579,0,0,-9.3523409082558),(51.4199986359964,5.55528952738498,-29.3316819919028,41.8665433194416),(53.2690211888703,-5.55528952738498,29.3316819919028,44.1177946889135))
flavour:  (G,G,P,G)
    and born is:  1.08737526348923e-05
    and born*sym_factor is:  0.00278368067453243
mu:  120
AlphaQED():  0.00756613379127384
AlphaQCD():  0.113307297485655

Momenta are:  ((10.7061999604399,0,0,10.7061999604398),(625.849942682284,0,0,-625.849942682284),(267.513135030983,-10.4347843995036,-80.0565892303182,-255.039869842833),(369.043007611741,10.4347843995036,80.0565892303182,-360.103872879012))
flavour:  (G,G,P,G)
    and born is:  1.10388707641819e-05
    and born*sym_factor is:  0.00282595091563058
mu:  120
AlphaQED():  0.00756613379127384
AlphaQCD():  0.113307297485655

Momenta are:  ((29.2570789988393,0,0,29.2570789988393),(577.509945254617,0,0,-577.509945254617),(446.24966388003,30.4066498875205,-106.688241080604,-432.240462440509),(160.517360373426,-30.4066498875204,106.688241080604,-116.012403815269))
flavour:  (G,G,P,G)
    and born is:  1.39769827501893e-05
    and born*sym_factor is:  0.00357810758404847
mu:  120
AlphaQED():  0.00756613379127384
AlphaQCD():  0.113307297485655

Momenta are:  ((69.0917650399759,0,0,69.0917650399759),(6.09002435104276,0,0,-6.09002435104276),(50.1865195025496,5.73555481807003,-17.9053377851953,46.5315917362254),(24.9952698884691,-5.73555481807005,17.9053377851953,16.4701489527078))
flavour:  (G,G,P,G)
    and born is:  1.3388482001106e-05
    and born*sym_factor is:  0.00342745139228313
mu:  120
AlphaQED():  0.00756613379127384
AlphaQCD():  0.113307297485655

Momenta are:  ((153.918083400428,0,0,153.918083400428),(107.795570890342,0,0,-107.795570890342),(148.921186408599,78.7926079679985,-14.2441996240661,125.564116960283),(112.792467882171,-78.7926079679986,14.2441996240662,-79.4416044501976))
flavour:  (G,G,P,G)
    and born is:  2.72293678906551e-05
    and born*sym_factor is:  0.00697071818000771
mu:  120
AlphaQED():  0.00756613379127384
AlphaQCD():  0.113307297485655

Momenta are:  ((22.1657947421781,0,0,22.1657947421781),(55.372817204081,0,0,-55.372817204081),(42.7367618591846,33.0712671750029,-7.97446846877359,-25.8675463523072),(34.8018500870747,-33.0712671750029,7.97446846877356,-7.33947610959588))
flavour:  (G,G,P,G)
    and born is:  1.16766486124176e-05
    and born*sym_factor is:  0.0029892220447789
mu:  120
AlphaQED():  0.00756613379127384
AlphaQCD():  0.113307297485655

Momenta are:  ((609.300862709931,0,0,609.300862709931),(762.962008759063,0,0,-762.962008759063),(626.736109104039,-148.932087644877,406.039134517349,453.596301754116),(745.526762364955,148.932087644877,-406.039134517349,-607.257447803247))
flavour:  (G,G,P,G)
    and born is:  0.000220863349325216
    and born*sym_factor is:  0.0565410174272554
mu:  120
AlphaQED():  0.00756613379127384
AlphaQCD():  0.113307297485655

Momenta are:  ((801.375206424908,0,0,801.375206424908),(950.577824172262,0,0,-950.577824172262),(826.207845665883,560.387445952424,329.699566382129,509.787711293839),(925.74518493129,-560.387445952424,-329.69956638213,-658.990329041194))
flavour:  (G,G,P,G)
    and born is:  0.000182989213082093
    and born*sym_factor is:  0.0468452385490159
mu:  120
AlphaQED():  0.00756613379127384
AlphaQCD():  0.113307297485655

Momenta are:  ((205.393425960956,0,0,205.393425960956),(1.63711775312404,0,0,-1.63711775312399),(136.339780695049,-14.9316867075521,8.85391997867916,135.230132119483),(70.6907630190324,14.9316867075521,-8.85391997867917,68.5261760883508))
flavour:  (G,G,P,G)
    and born is:  1.24153623377649e-05
    and born*sym_factor is:  0.0031783327584678
mu:  120
AlphaQED():  0.00756613379127384
AlphaQCD():  0.113307297485655

Momenta are:  ((557.394776860576,0,0,557.394776860576),(85.4134749530866,0,0,-85.4134749530866),(218.609881808883,181.076395651807,-76.0740038439439,95.9914855671876),(424.198370004779,-181.076395651807,76.0740038439439,375.989816340301))
flavour:  (G,G,P,G)
    and born is:  2.70710392634988e-05
    and born*sym_factor is:  0.00693018605145569
mu:  120
AlphaQED():  0.00756613379127384
AlphaQCD():  0.113307297485655

Momenta are:  ((855.866813552242,0,0,855.866813552242),(442.694332629296,0,0,-442.694332629295),(829.467936569393,273.575398734276,-125.708829542642,772.897696450888),(469.093209612143,-273.575398734274,125.708829542641,-359.725215527941))
flavour:  (G,G,P,G)
    and born is:  0.000294108545292787
    and born*sym_factor is:  0.0752917875949534
mu:  120
AlphaQED():  0.00756613379127384
AlphaQCD():  0.113307297485655

Momenta are:  ((31.5960612564422,0,0,31.5960612564422),(79.0172680047616,0,0,-79.0172680047616),(51.6143697134649,-15.0042244113507,-47.0208984271755,-15.0980635126933),(58.9989595477388,15.0042244113506,47.0208984271755,-32.3231432356261))
flavour:  (G,G,P,G)
    and born is:  1.11777824879677e-05
    and born*sym_factor is:  0.00286151231691973
mu:  120
AlphaQED():  0.00756613379127384
AlphaQCD():  0.113307297485655

Momenta are:  ((311.51510788441,0,0,311.51510788441),(37.7757549739838,0,0,-37.7757549739839),(269.990415078499,30.3934806536221,71.6481912457159,258.529683516681),(79.3004477798948,-30.3934806536222,-71.648191245716,15.2096693937449))
flavour:  (G,G,P,G)
    and born is:  2.15644273282395e-05
    and born*sym_factor is:  0.00552049339602932
mu:  120
AlphaQED():  0.00756613379127384
AlphaQCD():  0.113307297485655

Momenta are:  ((708.68749325725,0,0,708.687493257251),(786.388310886222,0,0,-786.388310886222),(715.484637623203,403.983532107653,-121.434889350134,577.900631691254),(779.59116652027,-403.983532107653,121.434889350134,-655.601449320225))
flavour:  (G,G,P,G)
    and born is:  0.000274350842408101
    and born*sym_factor is:  0.0702338156564737
mu:  120
AlphaQED():  0.00756613379127384
AlphaQCD():  0.113307297485655

Momenta are:  ((277.24019188739,0,0,277.24019188739),(888.551901674351,0,0,-888.551901674351),(621.043094728151,-364.372480196824,-331.267208423087,-378.403564740488),(544.74899883359,364.372480196824,331.267208423087,-232.908145046473))
flavour:  (G,G,P,G)
    and born is:  8.33898139525934e-05
    and born*sym_factor is:  0.0213477923718639
mu:  120
AlphaQED():  0.00756613379127384
AlphaQCD():  0.113307297485655

Momenta are:  ((5.20386376291313,0,0,5.20386376291313),(105.026380755052,0,0,-105.026380755052),(45.9262303096813,-2.33641096677088,22.8595572816982,-39.7643113248174),(64.3040142082843,2.33641096677088,-22.8595572816982,-60.0582056673219))
flavour:  (G,G,P,G)
    and born is:  1.1341686502302e-05
    and born*sym_factor is:  0.00290347174458932
mu:  120
AlphaQED():  0.00756613379127384
AlphaQCD():  0.113307297485655

Momenta are:  ((114.562591799889,0,0,114.562591799889),(36.8688810828557,0,0,-36.8688810828557),(63.7736819792657,32.7481680910428,52.4613200460065,15.5708027700501),(87.6577909034795,-32.7481680910428,-52.4613200460065,62.1229079469837))
flavour:  (G,G,P,G)
    and born is:  1.21801382119577e-05
    and born*sym_factor is:  0.00311811538226117
mu:  120
AlphaQED():  0.00756613379127384
AlphaQCD():  0.113307297485655

Momenta are:  ((739.808131031718,0,0,739.808131031718),(873.88383895634,0,0,-873.88383895634),(757.175534034457,537.145222106826,55.3420332102497,530.779670926014),(856.516435953601,-537.145222106826,-55.3420332102489,-664.855378850637))
flavour:  (G,G,P,G)
    and born is:  0.000215523953328561
    and born*sym_factor is:  0.0551741320521116
mu:  120
AlphaQED():  0.00756613379127384
AlphaQCD():  0.113307297485655

Momenta are:  ((256.350413820172,0,0,256.350413820172),(649.48350168235,0,0,-649.48350168235),(534.316399491338,-344.807521775542,-138.028415194336,-384.122303819155),(371.517516011185,344.807521775542,138.028415194336,-9.01078404302257))
flavour:  (G,G,P,G)
    and born is:  8.57634234932982e-05
    and born*sym_factor is:  0.0219554364142843
mu:  120
AlphaQED():  0.00756613379127384
AlphaQCD():  0.113307297485655

Momenta are:  ((50.6563402700343,0,0,50.6563402700342),(527.853775890901,0,0,-527.853775890901),(453.340931104626,-108.064659969695,-49.1442466422393,-437.521281885133),(125.16918505631,108.064659969695,49.1442466422393,-39.6761537357348))
flavour:  (G,G,P,G)
    and born is:  1.56172094827918e-05
    and born*sym_factor is:  0.00399800562759469
mu:  120
AlphaQED():  0.00756613379127384
AlphaQCD():  0.113307297485655

Momenta are:  ((9.87595810415834,0,0,9.87595810415835),(79.5569120902572,0,0,-79.5569120902572),(61.9345489345837,-23.0878778546424,7.79468983042654,-56.9392751828376),(27.4983212598318,23.0878778546424,-7.79468983042654,-12.7416788032612))
flavour:  (G,G,P,G)
    and born is:  1.50870783798443e-05
    and born*sym_factor is:  0.00386229206524013
mu:  120
AlphaQED():  0.00756613379127384
AlphaQCD():  0.113307297485655

Momenta are:  ((5.58445527607577,0,0,5.58445527607577),(642.986738186272,0,0,-642.986738186272),(174.079106807071,52.3551704311661,7.2147352465963,-165.862651465581),(474.492086655278,-52.355170431166,-7.21473524659629,-471.539631444616))
flavour:  (G,G,P,G)
    and born is:  1.45473660712889e-05
    and born*sym_factor is:  0.00372412571424995
mu:  120
AlphaQED():  0.00756613379127384
AlphaQCD():  0.113307297485655

Momenta are:  ((53.7243132120324,0,0,53.7243132120324),(7.34210949040249,0,0,-7.34210949040249),(43.8330651840005,14.7113074583267,-6.94957132725252,40.7015785278513),(17.2333575184344,-14.7113074583267,6.94957132725252,5.68062519377864))
flavour:  (G,G,P,G)
    and born is:  1.71668213879719e-05
    and born*sym_factor is:  0.0043947062753208
mu:  120
AlphaQED():  0.00756613379127384
AlphaQCD():  0.113307297485655

Momenta are:  ((984.744249503741,0,0,984.744249503741),(933.220766146166,0,0,-933.220766146166),(980.35586858232,-419.475437294156,-332.35858575939,821.386484575132),(937.609147067588,419.475437294157,332.358585759388,-769.863001217558))
flavour:  (G,G,P,G)
    and born is:  0.000307674876360372
    and born*sym_factor is:  0.0787647683482553
mu:  120
AlphaQED():  0.00756613379127384
AlphaQCD():  0.113307297485655

Momenta are:  ((298.767637865665,0,0,298.767637865665),(1.66089488916087,0,0,-1.6608948891609),(258.514871582076,11.1393325491996,10.4114875936861,258.064827176317),(41.9136611727494,-11.1393325491997,-10.4114875936861,39.0419158001872))
flavour:  (G,G,P,G)
    and born is:  2.46694221725402e-05
    and born*sym_factor is:  0.0063153720761703
mu:  120
AlphaQED():  0.00756613379127384
AlphaQCD():  0.113307297485655

Momenta are:  ((727.87908451089,0,0,727.87908451089),(662.768929692421,0,0,-662.768929692421),(686.370771153383,-627.74524941045,-227.736810244791,-158.67161874711),(704.277243049933,627.745249410449,227.736810244791,223.781773565578))
flavour:  (G,G,P,G)
    and born is:  0.000102303371364071
    and born*sym_factor is:  0.0261896630692022
mu:  120
AlphaQED():  0.00756613379127384
AlphaQCD():  0.113307297485655

Momenta are:  ((11.8993396815142,0,0,11.8993396815142),(37.4031537595672,0,0,-37.4031537595672),(22.5657949283234,20.0273410065722,5.66345895813517,-8.72043264885034),(26.736698512758,-20.0273410065722,-5.66345895813517,-16.7833814292027))
flavour:  (G,G,P,G)
    and born is:  1.12401507348209e-05
    and born*sym_factor is:  0.00287747858811415
mu:  120
AlphaQED():  0.00756613379127384
AlphaQCD():  0.113307297485655

Momenta are:  ((57.9089114160488,0,0,57.9089114160488),(56.9843083479963,0,0,-56.9843083479963),(57.6358763458408,-32.0487761635625,41.4690637176115,23.9809704339837),(57.2573434182044,32.0487761635624,-41.4690637176112,-23.0563673659312))
flavour:  (G,G,P,G)
    and born is:  1.34789375635301e-05
    and born*sym_factor is:  0.0034506080162637
mu:  120
AlphaQED():  0.00756613379127384
AlphaQCD():  0.113307297485655

Momenta are:  ((329.27807472194,0,0,329.27807472194),(834.125086318978,0,0,-834.125086318978),(383.296738338519,-255.421747936814,199.337892487225,204.793859577381),(780.106422702399,255.421747936814,-199.337892487225,-709.640871174419))
flavour:  (G,G,P,G)
    and born is:  0.000193368547058763
    and born*sym_factor is:  0.0495023480470433
mu:  120
AlphaQED():  0.00756613379127384
AlphaQCD():  0.113307297485655

Momenta are:  ((261.216060967174,0,0,261.216060967174),(620.726600037823,0,0,-620.726600037823),(534.581153481418,-318.918400100233,-128.30606748439,-409.396649695282),(347.36150752358,318.918400100233,128.30606748439,49.8861106246331))
flavour:  (G,G,P,G)
    and born is:  9.47226335443347e-05
    and born*sym_factor is:  0.0242489941873497
mu:  120
AlphaQED():  0.00756613379127384
AlphaQCD():  0.113307297485655

Momenta are:  ((308.407707690284,0,0,308.407707690284),(10.061404402847,0,0,-10.061404402847),(53.4435473819053,-30.515557936781,-24.7221594316937,36.2467696988689),(265.025564711226,30.515557936781,24.7221594316937,262.099533588569))
flavour:  (G,G,P,G)
    and born is:  2.32362911319482e-05
    and born*sym_factor is:  0.00594849052977874
mu:  120
AlphaQED():  0.00756613379127384
AlphaQCD():  0.113307297485655

Momenta are:  ((131.053719775559,0,0,131.053719775559),(3.90846254570624,0,0,-3.90846254570627),(64.5617610633208,-5.03503146707718,22.0405732692895,60.4738173070292),(70.400421257945,5.03503146707718,-22.0405732692895,66.6714399228241))
flavour:  (G,G,P,G)
    and born is:  1.08983681930267e-05
    and born*sym_factor is:  0.00278998225741484
mu:  120
AlphaQED():  0.00756613379127384
AlphaQCD():  0.113307297485655

Momenta are:  ((979.002834970658,0,0,979.002834970658),(495.148004536329,0,0,-495.148004536329),(548.205042180371,424.470328936808,-95.558005150695,-333.500188569482),(925.945797326616,-424.470328936808,95.558005150695,817.355019003811))
flavour:  (G,G,P,G)
    and born is:  0.000228335274863518
    and born*sym_factor is:  0.0584538303650605
mu:  120
AlphaQED():  0.00756613379127384
AlphaQCD():  0.113307297485655

Momenta are:  ((3.14609330312017,0,0,3.1460933031202),(503.186636112824,0,0,-503.186636112824),(373.069818678902,25.8562502520703,-23.4612943089448,-371.43251284905),(133.262910737041,-25.8562502520703,23.4612943089448,-128.608029960651))
flavour:  (G,G,P,G)
    and born is:  1.47675141399808e-05
    and born*sym_factor is:  0.00378048361983509
mu:  120
AlphaQED():  0.00756613379127384
AlphaQCD():  0.113307297485655

Momenta are:  ((487.255998651351,0,0,487.255998651351),(26.8335929402829,0,0,-26.8335929402829),(69.8759214076774,48.2707586407697,-45.8480580612472,21.2257820781468),(444.213670183956,-48.2707586407697,45.8480580612472,439.196623632921))
flavour:  (G,G,P,G)
    and born is:  3.17888559098188e-05
    and born*sym_factor is:  0.00813794711291362
mu:  120
AlphaQED():  0.00756613379127384
AlphaQCD():  0.113307297485655

Momenta are:  ((570.492647500104,0,0,570.492647500104),(759.699115186435,0,0,-759.699115186435),(637.701160416161,-507.81984673441,-373.067519496307,97.9918320863175),(692.490602270373,507.819846734415,373.067519496303,-287.198299772645))
flavour:  (G,G,P,G)
    and born is:  0.000101773938715554
    and born*sym_factor is:  0.0260541283111819
mu:  120
AlphaQED():  0.00756613379127384
AlphaQCD():  0.113307297485655

Momenta are:  ((9.1241862679377,0,0,9.1241862679377),(39.7713204259657,0,0,-39.7713204259657),(18.8455372758564,14.2394158773709,10.5649170456077,-6.38559617470416),(30.049969418047,-14.2394158773709,-10.5649170456077,-24.2615379833238))
flavour:  (G,G,P,G)
    and born is:  1.29196764862776e-05
    and born*sym_factor is:  0.00330743718048707
mu:  120
AlphaQED():  0.00756613379127384
AlphaQCD():  0.113307297485655

Momenta are:  ((196.914156950965,0,0,196.914156950965),(4.17567142081677,0,0,-4.17567142081681),(126.40483445483,-2.80107402713316,-27.4808070468961,123.349671267899),(74.6849939169516,2.80107402713316,27.4808070468961,69.388814262249))
flavour:  (G,G,P,G)
    and born is:  1.19070712599164e-05
    and born*sym_factor is:  0.0030482102425386
mu:  120
AlphaQED():  0.00756613379127384
AlphaQCD():  0.113307297485655

Momenta are:  ((449.569316920772,0,0,449.569316920772),(1.92607856793158,0,0,-1.92607856793159),(204.852153747175,11.901260702172,26.7716048567263,202.746260290912),(246.643241741533,-11.901260702172,-26.7716048567263,244.896978061932))
flavour:  (G,G,P,G)
    and born is:  1.0986298301152e-05
    and born*sym_factor is:  0.00281249236509492
mu:  120
AlphaQED():  0.00756613379127384
AlphaQCD():  0.113307297485655

Momenta are:  ((2.29223747027295,0,0,2.29223747027294),(709.612818925,0,0,-709.612818925),(569.723085276537,2.73072547409838,32.0132202783624,-568.816394597422),(142.181971118734,-2.73072547409838,-32.0132202783624,-138.504186857303))
flavour:  (G,G,P,G)
    and born is:  1.81948481131928e-05
    and born*sym_factor is:  0.00465788111697737
mu:  120
AlphaQED():  0.00756613379127384
AlphaQCD():  0.113307297485655

Momenta are:  ((221.41396648872,0,0,221.41396648872),(13.7904010924565,0,0,-13.7904010924565),(155.360557501139,-17.5765658721873,48.378851863605,146.585994731982),(79.8438100800375,17.5765658721873,-48.378851863605,61.0375706642812))
flavour:  (G,G,P,G)
    and born is:  1.28517465677677e-05
    and born*sym_factor is:  0.00329004712134853
mu:  120
AlphaQED():  0.00756613379127384
AlphaQCD():  0.113307297485655

Momenta are:  ((869.275699732828,0,0,869.275699732828),(439.763417588973,0,0,-439.763417588973),(779.580051193909,-261.857211784843,429.034290668483,595.907236309777),(529.459066127892,261.857211784843,-429.034290668483,-166.394954165922))
flavour:  (G,G,P,G)
    and born is:  0.00013872538472209
    and born*sym_factor is:  0.0355136984888551
mu:  120
AlphaQED():  0.00756613379127384
AlphaQCD():  0.113307297485655

Momenta are:  ((273.445140452661,0,0,273.445140452661),(7.46192255166961,0,0,-7.46192255166957),(238.122997734082,30.2605129542886,-4.92216355655892,236.14113515339),(42.7840652702486,-30.2605129542886,4.92216355655888,29.8420827476017))
flavour:  (G,G,P,G)
    and born is:  2.50458937835339e-05
    and born*sym_factor is:  0.00641174880858468
mu:  120
AlphaQED():  0.00756613379127384
AlphaQCD():  0.113307297485655

Momenta are:  ((65.1003149343136,0,0,65.1003149343136),(122.679030669066,0,0,-122.679030669066),(68.898770093011,-20.8982428202556,39.136820583759,52.7125529826614),(118.880575510369,20.8982428202556,-39.136820583759,-110.291268717414))
flavour:  (G,G,P,G)
    and born is:  4.31772368345528e-05
    and born*sym_factor is:  0.0110533726296455
mu:  120
AlphaQED():  0.00756613379127384
AlphaQCD():  0.113307297485655

Momenta are:  ((89.9495830888111,0,0,89.9495830888111),(65.4467592505355,0,0,-65.4467592505355),(76.4444656275138,-0.770689183176999,-76.3195163508473,4.30044035324724),(78.9518767118328,0.770689183177017,76.3195163508472,20.2023834850284))
flavour:  (G,G,P,G)
    and born is:  1.08549319998267e-05
    and born*sym_factor is:  0.00277886259195564
mu:  120
AlphaQED():  0.00756613379127384
AlphaQCD():  0.113307297485655

Momenta are:  ((184.11070826546,0,0,184.11070826546),(2.61949861946921,0,0,-2.61949861946925),(96.0860472540704,19.274988223651,10.5032842104451,93.5450924778215),(90.6441596308593,-19.274988223651,-10.5032842104451,87.9461171681697))
flavour:  (G,G,P,G)
    and born is:  1.08820984217762e-05
    and born*sym_factor is:  0.00278581719597471
mu:  120
AlphaQED():  0.00756613379127384
AlphaQCD():  0.113307297485655

Momenta are:  ((159.268942105549,0,0,159.268942105549),(722.172341700207,0,0,-722.172341700207),(660.205203838336,-122.072795517845,-173.696185192695,-625.139007756821),(221.23607996742,122.072795517845,173.696185192695,62.2356081621624))
flavour:  (G,G,P,G)
    and born is:  0.000118034434809978
    and born*sym_factor is:  0.0302168153113544
mu:  120
AlphaQED():  0.00756613379127384
AlphaQCD():  0.113307297485655

Momenta are:  ((4.181887704673,0,0,4.181887704673),(153.172201131971,0,0,-153.172201131971),(68.5195933548766,-19.6441244782424,-15.5803909010697,-63.7675032157511),(88.8344954817675,19.6441244782424,15.5803909010697,-85.222810211547))
flavour:  (G,G,P,G)
    and born is:  1.11245009652931e-05
    and born*sym_factor is:  0.00284787224711503
mu:  120
AlphaQED():  0.00756613379127384
AlphaQCD():  0.113307297485655

Momenta are:  ((32.0947565162087,0,0,32.0947565162088),(309.502756597079,0,0,-309.502756597079),(267.900463538559,-9.7193728693492,70.5030685970689,-258.274097566129),(73.697049574729,9.71937286934919,-70.5030685970689,-19.1339025147416))
flavour:  (G,G,P,G)
    and born is:  2.20558842289802e-05
    and born*sym_factor is:  0.00564630636261894
mu:  120
AlphaQED():  0.00756613379127384
AlphaQCD():  0.113307297485655

Momenta are:  ((37.1763265703255,0,0,37.1763265703255),(77.1168450982997,0,0,-77.1168450982997),(59.7913246004209,-48.3362635386808,21.9144812703448,-27.5384029174497),(54.5018470682042,48.3362635386809,-21.9144812703448,-12.4021156105245))
flavour:  (G,G,P,G)
    and born is:  1.1074791555397e-05
    and born*sym_factor is:  0.00283514663818163
mu:  120
AlphaQED():  0.00756613379127384
AlphaQCD():  0.113307297485655

Momenta are:  ((1.00692679678418,0,0,1.00692679678413),(337.489420785418,0,0,-337.489420785418),(82.4295839596511,-2.02789548449489,15.6595350076937,-80.9030463889213),(256.066763622556,2.0278954844949,-15.6595350076937,-255.579447599718))
flavour:  (G,G,P,G)
    and born is:  1.55900353302912e-05
    and born*sym_factor is:  0.00399104904455454
mu:  120
AlphaQED():  0.00756613379127384
AlphaQCD():  0.113307297485655

Momenta are:  ((187.990136832108,0,0,187.990136832108),(12.2278973670358,0,0,-12.2278973670358),(119.978893709997,46.39046944643,5.39772298396222,110.515717737357),(80.2391404891467,-46.39046944643,-5.39772298396222,65.2465217277157))
flavour:  (G,G,P,G)
    and born is:  1.15703302154596e-05
    and born*sym_factor is:  0.00296200453515765
mu:  120
AlphaQED():  0.00756613379127384
AlphaQCD():  0.113307297485655

Momenta are:  ((433.145920788348,0,0,433.145920788348),(56.3183249832336,0,0,-56.3183249832336),(428.854523111962,-24.84529086131,21.9380173007151,427.571791530404),(60.6097226596196,24.84529086131,-21.9380173007151,-50.744195725289))
flavour:  (G,G,P,G)
    and born is:  0.000136859653461407
    and born*sym_factor is:  0.0350360712861201
mu:  120
AlphaQED():  0.00756613379127384
AlphaQCD():  0.113307297485655

Momenta are:  ((568.795160120109,0,0,568.795160120109),(86.2062754382226,0,0,-86.2062754382227),(565.841872995362,30.7749235223358,-15.6792945597672,564.786764220977),(89.1595625629737,-30.7749235223302,15.679294559764,-82.1978795390843))
flavour:  (G,G,P,G)
    and born is:  0.000240056959286563
    and born*sym_factor is:  0.0614545815773602
mu:  120
AlphaQED():  0.00756613379127384
AlphaQCD():  0.113307297485655

Momenta are:  ((24.9676250693945,0,0,24.9676250693945),(243.959986313812,0,0,-243.959986313812),(218.063462596977,-45.1138026417961,22.476750291212,-212.158464896706),(50.8641487862294,45.1138026417962,-22.476750291212,-6.83389634771154))
flavour:  (G,G,P,G)
    and born is:  2.72698387767368e-05
    and born*sym_factor is:  0.00698107872684462
mu:  120
AlphaQED():  0.00756613379127384
AlphaQCD():  0.113307297485655

Momenta are:  ((942.92135942199,0,0,942.921359421989),(993.636259499954,0,0,-993.636259499954),(976.587137123086,848.387860833096,-341.434017532653,-342.612442355533),(959.970481798857,-848.387860833096,341.434017532653,291.897542277568))
flavour:  (G,G,P,G)
    and born is:  0.000112837705693589
    and born*sym_factor is:  0.0288864526575589
mu:  120
AlphaQED():  0.00756613379127384
AlphaQCD():  0.113307297485655

Momenta are:  ((975.243562605264,0,0,975.243562605264),(980.929180367197,0,0,-980.929180367197),(975.473270421982,230.017034477028,308.9431425368,896.211135747396),(980.699472550482,-230.017034477028,-308.943142536797,-901.896753509328))
flavour:  (G,G,P,G)
    and born is:  0.000503510846236444
    and born*sym_factor is:  0.12889877663653
mu:  120
AlphaQED():  0.00756613379127384
AlphaQCD():  0.113307297485655

Momenta are:  ((1.16083959882016,0,0,1.1608395988201),(292.116380263374,0,0,-292.116380263374),(108.628467184722,-5.08451756035873,-17.0322886474167,-107.164325722284),(184.64875267747,5.08451756035874,17.0322886474167,-183.791214942268))
flavour:  (G,G,P,G)
    and born is:  1.18520823646505e-05
    and born*sym_factor is:  0.00303413308535054
mu:  120
AlphaQED():  0.00756613379127384
AlphaQCD():  0.113307297485655

Momenta are:  ((1.69824802957133,0,0,1.69824802957136),(349.738123360221,0,0,-349.738123360221),(224.901299807752,23.2645743977328,-2.29303371440524,-223.683026244043),(126.535071582039,-23.2645743977328,2.29303371440524,-124.356849086605))
flavour:  (G,G,P,G)
    and born is:  1.20308150013876e-05
    and born*sym_factor is:  0.00307988864035522
mu:  120
AlphaQED():  0.00756613379127384
AlphaQCD():  0.113307297485655

Momenta are:  ((10.2842943160188,0,0,10.2842943160189),(148.114988676442,0,0,-148.114988676442),(27.97635925761,19.3680959765509,17.509762755139,-10.0479721244003),(130.422923734851,-19.3680959765509,-17.5097627551389,-127.782722236023))
flavour:  (G,G,P,G)
    and born is:  2.57574378618028e-05
    and born*sym_factor is:  0.00659390409262152
mu:  120
AlphaQED():  0.00756613379127384
AlphaQCD():  0.113307297485655

Momenta are:  ((443.524734254187,0,0,443.524734254187),(2.79211593449637,0,0,-2.79211593449632),(343.767125682618,4.18414396427543,29.1532678755393,342.503162921968),(102.549724506067,-4.18414396427543,-29.1532678755393,98.2294553977238))
flavour:  (G,G,P,G)
    and born is:  1.63899598527708e-05
    and born*sym_factor is:  0.00419582972230931
mu:  120
AlphaQED():  0.00756613379127384
AlphaQCD():  0.113307297485655

Momenta are:  ((421.666668163722,0,0,421.666668163722),(268.038167766747,0,0,-268.038167766747),(349.124546326792,324.364544550137,-86.3759445513795,95.993683591823),(340.580289603677,-324.364544550137,86.3759445513795,57.6348168051515))
flavour:  (G,G,P,G)
    and born is:  5.84993689489215e-05
    and born*sym_factor is:  0.0149758384509239
mu:  120
AlphaQED():  0.00756613379127384
AlphaQCD():  0.113307297485655

Momenta are:  ((55.9987858742087,0,0,55.9987858742087),(10.2413865999442,0,0,-10.2413865999442),(44.9583439397471,-5.87758067201965,19.631838914922,40.0162171633833),(21.2818285344058,5.87758067201962,-19.631838914922,5.74118211088126))
flavour:  (G,G,P,G)
    and born is:  1.56232534786289e-05
    and born*sym_factor is:  0.00399955289052901
mu:  120
AlphaQED():  0.00756613379127384
AlphaQCD():  0.113307297485655

Momenta are:  ((539.862601248346,0,0,539.862601248346),(640.51339102554,0,0,-640.51339102554),(606.566078947479,-267.729662154212,-487.325631015278,-242.398361149724),(573.809913326406,267.729662154212,487.325631015278,141.74757137253))
flavour:  (G,G,P,G)
    and born is:  0.000100415752188939
    and born*sym_factor is:  0.0257064325603683
mu:  120
AlphaQED():  0.00756613379127384
AlphaQCD():  0.113307297485655

Momenta are:  ((967.209904945069,0,0,967.209904945069),(991.153907125998,0,0,-991.153907125997),(989.376790684156,513.170818625052,-11.682008909033,-845.804750237325),(968.987021386911,-513.170818625051,11.6820089090331,821.860748056398))
flavour:  (G,G,P,G)
    and born is:  0.000341025428557799
    and born*sym_factor is:  0.0873025097107967
mu:  120
AlphaQED():  0.00756613379127384
AlphaQCD():  0.113307297485655

Momenta are:  ((612.854380458655,0,0,612.854380458655),(8.91596587888822,0,0,-8.91596587888827),(91.99953245405,36.6703534479632,-35.3335890028644,76.6207324289054),(529.77081388349,-36.6703534479638,35.3335890028646,527.317682150858))
flavour:  (G,G,P,G)
    and born is:  2.41650800527707e-05
    and born*sym_factor is:  0.00618626049350929
mu:  120
AlphaQED():  0.00756613379127384
AlphaQCD():  0.113307297485655

Momenta are:  ((253.103389192738,0,0,253.103389192738),(5.6984473803044,0,0,-5.69844738030442),(88.5649843301618,34.7958766719339,8.62372169045619,80.9853989323936),(170.236852242881,-34.7958766719339,-8.62372169045619,166.41954288004))
flavour:  (G,G,P,G)
    and born is:  1.24913242595881e-05
    and born*sym_factor is:  0.00319777901045456
mu:  120
AlphaQED():  0.00756613379127384
AlphaQCD():  0.113307297485655

Momenta are:  ((836.067031141115,0,0,836.067031141115),(681.879617394104,0,0,-681.879617394104),(818.182191392552,-331.602858261846,-351.950924914326,659.99408266775),(699.764457142665,331.602858261846,351.950924914326,-505.80666892074))
flavour:  (G,G,P,G)
    and born is:  0.00022784004666811
    and born*sym_factor is:  0.0583270519470362
mu:  120
AlphaQED():  0.00756613379127384
AlphaQCD():  0.113307297485655

Momenta are:  ((447.715379706843,0,0,447.715379706843),(6.91715437843248,0,0,-6.9171543784325),(217.212510512742,-54.8419848351202,9.09750948277171,209.978253025887),(237.420023572533,54.8419848351202,-9.09750948277209,230.819972302524))
flavour:  (G,G,P,G)
    and born is:  1.08567168170649e-05
    and born*sym_factor is:  0.00277931950516861
mu:  120
AlphaQED():  0.00756613379127384
AlphaQCD():  0.113307297485655

Momenta are:  ((95.2515866480976,0,0,95.2515866480976),(30.582321925479,0,0,-30.582321925479),(50.0233052926823,-17.0944278954692,-46.4500369776409,7.24607977511207),(75.8106032808943,17.0944278954692,46.4500369776409,57.4231849475065))
flavour:  (G,G,P,G)
    and born is:  1.33318899283193e-05
    and born*sym_factor is:  0.00341296382164975
mu:  120
AlphaQED():  0.00756613379127384
AlphaQCD():  0.113307297485655

Momenta are:  ((29.4992994462411,0,0,29.4992994462411),(121.076076244549,0,0,-121.076076244549),(62.7584223247543,47.7334834836602,32.027234053525,-25.1871079341815),(87.8169533660359,-47.7334834836603,-32.027234053525,-66.3896688641267))
flavour:  (G,G,P,G)
    and born is:  1.1895089701737e-05
    and born*sym_factor is:  0.00304514296364468
mu:  120
AlphaQED():  0.00756613379127384
AlphaQCD():  0.113307297485655

Momenta are:  ((633.153261782493,0,0,633.153261782493),(1.09653468859881,0,0,-1.09653468859869),(289.094789405633,9.84744676845208,-24.3277741790522,287.900997666078),(345.155007065462,-9.84744676845208,24.3277741790522,344.15572942782))
flavour:  (G,G,P,G)
    and born is:  1.09758293744554e-05
    and born*sym_factor is:  0.00280981231986059
mu:  120
AlphaQED():  0.00756613379127384
AlphaQCD():  0.113307297485655

Momenta are:  ((924.087734953197,0,0,924.087734953197),(0.653728110087628,0,0,-0.653728110087727),(295.188522233457,8.82634508346751,-21.1422630452025,294.298086986931),(629.552940829844,-8.82634508346751,21.1422630452025,629.135919856194))
flavour:  (G,G,P,G)
    and born is:  1.28743099565638e-05
    and born*sym_factor is:  0.00329582334888034
mu:  120
AlphaQED():  0.00756613379127384
AlphaQCD():  0.113307297485655

Momenta are:  ((24.1463870810147,0,0,24.1463870810147),(190.983138513548,0,0,-190.983138513548),(152.480375245988,35.5293829506457,-44.8581748083314,-141.335317366782),(62.649150348575,-35.5293829506457,44.8581748083314,-25.501434065752))
flavour:  (G,G,P,G)
    and born is:  1.60422861484879e-05
    and born*sym_factor is:  0.00410682525401291
mu:  120
AlphaQED():  0.00756613379127384
AlphaQCD():  0.113307297485655

Momenta are:  ((450.074914962429,0,0,450.074914962429),(401.469483676142,0,0,-401.469483676142),(421.309799974911,243.44454138047,339.608646756824,-53.8764315350543),(430.23459866366,-243.444541380469,-339.608646756824,102.481862821342))
flavour:  (G,G,P,G)
    and born is:  7.65921783804275e-05
    and born*sym_factor is:  0.0196075976653894
mu:  120
AlphaQED():  0.00756613379127384
AlphaQCD():  0.113307297485655

Momenta are:  ((176.472947068769,0,0,176.472947068769),(112.321924063741,0,0,-112.321924063741),(160.462671533165,-4.70587800394368,121.766965422321,104.397939632982),(128.332199599345,4.70587800394376,-121.766965422321,-40.2469166279532))
flavour:  (G,G,P,G)
    and born is:  1.27687766651205e-05
    and born*sym_factor is:  0.00326880682627086
mu:  120
AlphaQED():  0.00756613379127384
AlphaQCD():  0.113307297485655

Momenta are:  ((767.381679565024,0,0,767.381679565024),(0.771089410995986,0,0,-0.771089410995955),(409.335140584377,-8.90460821964477,-22.5800427139174,408.614863827448),(358.817628391618,8.90460821964477,22.5800427139174,357.995726326555))
flavour:  (G,G,P,G)
    and born is:  1.09283688892729e-05
    and born*sym_factor is:  0.00279766243565386
mu:  120
AlphaQED():  0.00756613379127384
AlphaQCD():  0.113307297485655

Momenta are:  ((14.273159256208,0,0,14.273159256208),(123.095774271788,0,0,-123.095774271788),(57.6596918850643,-32.173101468813,25.4897180600108,-40.4945167075639),(79.7092416429322,32.173101468813,-25.4897180600108,-68.3280983080166))
flavour:  (G,G,P,G)
    and born is:  1.14326156892352e-05
    and born*sym_factor is:  0.00292674961644421
mu:  120
AlphaQED():  0.00756613379127384
AlphaQCD():  0.113307297485655

Momenta are:  ((21.0818102536757,0,0,21.0818102536757),(41.8231098574027,0,0,-41.8231098574027),(30.4310495573901,23.1390064099096,-18.3777136215234,-7.27288124279292),(32.4738705536884,-23.1390064099096,18.3777136215234,-13.468418360934))
flavour:  (G,G,P,G)
    and born is:  1.0999726315607e-05
    and born*sym_factor is:  0.00281592993679539
mu:  120
AlphaQED():  0.00756613379127384
AlphaQCD():  0.113307297485655

Momenta are:  ((220.30585108809,0,0,220.30585108809),(294.598306665479,0,0,-294.598306665479),(226.977832652882,-95.679401256554,-109.846079750553,174.063860276687),(287.926325100687,95.679401256554,109.846079750553,-248.356315854075))
flavour:  (G,G,P,G)
    and born is:  7.75656354860602e-05
    and born*sym_factor is:  0.0198568026844314
mu:  120
AlphaQED():  0.00756613379127384
AlphaQCD():  0.113307297485655

Momenta are:  ((895.623895865508,0,0,895.623895865508),(412.569266340224,0,0,-412.569266340223),(433.827389814053,-244.856030737293,47.1980511148126,-354.998693427759),(874.365772391678,244.856030737293,-47.1980511148127,838.053322953043))
flavour:  (G,G,P,G)
    and born is:  0.000353353232801302
    and born*sym_factor is:  0.0904584275971334
mu:  120
AlphaQED():  0.00756613379127384
AlphaQCD():  0.113307297485655

Momenta are:  ((0.704539931605965,0,0,0.704539931606007),(743.45785702543,0,0,-743.457857025429),(608.840120344825,2.08153254928497,-17.5093623923747,-608.584736575244),(135.322276612225,-2.08153254928498,17.5093623923746,-134.168580518594))
flavour:  (G,G,P,G)
    and born is:  1.95130565145155e-05
    and born*sym_factor is:  0.00499534246771597
mu:  120
AlphaQED():  0.00756613379127384
AlphaQCD():  0.113307297485655

Momenta are:  ((776.15527547286,0,0,776.15527547286),(325.318485995242,0,0,-325.318485995242),(390.113906627048,190.307326347675,-296.781104121191,-167.011849635959),(711.359854841055,-190.307326347675,296.78110412119,617.848639113575))
flavour:  (G,G,P,G)
    and born is:  0.000156435256534143
    and born*sym_factor is:  0.0400474256727406
mu:  120
AlphaQED():  0.00756613379127384
AlphaQCD():  0.113307297485655

Momenta are:  ((87.2308501208472,0,0,87.2308501208472),(15.7990334013942,0,0,-15.7990334013942),(80.2749436213864,21.1122385471289,-6.22993178684748,77.197978645021),(22.7549399008541,-21.1122385471253,6.22993178685354,-5.76616192556922))
flavour:  (G,G,P,G)
    and born is:  3.21849856134819e-05
    and born*sym_factor is:  0.00823935631705136
mu:  120
AlphaQED():  0.00756613379127384
AlphaQCD():  0.113307297485655

Momenta are:  ((41.5698243346777,0,0,41.5698243346778),(42.2837045259421,0,0,-42.2837045259421),(41.7872467508533,34.6045333388096,-17.0794094372364,16.0310335504344),(42.0662821097666,-34.6045333388095,17.0794094372364,-16.7449137416988))
flavour:  (G,G,P,G)
    and born is:  1.32449273898214e-05
    and born*sym_factor is:  0.00339070141179428
mu:  120
AlphaQED():  0.00756613379127384
AlphaQCD():  0.113307297485655

Momenta are:  ((57.8906254546676,0,0,57.8906254546676),(18.0187687515362,0,0,-18.0187687515362),(40.1085391412496,1.02226796948371,-32.092011843854,24.0364859340472),(35.8008550649543,-1.02226796948371,32.092011843854,15.8353707690842))
flavour:  (G,G,P,G)
    and born is:  1.10254980253927e-05
    and born*sym_factor is:  0.00282252749450053
mu:  120
AlphaQED():  0.00756613379127384
AlphaQCD():  0.113307297485655

Momenta are:  ((0.85428727135177,0,0,0.854287271351755),(276.24794039995,0,0,-276.24794039995),(135.351769321007,-12.982935048739,-8.20433388393135,-134.477632940829),(141.750458350298,12.982935048739,8.20433388393134,-140.916020187773))
flavour:  (G,G,P,G)
    and born is:  1.08778742529023e-05
    and born*sym_factor is:  0.00278473580874298
mu:  120
AlphaQED():  0.00756613379127384
AlphaQCD():  0.113307297485655

Momenta are:  ((851.513630874852,0,0,851.513630874852),(509.734055730143,0,0,-509.734055730143),(680.649029974419,207.071760826056,625.433268235066,170.990101638424),(680.598656630585,-207.071760826056,-625.433268235065,170.789473506287))
flavour:  (G,G,P,G)
    and born is:  9.20831855080262e-05
    and born*sym_factor is:  0.0235732954900547
mu:  120
AlphaQED():  0.00756613379127384
AlphaQCD():  0.113307297485655

Momenta are:  ((28.4733462534311,0,0,28.4733462534311),(159.581495687033,0,0,-159.581495687033),(32.4584482777413,-21.4845735160324,8.60629938066779,22.7573191831397),(155.596393662723,21.4845735160325,-8.60629938066778,-153.865468616742))
flavour:  (G,G,P,G)
    and born is:  7.79473682962491e-05
    and born*sym_factor is:  0.0199545262838398
mu:  120
AlphaQED():  0.00756613379127384
AlphaQCD():  0.113307297485655

Momenta are:  ((8.6931820618647,0,0,8.69318206186472),(89.2873572398399,0,0,-89.2873572398399),(73.5425266777273,21.4489312311163,-5.29094750212413,-70.1459368297041),(24.4380126239772,-21.4489312311163,5.29094750212413,-10.448238348271))
flavour:  (G,G,P,G)
    and born is:  1.8383623218713e-05
    and born*sym_factor is:  0.00470620754399054
mu:  120
AlphaQED():  0.00756613379127384
AlphaQCD():  0.113307297485655

Momenta are:  ((9.45656865686014,0,0,9.45656865686015),(30.810856067494,0,0,-30.810856067494),(15.5105155451405,-11.8332452888448,9.83421095908364,-1.95925833475712),(24.7569091792136,11.8332452888448,-9.83421095908364,-19.3950290758767))
flavour:  (G,G,P,G)
    and born is:  1.39114468098223e-05
    and born*sym_factor is:  0.0035613303833145
mu:  120
AlphaQED():  0.00756613379127384
AlphaQCD():  0.113307297485655

Momenta are:  ((0.908244005472093,0,0,0.908244005472024),(634.028745816002,0,0,-634.028745816002),(411.370812568777,-16.8641386657667,15.517202805306,-410.731983996446),(223.566177252691,16.8641386657666,-15.517202805306,-222.388517814078))
flavour:  (G,G,P,G)
    and born is:  1.21588667416461e-05
    and born*sym_factor is:  0.0031126698858614
mu:  120
AlphaQED():  0.00756613379127384
AlphaQCD():  0.113307297485655

Momenta are:  ((560.738423954538,0,0,560.738423954538),(463.369914752463,0,0,-463.369914752463),(545.425358933225,16.2296419877931,370.787157192312,399.677751381822),(478.682979773776,-16.2296419877931,-370.787157192312,-302.309242179747))
flavour:  (G,G,P,G)
    and born is:  0.000149478782585454
    and born*sym_factor is:  0.0382665683418761
mu:  120
AlphaQED():  0.00756613379127384
AlphaQCD():  0.113307297485655

Momenta are:  ((389.939976168455,0,0,389.939976168455),(55.0754397276501,0,0,-55.0754397276501),(298.304388258815,32.6873189898786,126.516351311626,268.161630518821),(146.711027637291,-32.6873189898786,-126.516351311626,66.7029059219837))
flavour:  (G,G,P,G)
    and born is:  1.13627470905442e-05
    and born*sym_factor is:  0.00290886325517931
mu:  120
AlphaQED():  0.00756613379127384
AlphaQCD():  0.113307297485655

Momenta are:  ((114.485167165989,0,0,114.485167165989),(74.8685148951794,0,0,-74.8685148951793),(86.7067150211576,-62.3280313358348,-57.4359673234026,-18.2860765935304),(102.646967040011,62.3280313358348,57.4359673234026,57.9027288643398))
flavour:  (G,G,P,G)
    and born is:  1.30492923147689e-05
    and born*sym_factor is:  0.00334061883258084
mu:  120
AlphaQED():  0.00756613379127384
AlphaQCD():  0.113307297485655

Momenta are:  ((202.939654112359,0,0,202.939654112359),(510.418091214061,0,0,-510.418091214061),(261.086468721629,-215.500414975453,-130.753981722606,68.0375746086097),(452.27127660479,215.500414975453,130.753981722606,-375.516011710311))
flavour:  (G,G,P,G)
    and born is:  8.19505731108182e-05
    and born*sym_factor is:  0.0209793467163695
mu:  120
AlphaQED():  0.00756613379127384
AlphaQCD():  0.113307297485655

Momenta are:  ((219.981667361669,0,0,219.981667361669),(389.30796858268,0,0,-389.30796858268),(306.026800835078,172.459338973804,-236.380146090497,-89.635962449826),(303.262835109269,-172.459338973805,236.380146090496,-79.6903387711842))
flavour:  (G,G,P,G)
    and born is:  4.7464931031959e-05
    and born*sym_factor is:  0.0121510223441815
mu:  120
AlphaQED():  0.00756613379127384
AlphaQCD():  0.113307297485655

Momenta are:  ((0.571351736375842,0,0,0.57135173637581),(572.626030533824,0,0,-572.626030533824),(138.453241870842,-7.33533703238396,13.6233517439431,-137.585963319039),(434.744140399366,7.33533703238394,-13.6233517439431,-434.468715478417))
flavour:  (G,G,P,G)
    and born is:  1.56361017370129e-05
    and born*sym_factor is:  0.00400284204467531
mu:  120
AlphaQED():  0.00756613379127384
AlphaQCD():  0.113307297485655

Momenta are:  ((70.3442780582324,0,0,70.3442780582324),(275.703565767923,0,0,-275.703565767923),(176.9691572129,-59.9983745304817,125.561664415073,-109.327700459035),(169.078686613256,59.9983745304816,-125.561664415073,-96.0315872506552))
flavour:  (G,G,P,G)
    and born is:  8.86540313706813e-06
    and born*sym_factor is:  0.00226954320308944
mu:  120
AlphaQED():  0.00756613379127384
AlphaQCD():  0.113307297485655

Momenta are:  ((14.5781417017222,0,0,14.5781417017222),(220.54121431796,0,0,-220.54121431796),(105.205174144116,-49.9007222138343,-26.0523781114359,-88.8781198269314),(129.914181875565,49.9007222138343,26.0523781114363,-117.084952789305))
flavour:  (G,G,P,G)
    and born is:  1.10215182249666e-05
    and born*sym_factor is:  0.00282150866559146
mu:  120
AlphaQED():  0.00756613379127384
AlphaQCD():  0.113307297485655

Momenta are:  ((619.692257103227,0,0,619.692257103227),(517.731393992678,0,0,-517.731393992678),(563.937424641737,-324.428270147324,461.266209892498,-2.28036229124177),(573.486226454168,324.428270147324,-461.266209892498,104.24122540179))
flavour:  (G,G,P,G)
    and born is:  8.8265003259142e-05
    and born*sym_factor is:  0.0225958408343404
mu:  120
AlphaQED():  0.00756613379127384
AlphaQCD():  0.113307297485655

Momenta are:  ((26.9621624628185,0,0,26.9621624628185),(17.1086619106516,0,0,-17.1086619106516),(18.8653494057644,-11.0701415067333,12.1556401205574,-9.2516911147083),(25.2054749677057,11.0701415067333,-12.1556401205574,19.1051916668752))
flavour:  (G,G,P,G)
    and born is:  1.97719119692531e-05
    and born*sym_factor is:  0.0050616094641288
mu:  120
AlphaQED():  0.00756613379127384
AlphaQCD():  0.113307297485655

Momenta are:  ((0.578524443180135,0,0,0.578524443180108),(442.380647584157,0,0,-442.380647584157),(265.969528049891,1.30461099053968,15.6155322498613,-265.507519655844),(176.989643977439,-1.30461099053963,-15.6155322498612,-176.294603485125))
flavour:  (G,G,P,G)
    and born is:  1.14372693755696e-05
    and born*sym_factor is:  0.00292794096014582
mu:  120
AlphaQED():  0.00756613379127384
AlphaQCD():  0.113307297485655

Momenta are:  ((167.330715713352,0,0,167.330715713352),(705.039435027028,0,0,-705.039435027028),(405.761784713247,162.239327797839,300.237392501306,-219.496092433105),(466.608366027133,-162.239327797839,-300.237392501306,-318.21262688057))
flavour:  (G,G,P,G)
    and born is:  6.0659365721197e-05
    and born*sym_factor is:  0.0155287976246264
mu:  120
AlphaQED():  0.00756613379127384
AlphaQCD():  0.113307297485655

Momenta are:  ((0.479992464334034,0,0,0.479992464333993),(999.931498881914,0,0,-999.931498881914),(783.660272452048,17.7753470566443,-3.09435588122605,-783.45254139502),(216.75121889412,-17.7753470566443,3.09435588122605,-215.99896502248))
flavour:  (G,G,P,G)
    and born is:  1.69733479833508e-05
    and born*sym_factor is:  0.0043451770837378
mu:  120
AlphaQED():  0.00756613379127384
AlphaQCD():  0.113307297485655

Momenta are:  ((424.715865510358,0,0,424.715865510358),(84.8221406331595,0,0,-84.8221406331594),(402.998503129705,62.7942220772728,68.3803785155443,392.159155232367),(106.539503013812,-62.7942220772728,-68.3803785155443,-52.2654303551693))
flavour:  (G,G,P,G)
    and born is:  3.95378279829714e-05
    and born*sym_factor is:  0.0101216839636407
mu:  120
AlphaQED():  0.00756613379127384
AlphaQCD():  0.113307297485655

Momenta are:  ((519.595403552274,0,0,519.595403552274),(269.204628178525,0,0,-269.204628178525),(482.87226027467,-45.2087674476363,-260.730941900926,403.907369360959),(305.927771456127,45.2087674476371,260.730941900925,-153.516593987211))
flavour:  (G,G,P,G)
    and born is:  0.000115539695026322
    and born*sym_factor is:  0.0295781619267383
mu:  120
AlphaQED():  0.00756613379127384
AlphaQCD():  0.113307297485655

Momenta are:  ((6.7049935834075,0,0,6.70499358340744),(593.017002116294,0,0,-593.017002116294),(86.6748879111894,43.1652079915723,3.19362612600826,-75.0939529231803),(513.04710778851,-43.1652079915723,-3.19362612600824,-511.218055609704))
flavour:  (G,G,P,G)
    and born is:  2.44308396581475e-05
    and born*sym_factor is:  0.00625429495248576
mu:  120
AlphaQED():  0.00756613379127384
AlphaQCD():  0.113307297485655

Momenta are:  ((13.3540377836166,0,0,13.3540377836164),(778.70205833377,0,0,-778.70205833377),(223.053956620776,65.2993846841402,63.3257736785814,-203.663703963334),(569.002139496614,-65.2993846841402,-63.3257736785814,-561.684316586822))
flavour:  (G,G,P,G)
    and born is:  1.36647711452335e-05
    and born*sym_factor is:  0.00349818141317979
mu:  120
AlphaQED():  0.00756613379127384
AlphaQCD():  0.113307297485655

Momenta are:  ((759.450252902771,0,0,759.450252902771),(656.391341626767,0,0,-656.391341626767),(729.572237766068,-606.932375203609,205.234389300459,348.980783850862),(686.269356763471,606.932375203608,-205.234389300459,-245.921872574858))
flavour:  (G,G,P,G)
    and born is:  0.000116745691833737
    and born*sym_factor is:  0.0298868971094367
mu:  120
AlphaQED():  0.00756613379127384
AlphaQCD():  0.113307297485655

Momenta are:  ((602.845206537345,0,0,602.845206537345),(36.3654535996193,0,0,-36.3654535996193),(118.20522130324,44.4018879674189,94.1646656440789,55.9818044762368),(521.005438833724,-44.4018879674188,-94.1646656440789,510.497948461489))
flavour:  (G,G,P,G)
    and born is:  1.95111465330492e-05
    and born*sym_factor is:  0.00499485351246061
mu:  120
AlphaQED():  0.00756613379127384
AlphaQCD():  0.113307297485655

Momenta are:  ((423.096797389713,0,0,423.096797389713),(1.83877201207857,0,0,-1.83877201207847),(166.310053200625,-26.2521972367937,-7.17213684325703,164.068328415136),(258.625516201169,26.2521972367937,7.17213684325703,257.189696962501))
flavour:  (G,G,P,G)
    and born is:  1.15458274764483e-05
    and born*sym_factor is:  0.00295573183397077
mu:  120
AlphaQED():  0.00756613379127384
AlphaQCD():  0.113307297485655

Momenta are:  ((875.497698474518,0,0,875.497698474518),(814.225592630613,0,0,-814.225592630613),(861.946242351935,-579.422711319714,394.250212763761,501.784232561428),(827.777048753197,579.422711319714,-394.250212763761,-440.512126717521))
flavour:  (G,G,P,G)
    and born is:  0.000146867218498809
    and born*sym_factor is:  0.0375980079356952
mu:  120
AlphaQED():  0.00756613379127384
AlphaQCD():  0.113307297485655

Momenta are:  ((50.7855874882004,0,0,50.7855874882004),(12.5950537150907,0,0,-12.5950537150907),(22.7306162294679,3.81518927807304,-22.0060814931691,4.22582799695251),(40.6500249738232,-3.81518927807305,22.0060814931691,33.9647057761573))
flavour:  (G,G,P,G)
    and born is:  1.45699113739054e-05
    and born*sym_factor is:  0.00372989731171978
mu:  120
AlphaQED():  0.00756613379127384
AlphaQCD():  0.113307297485655

Momenta are:  ((388.164771546447,0,0,388.164771546447),(749.825699981918,0,0,-749.825699981918),(541.412870990539,-58.0127056768911,-530.017707651455,-94.0406956065366),(596.577600537826,58.0127056768909,530.017707651455,-267.620232828934))
flavour:  (G,G,P,G)
    and born is:  8.78134341868328e-05
    and born*sym_factor is:  0.0224802391518292
mu:  120
AlphaQED():  0.00756613379127384
AlphaQCD():  0.113307297485655

Momenta are:  ((960.127067325154,0,0,960.127067325154),(131.069992495873,0,0,-131.069992495873),(440.77339626007,-144.10836608543,311.495194732965,276.558690575972),(650.423663560957,144.10836608543,-311.495194732965,552.498384253309))
flavour:  (G,G,P,G)
    and born is:  6.63077330652728e-05
    and born*sym_factor is:  0.0169747796647098
mu:  120
AlphaQED():  0.00756613379127384
AlphaQCD():  0.113307297485655

Momenta are:  ((7.57153527578124,0,0,7.57153527578124),(33.711230995801,0,0,-33.711230995801),(24.2491532337983,15.2392870452411,1.88706060222752,-18.7676467675757),(17.033613037784,-15.2392870452411,-1.88706060222752,-7.37204895244405))
flavour:  (G,G,P,G)
    and born is:  1.19747130855348e-05
    and born*sym_factor is:  0.0030655265498969
mu:  120
AlphaQED():  0.00756613379127384
AlphaQCD():  0.113307297485655

Momenta are:  ((32.620028812042,0,0,32.620028812042),(783.471763180212,0,0,-783.471763180211),(638.329649967922,88.2294958110101,-90.3139903931238,-625.71853195856),(177.762142024331,-88.2294958110101,90.3139903931238,-125.133202409609))
flavour:  (G,G,P,G)
    and born is:  1.34185086305496e-05
    and born*sym_factor is:  0.0034351382094207
mu:  120
AlphaQED():  0.00756613379127384
AlphaQCD():  0.113307297485655

Momenta are:  ((136.02882026948,0,0,136.02882026948),(39.1138454123236,0,0,-39.1138454123236),(115.638064775755,-58.6803729554891,9.60651700534367,99.1790839134565),(59.5046009060482,58.6803729554891,-9.60651700534367,-2.26410905630055))
flavour:  (G,G,P,G)
    and born is:  1.71884566806906e-05
    and born*sym_factor is:  0.0044002449102568
mu:  120
AlphaQED():  0.00756613379127384
AlphaQCD():  0.113307297485655

Momenta are:  ((9.70466778751541,0,0,9.7046677875154),(76.953677821263,0,0,-76.953677821263),(70.2674784322911,-13.878487673392,-8.65233080895953,-68.3377148923223),(16.3908671764873,13.878487673392,8.65233080895953,1.08870485857473))
flavour:  (G,G,P,G)
    and born is:  3.16633401541869e-05
    and born*sym_factor is:  0.00810581507947184
mu:  120
AlphaQED():  0.00756613379127384
AlphaQCD():  0.113307297485655

Momenta are:  ((35.2680965179988,0,0,35.2680965179988),(66.2444745401468,0,0,-66.2444745401468),(53.0038523438403,1.92743767469068,-47.7849618587857,-22.8536817045349),(48.5087187143052,-1.92743767469062,47.7849618587859,-8.12269631761317))
flavour:  (G,G,P,G)
    and born is:  1.11364354379305e-05
    and born*sym_factor is:  0.00285092747211021
mu:  120
AlphaQED():  0.00756613379127384
AlphaQCD():  0.113307297485655

Momenta are:  ((348.553261517252,0,0,348.553261517252),(888.82480099596,0,0,-888.824800995961),(747.281771603563,478.058734602146,105.166035929873,-564.650331911911),(490.096290909688,-478.058734602144,-105.166035930035,24.3787924331124))
flavour:  (G,G,P,G)
    and born is:  0.000113594700276292
    and born*sym_factor is:  0.0290802432707307
mu:  120
AlphaQED():  0.00756613379127384
AlphaQCD():  0.113307297485655

Momenta are:  ((819.858272763542,0,0,819.858272763542),(512.925531873028,0,0,-512.925531873029),(760.956657300483,474.040300205518,-190.108713809121,564.091752292859),(571.827147336088,-474.040300205518,190.108713809121,-257.159011402346))
flavour:  (G,G,P,G)
    and born is:  0.000150160406150984
    and born*sym_factor is:  0.038441063974652
mu:  120
AlphaQED():  0.00756613379127384
AlphaQCD():  0.113307297485655

Momenta are:  ((29.2316938418908,0,0,29.2316938418908),(404.05444526001,0,0,-404.05444526001),(374.299247464181,9.31829960150592,-58.0168040254478,-369.65814801714),(58.9868916377194,-9.31829960150592,58.0168040254478,-5.16460340097903))
flavour:  (G,G,P,G)
    and born is:  3.65977348740112e-05
    and born*sym_factor is:  0.00936902012774687
mu:  120
AlphaQED():  0.00756613379127384
AlphaQCD():  0.113307297485655

Momenta are:  ((574.67138147395,0,0,574.67138147395),(0.80443156428096,0,0,-0.804431564280954),(324.888032746291,-7.22679883703472,-20.0576120036577,324.187753317479),(250.587780291941,7.22679883703471,20.0576120036577,249.67919659219))
flavour:  (G,G,P,G)
    and born is:  1.10997466036909e-05
    and born*sym_factor is:  0.00284153513054487
mu:  120
AlphaQED():  0.00756613379127384
AlphaQCD():  0.113307297485655

Momenta are:  ((3.05889939331158,0,0,3.0588993933116),(167.274395420312,0,0,-167.274395420312),(82.8608559749924,12.8864742167388,-18.5798495060506,-79.7160550171813),(87.4724388386305,-12.8864742167388,18.5798495060506,-84.4994410098184))
flavour:  (G,G,P,G)
    and born is:  1.08804951727531e-05
    and born*sym_factor is:  0.00278540676422478
mu:  120
AlphaQED():  0.00756613379127384
AlphaQCD():  0.113307297485655

Momenta are:  ((201.181834043748,0,0,201.181834043748),(1.9890322960859,0,0,-1.98903229608589),(96.3597968603754,-12.4029594991401,15.6595710888484,94.2664037711676),(106.811069479458,12.40295949914,-15.6595710888484,104.926397976494))
flavour:  (G,G,P,G)
    and born is:  1.09075573033437e-05
    and born*sym_factor is:  0.00279233466965598
mu:  120
AlphaQED():  0.00756613379127384
AlphaQCD():  0.113307297485655

Momenta are:  ((352.358798628063,0,0,352.358798628063),(3.88206237879913,0,0,-3.88206237879912),(320.516109432604,-20.1626469491675,-6.9102543066048,319.806648553832),(35.7247515742594,20.1626469491675,6.91025430660479,28.6700876954331))
flavour:  (G,G,P,G)
    and born is:  3.38641808460269e-05
    and born*sym_factor is:  0.0086692302965829
mu:  120
AlphaQED():  0.00756613379127384
AlphaQCD():  0.113307297485655

Momenta are:  ((629.879252366831,0,0,629.879252366831),(437.572371449388,0,0,-437.572371449388),(614.669337044312,131.930282093656,-250.787527749192,545.452482343449),(452.782286771909,-131.930282093658,250.787527749194,-353.145601426008))
flavour:  (G,G,P,G)
    and born is:  0.000229990150195268
    and born*sym_factor is:  0.0588774784499885
mu:  120
AlphaQED():  0.00756613379127384
AlphaQCD():  0.113307297485655

Momenta are:  ((851.047504444862,0,0,851.047504444862),(569.331939578017,0,0,-569.331939578017),(725.860542961163,-487.542952184954,490.74769284868,219.868368726272),(694.518901061716,487.542952184954,-490.74769284868,61.8471961405725))
flavour:  (G,G,P,G)
    and born is:  9.48210063282572e-05
    and born*sym_factor is:  0.0242741776200338
mu:  120
AlphaQED():  0.00756613379127384
AlphaQCD():  0.113307297485655

Momenta are:  ((113.633984838501,0,0,113.633984838501),(28.6782227038439,0,0,-28.6782227038439),(77.742011506274,-50.5429944138308,-25.0177856082098,53.5101529804088),(64.5701960360709,50.5429944138308,25.0177856082098,31.4456091542483))
flavour:  (G,G,P,G)
    and born is:  1.11548350939019e-05
    and born*sym_factor is:  0.00285563778403889
mu:  120
AlphaQED():  0.00756613379127384
AlphaQCD():  0.113307297485655

Momenta are:  ((18.9239407636673,0,0,18.9239407636673),(64.3310499342407,0,0,-64.3310499342407),(22.4651135569504,-2.64023465003517,-18.5250584654882,12.4311180900865),(60.7898771409577,2.64023465003517,18.5250584654882,-57.8382272606598))
flavour:  (G,G,P,G)
    and born is:  3.84036630746865e-05
    and born*sym_factor is:  0.00983133774711974
mu:  120
AlphaQED():  0.00756613379127384
AlphaQCD():  0.113307297485655

Momenta are:  ((898.152445987618,0,0,898.152445987618),(724.134414729618,0,0,-724.134414729618),(852.327169419198,520.209508192818,483.791466061383,470.945313897596),(769.959691298038,-520.209508192818,-483.791466061383,-296.927282639596))
flavour:  (G,G,P,G)
    and born is:  0.000128473404227708
    and born*sym_factor is:  0.0328891914822931
mu:  120
AlphaQED():  0.00756613379127384
AlphaQCD():  0.113307297485655

Momenta are:  ((22.5474787890005,0,0,22.5474787890005),(28.1528593912058,0,0,-28.1528593912058),(24.1974780669054,12.6528749144793,-19.165268228145,7.62333227271156),(26.5028601133009,-12.6528749144793,19.165268228145,-13.2287128749169))
flavour:  (G,G,P,G)
    and born is:  1.35594533525613e-05
    and born*sym_factor is:  0.00347122005825568
mu:  120
AlphaQED():  0.00756613379127384
AlphaQCD():  0.113307297485655

Momenta are:  ((19.2199162270958,0,0,19.2199162270958),(53.7506533753289,0,0,-53.7506533753289),(49.6886202965369,8.75054344420369,-18.771057590055,-45.1667396803816),(23.2819493058878,-8.7505434442037,18.771057590055,10.6360025321486))
flavour:  (G,G,P,G)
    and born is:  2.76498629024195e-05
    and born*sym_factor is:  0.0070783649030194
mu:  120
AlphaQED():  0.00756613379127384
AlphaQCD():  0.113307297485655

Momenta are:  ((2.83901162771499,0,0,2.83901162771492),(194.594801789342,0,0,-194.594801789342),(141.705692029958,-10.0071267950186,18.4729724653181,-140.139608445626),(55.7281213870987,10.0071267950186,-18.4729724653181,-51.6161817160009))
flavour:  (G,G,P,G)
    and born is:  1.41783216547126e-05
    and born*sym_factor is:  0.00362965034360642
mu:  120
AlphaQED():  0.00756613379127384
AlphaQCD():  0.113307297485655

Momenta are:  ((47.309874398679,0,0,47.309874398679),(18.3450357196699,0,0,-18.3450357196699),(38.9526312360354,-26.1641270033765,5.30019366564205,28.3664217952923),(26.7022788823135,26.1641270033765,-5.30019366564205,0.59841688371683))
flavour:  (G,G,P,G)
    and born is:  1.37418995601184e-05
    and born*sym_factor is:  0.0035179262873903
mu:  120
AlphaQED():  0.00756613379127384
AlphaQCD():  0.113307297485655

Momenta are:  ((2.835853908844,0,0,2.83585390884397),(386.328840859405,0,0,-386.328840859405),(298.200791118113,-23.2201769378808,-15.377309278932,-296.897412527934),(90.9639036501346,23.2201769378808,15.377309278932,-86.595574422626))
flavour:  (G,G,P,G)
    and born is:  1.62034265484972e-05
    and born*sym_factor is:  0.00414807719641528
mu:  120
AlphaQED():  0.00756613379127384
AlphaQCD():  0.113307297485655

Momenta are:  ((131.73533352614,0,0,131.73533352614),(133.995647552867,0,0,-133.995647552867),(133.590633683894,-101.21975342406,11.8065028515175,-86.3807004790643),(132.140347395113,101.21975342406,-11.8065028515175,84.1203864523376))
flavour:  (G,G,P,G)
    and born is:  1.75465374199464e-05
    and born*sym_factor is:  0.00449191357950628
mu:  120
AlphaQED():  0.00756613379127384
AlphaQCD():  0.113307297485655

Momenta are:  ((1.65286752432518,0,0,1.65286752432544),(625.588450176682,0,0,-625.588450176682),(134.536633621793,-25.9429775314353,-4.49871691064356,-131.934943245699),(492.704684079213,25.9429775314353,4.49871691064356,-492.000639406656))
flavour:  (G,G,P,G)
    and born is:  1.71792636040359e-05
    and born*sym_factor is:  0.00439789148263319
mu:  120
AlphaQED():  0.00756613379127384
AlphaQCD():  0.113307297485655

Momenta are:  ((48.7056269860154,0,0,48.7056269860153),(413.295823163699,0,0,-413.295823163699),(412.261354068025,-6.0188270491337,13.8414889421741,-411.984964486348),(49.7400960816895,6.01882704913371,-13.8414889421742,47.3947683086645))
flavour:  (G,G,P,G)
    and born is:  0.000335424603748433
    and born*sym_factor is:  0.0858686985595988
mu:  120
AlphaQED():  0.00756613379127384
AlphaQCD():  0.113307297485655

Momenta are:  ((742.757749517434,0,0,742.757749517434),(365.419482376168,0,0,-365.419482376168),(530.549654840059,505.503942250991,107.977137278133,119.539275741623),(577.627577053544,-505.503942250991,-107.977137278133,257.798991399644))
flavour:  (G,G,P,G)
    and born is:  8.55830459858184e-05
    and born*sym_factor is:  0.0219092597723695
mu:  120
AlphaQED():  0.00756613379127384
AlphaQCD():  0.113307297485655

Momenta are:  ((482.439030265128,0,0,482.439030265128),(823.047896384815,0,0,-823.047896384815),(803.639200699609,-197.801612268926,214.991682017636,-748.658175503445),(501.847725950334,197.801612268926,-214.991682017636,408.049309383758))
flavour:  (G,G,P,G)
    and born is:  0.000318578350102229
    and born*sym_factor is:  0.0815560576261705
mu:  120
AlphaQED():  0.00756613379127384
AlphaQCD():  0.113307297485655
  
------------------------------------------------------------------------
|              You are using CutTools - Version 1.9.5                  |
|              Authors: G. Ossola, C. Papadopoulos, R. Pittau          |
|              Published in JHEP 0803:042,2008                         |
|              http://www.ugr.es/~pittau/CutTools                      |
|                                                                      |
|              Compiler with  34  significant digits detetected        |
 ---------------------------------------------------------------------- 
   
########################################################################
#                                                                      #
#                     You are using OneLOop-3.6.1                      #
#                                                                      #
# for the evaluation of 1-loop scalar 1-, 2-, 3- and 4-point functions #
#                                                                      #
# author: Andreas van Hameren <hamerenREMOVETHIS@ifj.edu.pl>           #
#   date: 11-12-2015                                                   #
#                                                                      #
# Please cite                                                          #
#    A. van Hameren,                                                   #
#      Comput.Phys.Commun. 182 (2011) 2427-2438, arXiv:1007.4716       #
#    A. van Hameren, C.G. Papadopoulos and R. Pittau,                  #
#      JHEP 0909:106,2009, arXiv:0903.4665                             #
# in publications with results obtained with the help of this program. #
#                                                                      #
########################################################################
[OpenLoops] Library for 21 21 -> 22 21 not installed but available in: ppaj2
[OpenLoops] Note: this library can be downloaded and installed via
[OpenLoops] $ cd /work1/Stephan/programs/OpenLoops
[OpenLoops] $ ./openloops libinstall ppaj2
