1.0000000000000001e+03   0.0000000000000000e+00   0.0000000000000000e+00   8.6285577583601230e+02   1.0000000000000001e+03   0.0000000000000000e+00   0.0000000000000000e+00   -8.6285577583601230e+02   9.9999999999999943e+02   2.2184856888666721e+02   8.8966157897223923e+02   -3.9910585985996153e+02   9.9999999999999989e+02   -2.2184856888666724e+02   -8.8966157897223934e+02   3.9910585985996141e+02   1.5875012974638340e-02
1.0000000000000001e+03   0.0000000000000000e+00   0.0000000000000000e+00   8.6285577583601230e+02   1.0000000000000001e+03   0.0000000000000000e+00   0.0000000000000000e+00   -8.6285577583601230e+02   9.9999999999999989e+02   -5.6383101161624427e+02   -7.8158193319879763e+02   2.6687875904244061e+02   1.0000000000000002e+03   5.6383101161624438e+02   7.8158193319879786e+02   -2.6687875904244061e+02   1.5117542059131399e-02
1.0000000000000001e+03   0.0000000000000000e+00   0.0000000000000000e+00   8.6285577583601230e+02   1.0000000000000001e+03   0.0000000000000000e+00   0.0000000000000000e+00   -8.6285577583601230e+02   9.9999999999999784e+02   -4.8124205818536944e+02   5.6094401197973207e+02   -6.7360811815816817e+02   1.0000000000000023e+03   4.8124205818536916e+02   -5.6094401197973207e+02   6.7360811815816817e+02   1.8407872758698450e-02
1.0000000000000001e+03   0.0000000000000000e+00   0.0000000000000000e+00   8.6285577583601230e+02   1.0000000000000001e+03   0.0000000000000000e+00   0.0000000000000000e+00   -8.6285577583601230e+02   1.0000000000000000e+03   9.0207042620294976e+02   1.2095937430304494e+02   -4.1429189701132776e+02   1.0000000000000000e+03   -9.0207042620294976e+02   -1.2095937430304494e+02   4.1429189701132759e+02   1.5981262920012205e-02
1.0000000000000001e+03   0.0000000000000000e+00   0.0000000000000000e+00   8.6285577583601230e+02   1.0000000000000001e+03   0.0000000000000000e+00   0.0000000000000000e+00   -8.6285577583601230e+02   1.0000000000000013e+03   9.1145796773985489e+02   -4.0737892459034322e+02   -5.7330487824105568e+01   1.0000000000000013e+03   -9.1145796773985512e+02   4.0737892459034350e+02   5.7330487824106804e+01   1.4533168218508275e-02
1.0000000000000001e+03   0.0000000000000000e+00   0.0000000000000000e+00   8.6285577583601230e+02   1.0000000000000001e+03   0.0000000000000000e+00   0.0000000000000000e+00   -8.6285577583601230e+02   1.0000000000000002e+03   -3.7467054356902128e+02   8.8908586296431406e+02   -2.6296066635467452e+02   9.9999999999999989e+02   3.7467054356902128e+02   -8.8908586296431429e+02   2.6296066635467452e+02   1.5099685397726489e-02
1.0000000000000001e+03   0.0000000000000000e+00   0.0000000000000000e+00   8.6285577583601230e+02   1.0000000000000001e+03   0.0000000000000000e+00   0.0000000000000000e+00   -8.6285577583601230e+02   1.0000000000000000e+03   2.3493619165449547e+02   -9.6727830171096173e+02   9.5800171612785888e+01   1.0000000000000000e+03   -2.3493619165449527e+02   9.6727830171096173e+02   -9.5800171612785888e+01   1.4583839519653332e-02
1.0000000000000001e+03   0.0000000000000000e+00   0.0000000000000000e+00   8.6285577583601230e+02   1.0000000000000001e+03   0.0000000000000000e+00   0.0000000000000000e+00   -8.6285577583601230e+02   9.9999999999999989e+02   -2.7144253043547491e+02   9.3341533929009768e+02   -2.3463750134992912e+02   1.0000000000000001e+03   2.7144253043547485e+02   -9.3341533929009768e+02   2.3463750134992912e+02   1.4978457704307427e-02
1.0000000000000001e+03   0.0000000000000000e+00   0.0000000000000000e+00   8.6285577583601230e+02   1.0000000000000001e+03   0.0000000000000000e+00   0.0000000000000000e+00   -8.6285577583601230e+02   1.0000000000000009e+03   -3.7125411547074765e+02   -2.8253305522107519e+02   -8.8450294202137945e+02   9.9999999999999670e+02   3.7125411547074725e+02   2.8253305522107655e+02   8.8450294202137661e+02   2.1234350814969320e-02
1.0000000000000001e+03   0.0000000000000000e+00   0.0000000000000000e+00   8.6285577583601230e+02   1.0000000000000001e+03   0.0000000000000000e+00   0.0000000000000000e+00   -8.6285577583601230e+02   9.9999999999999966e+02   -3.1849724456341977e+02   4.1438523424881254e+02   8.5255168924415750e+02   1.0000000000000003e+03   3.1849724456341971e+02   -4.1438523424881265e+02   -8.5255168924415716e+02   2.0756950550168577e-02
1.0000000000000001e+03   0.0000000000000000e+00   0.0000000000000000e+00   8.6285577583601230e+02   1.0000000000000001e+03   0.0000000000000000e+00   0.0000000000000000e+00   -8.6285577583601230e+02   1.0000000000000000e+03   7.5740963579529151e+01   -5.9921352469726025e+02   -7.9699840542307879e+02   1.0000000000000000e+03   -7.5740963579529051e+01   5.9921352469726025e+02   7.9699840542307879e+02   1.9968714067645926e-02
1.0000000000000001e+03   0.0000000000000000e+00   0.0000000000000000e+00   8.6285577583601230e+02   1.0000000000000001e+03   0.0000000000000000e+00   0.0000000000000000e+00   -8.6285577583601230e+02   9.9999999999999886e+02   4.3688009058072129e+02   7.2492344142936884e+02   -5.3256153683060904e+02   9.9999999999999966e+02   -4.3688009058072078e+02   -7.2492344142936781e+02   5.3256153683061052e+02   1.6944509154053849e-02
1.0000000000000001e+03   0.0000000000000000e+00   0.0000000000000000e+00   8.6285577583601230e+02   1.0000000000000001e+03   0.0000000000000000e+00   0.0000000000000000e+00   -8.6285577583601230e+02   9.9999999999999943e+02   -7.9064876390571257e+01   -2.6197291198742352e+02   -9.6183103438034971e+02   9.9999999999999989e+02   7.9064876390571257e+01   2.6197291198742363e+02   9.6183103438034948e+02   2.2462436997989242e-02
1.0000000000000001e+03   0.0000000000000000e+00   0.0000000000000000e+00   8.6285577583601230e+02   1.0000000000000001e+03   0.0000000000000000e+00   0.0000000000000000e+00   -8.6285577583601230e+02   9.9999999999999909e+02   -1.4192723683314452e+02   9.8952429927913875e+02   -2.6425755846139129e+01   1.0000000000000003e+03   1.4192723683314651e+02   -9.8952429927913829e+02   2.6425755846139005e+01   1.4510903179504849e-02
1.0000000000000001e+03   0.0000000000000000e+00   0.0000000000000000e+00   8.6285577583601230e+02   1.0000000000000001e+03   0.0000000000000000e+00   0.0000000000000000e+00   -8.6285577583601230e+02   9.9999999999999977e+02   -8.9133111751771605e+02   -8.3448089094438586e+01   -4.4560661503405163e+02   9.9999999999999920e+02   8.9133111751771548e+02   8.3448089094438856e+01   4.4560661503405146e+02   1.6212883417390519e-02
1.0000000000000001e+03   0.0000000000000000e+00   0.0000000000000000e+00   8.6285577583601230e+02   1.0000000000000001e+03   0.0000000000000000e+00   0.0000000000000000e+00   -8.6285577583601230e+02   9.9999999999999977e+02   4.7261931127137910e+02   -8.2596787797277648e+02   3.0725893178476565e+02   1.0000000000000000e+03   -4.7261931127137916e+02   8.2596787797277682e+02   -3.0725893178476565e+02   1.5316960592432871e-02
1.0000000000000001e+03   0.0000000000000000e+00   0.0000000000000000e+00   8.6285577583601230e+02   1.0000000000000001e+03   0.0000000000000000e+00   0.0000000000000000e+00   -8.6285577583601230e+02   9.9999999999999932e+02   6.8503840053833892e+02   -5.3330150537141424e+02   4.9629819075577751e+02   1.0000000000000003e+03   -6.8503840053833915e+02   5.3330150537141424e+02   -4.9629819075577728e+02   1.6623582838819165e-02
1.0000000000000001e+03   0.0000000000000000e+00   0.0000000000000000e+00   8.6285577583601230e+02   1.0000000000000001e+03   0.0000000000000000e+00   0.0000000000000000e+00   -8.6285577583601230e+02   9.9999999999999852e+02   -3.8935745778694792e+02   6.8984436683507909e+02   6.1034049480809699e+02   1.0000000000000030e+03   3.8935745778694582e+02   -6.8984436683508193e+02   -6.1034049480809438e+02   1.7709141053495421e-02
1.0000000000000001e+03   0.0000000000000000e+00   0.0000000000000000e+00   8.6285577583601230e+02   1.0000000000000001e+03   0.0000000000000000e+00   0.0000000000000000e+00   -8.6285577583601230e+02   9.9999999999999989e+02   2.2547530012757989e+02   9.7375766790561056e+02   -3.0933690668978656e+01   9.9999999999999977e+02   -2.2547530012757989e+02   -9.7375766790561056e+02   3.0933690668978645e+01   1.4513127328449364e-02
1.0000000000000001e+03   0.0000000000000000e+00   0.0000000000000000e+00   8.6285577583601230e+02   1.0000000000000001e+03   0.0000000000000000e+00   0.0000000000000000e+00   -8.6285577583601230e+02   1.0000000000000007e+03   5.4011127385879286e+02   -8.3868370986418063e+02   -6.9924578297536016e+01   9.9999999999999829e+02   -5.4011127385879297e+02   8.3868370986418029e+02   6.9924578297534254e+01   1.4546953739275701e-02
1.0000000000000001e+03   0.0000000000000000e+00   0.0000000000000000e+00   8.6285577583601230e+02   1.0000000000000001e+03   0.0000000000000000e+00   0.0000000000000000e+00   -8.6285577583601230e+02   1.0000000000000002e+03   -2.3126267718723653e+02   9.4504493787027161e+02   2.3110092932951892e+02   9.9999999999999966e+02   2.3126267718723679e+02   -9.4504493787027150e+02   -2.3110092932951878e+02   1.4964289791704104e-02
1.0000000000000001e+03   0.0000000000000000e+00   0.0000000000000000e+00   8.6285577583601230e+02   1.0000000000000001e+03   0.0000000000000000e+00   0.0000000000000000e+00   -8.6285577583601230e+02   9.9999999999999977e+02   4.7622490234831764e+02   -8.5589623489523956e+02   -2.0162211551932498e+02   9.9999999999999977e+02   -4.7622490234831764e+02   8.5589623489523956e+02   2.0162211551932498e+02   1.4854565871544032e-02
1.0000000000000001e+03   0.0000000000000000e+00   0.0000000000000000e+00   8.6285577583601230e+02   1.0000000000000001e+03   0.0000000000000000e+00   0.0000000000000000e+00   -8.6285577583601230e+02   9.9999999999999955e+02   9.1185997433117041e+02   4.0404846596758773e+02   -7.2499823123896093e+01   9.9999999999999966e+02   -9.1185997433117041e+02   -4.0404846596758784e+02   7.2499823123895908e+01   1.4550108629215790e-02
1.0000000000000001e+03   0.0000000000000000e+00   0.0000000000000000e+00   8.6285577583601230e+02   1.0000000000000001e+03   0.0000000000000000e+00   0.0000000000000000e+00   -8.6285577583601230e+02   9.9999999999999955e+02   -3.4847154465500449e+02   -3.4939804842325879e+02   -8.6976352321465743e+02   1.0000000000000001e+03   3.4847154465500410e+02   3.4939804842325879e+02   8.6976352321465743e+02   2.1011939331125135e-02
1.0000000000000001e+03   0.0000000000000000e+00   0.0000000000000000e+00   8.6285577583601230e+02   1.0000000000000001e+03   0.0000000000000000e+00   0.0000000000000000e+00   -8.6285577583601230e+02   9.9999999999999955e+02   4.4882369792084518e+02   -8.8252748769525510e+02   1.4036567115202993e+02   1.0000000000000007e+03   -4.4882369792084506e+02   8.8252748769525533e+02   -1.4036567115203030e+02   1.4674370484870046e-02
1.0000000000000001e+03   0.0000000000000000e+00   0.0000000000000000e+00   8.6285577583601230e+02   1.0000000000000001e+03   0.0000000000000000e+00   0.0000000000000000e+00   -8.6285577583601230e+02   1.0000000000000003e+03   6.4468744005762733e+02   2.8765955813552341e+02   -7.0825848617310555e+02   1.0000000000000002e+03   -6.4468744005762687e+02   -2.8765955813552341e+02   7.0825848617310555e+02   1.8819738111871157e-02
1.0000000000000001e+03   0.0000000000000000e+00   0.0000000000000000e+00   8.6285577583601230e+02   1.0000000000000001e+03   0.0000000000000000e+00   0.0000000000000000e+00   -8.6285577583601230e+02   9.9999999999999682e+02   -8.6944835815225633e+02   -1.8630001301402919e+02   -4.5754984170941668e+02   1.0000000000000018e+03   8.6944835815225804e+02   1.8630001301403078e+02   4.5754984170941680e+02   1.6305665892363062e-02
1.0000000000000001e+03   0.0000000000000000e+00   0.0000000000000000e+00   8.6285577583601230e+02   1.0000000000000001e+03   0.0000000000000000e+00   0.0000000000000000e+00   -8.6285577583601230e+02   9.9999999999999659e+02   3.0040398654741568e+02   9.1732612899836340e+02   -2.6128570170273900e+02   1.0000000000000008e+03   -3.0040398654741853e+02   -9.1732612899836170e+02   2.6128570170274475e+02   1.5092132347657505e-02
1.0000000000000001e+03   0.0000000000000000e+00   0.0000000000000000e+00   8.6285577583601230e+02   1.0000000000000001e+03   0.0000000000000000e+00   0.0000000000000000e+00   -8.6285577583601230e+02   9.9999999999999875e+02   -2.0103795484473711e+01   -9.7959447288967363e+02   -1.9997626379678385e+02   9.9999999999999932e+02   2.0103795484473903e+01   9.7959447288967317e+02   1.9997626379678476e+02   1.4848880433321634e-02
1.0000000000000001e+03   0.0000000000000000e+00   0.0000000000000000e+00   8.6285577583601230e+02   1.0000000000000001e+03   0.0000000000000000e+00   0.0000000000000000e+00   -8.6285577583601230e+02   9.9999999999999818e+02   -4.5581609037387136e+02   6.1337759033038867e+02   -6.4498032793858169e+02   9.9999999999999693e+02   4.5581609037387739e+02   -6.1337759033038787e+02   6.4498032793858044e+02   1.8083175681621218e-02
1.0000000000000001e+03   0.0000000000000000e+00   0.0000000000000000e+00   8.6285577583601230e+02   1.0000000000000001e+03   0.0000000000000000e+00   0.0000000000000000e+00   -8.6285577583601230e+02   9.9999999999999989e+02   -8.1915935569268674e+02   5.6981301429688040e+02   -6.5506325725423522e+01   9.9999999999999989e+02   8.1915935569268674e+02   -5.6981301429688040e+02   6.5506325725423565e+01   1.4541806793374815e-02
1.0000000000000001e+03   0.0000000000000000e+00   0.0000000000000000e+00   8.6285577583601230e+02   1.0000000000000001e+03   0.0000000000000000e+00   0.0000000000000000e+00   -8.6285577583601230e+02   9.9999999999999898e+02   2.4947316405783846e+02   -9.5396530423359502e+02   1.6647323726194901e+02   9.9999999999999829e+02   -2.4947316405783766e+02   9.5396530423359468e+02   -1.6647323726194898e+02   1.4743276653477848e-02
1.0000000000000001e+03   0.0000000000000000e+00   0.0000000000000000e+00   8.6285577583601230e+02   1.0000000000000001e+03   0.0000000000000000e+00   0.0000000000000000e+00   -8.6285577583601230e+02   1.0000000000000003e+03   5.9878153383226834e+02   -4.3397096308191630e+02   6.7314922412064743e+02   9.9999999999999989e+02   -5.9878153383226845e+02   4.3397096308191618e+02   -6.7314922412064743e+02   1.8402556782181247e-02
1.0000000000000001e+03   0.0000000000000000e+00   0.0000000000000000e+00   8.6285577583601230e+02   1.0000000000000001e+03   0.0000000000000000e+00   0.0000000000000000e+00   -8.6285577583601230e+02   9.9999999999999989e+02   7.8522738919247081e+02   2.2835729355572511e+02   5.7556137269007274e+02   1.0000000000000002e+03   -7.8522738919247081e+02   -2.2835729355572519e+02   -5.7556137269007320e+02   1.7354369609627281e-02
1.0000000000000001e+03   0.0000000000000000e+00   0.0000000000000000e+00   8.6285577583601230e+02   1.0000000000000001e+03   0.0000000000000000e+00   0.0000000000000000e+00   -8.6285577583601230e+02   9.9999999999999977e+02   2.9535624837918721e+02   3.4329234381136337e+02   -8.9158008794211662e+02   9.9999999999999966e+02   -2.9535624837918721e+02   -3.4329234381136331e+02   8.9158008794211662e+02   2.1342469984693527e-02
1.0000000000000001e+03   0.0000000000000000e+00   0.0000000000000000e+00   8.6285577583601230e+02   1.0000000000000001e+03   0.0000000000000000e+00   0.0000000000000000e+00   -8.6285577583601230e+02   1.0000000000000007e+03   2.3929378370652381e+02   -9.6922421223623815e+02   5.7817916647514224e+01   1.0000000000000003e+03   -2.3929378370652393e+02   9.6922421223623849e+02   -5.7817916647514934e+01   1.4533650999784714e-02
1.0000000000000001e+03   0.0000000000000000e+00   0.0000000000000000e+00   8.6285577583601230e+02   1.0000000000000001e+03   0.0000000000000000e+00   0.0000000000000000e+00   -8.6285577583601230e+02   9.9999999999999955e+02   6.5902713089661540e+02   -1.3634388471917964e+02   7.3965774911972505e+02   9.9999999999999966e+02   -6.5902713089661518e+02   1.3634388471917941e+02   -7.3965774911972505e+02   1.9210798816615162e-02
1.0000000000000001e+03   0.0000000000000000e+00   0.0000000000000000e+00   8.6285577583601230e+02   1.0000000000000001e+03   0.0000000000000000e+00   0.0000000000000000e+00   -8.6285577583601230e+02   1.0000000000000002e+03   9.0479175103133309e+02   -2.0468938945908141e+02   3.7343559163465272e+02   1.0000000000000002e+03   -9.0479175103133309e+02   2.0468938945908141e+02   -3.7343559163465261e+02   1.5704430863551465e-02
1.0000000000000001e+03   0.0000000000000000e+00   0.0000000000000000e+00   8.6285577583601230e+02   1.0000000000000001e+03   0.0000000000000000e+00   0.0000000000000000e+00   -8.6285577583601230e+02   9.9999999999999977e+02   -8.4168853317029016e+02   -1.9395847744475796e+02   -5.0392511561536242e+02   9.9999999999999989e+02   8.4168853317029027e+02   1.9395847744475796e+02   5.0392511561536253e+02   1.6689201554309984e-02
1.0000000000000001e+03   0.0000000000000000e+00   0.0000000000000000e+00   8.6285577583601230e+02   1.0000000000000001e+03   0.0000000000000000e+00   0.0000000000000000e+00   -8.6285577583601230e+02   1.0000000000000008e+03   -6.4810791618438827e+02   -6.3206257301062737e+02   -4.2479763743377401e+02   1.0000000000000003e+03   6.4810791618438770e+02   6.3206257301062772e+02   4.2479763743377436e+02   1.6057088590175888e-02
1.0000000000000001e+03   0.0000000000000000e+00   0.0000000000000000e+00   8.6285577583601230e+02   1.0000000000000001e+03   0.0000000000000000e+00   0.0000000000000000e+00   -8.6285577583601230e+02   9.9999999999999989e+02   8.6868137361253014e+02   -2.2134452001520071e+02   -4.4316957768882151e+02   1.0000000000000000e+03   -8.6868137361253014e+02   2.2134452001520063e+02   4.4316957768882156e+02   1.6194252429471475e-02
1.0000000000000001e+03   0.0000000000000000e+00   0.0000000000000000e+00   8.6285577583601230e+02   1.0000000000000001e+03   0.0000000000000000e+00   0.0000000000000000e+00   -8.6285577583601230e+02   1.0000000000000005e+03   6.3235087239194638e+02   -6.8896197398155459e+02   3.5420865684449967e+02   1.0000000000000005e+03   -6.3235087239194615e+02   6.8896197398155493e+02   -3.5420865684449967e+02   1.5584090743257353e-02
1.0000000000000001e+03   0.0000000000000000e+00   0.0000000000000000e+00   8.6285577583601230e+02   1.0000000000000001e+03   0.0000000000000000e+00   0.0000000000000000e+00   -8.6285577583601230e+02   9.9999999999999989e+02   4.4131469578241644e+02   -2.7915787423887643e+01   8.9691808326623459e+02   9.9999999999999898e+02   -4.4131469578241644e+02   2.7915787423887632e+01   -8.9691808326623448e+02   2.1424589802367257e-02
1.0000000000000001e+03   0.0000000000000000e+00   0.0000000000000000e+00   8.6285577583601230e+02   1.0000000000000001e+03   0.0000000000000000e+00   0.0000000000000000e+00   -8.6285577583601230e+02   9.9999999999999955e+02   4.9533832625170356e+02   -5.6828901113869654e+02   -6.5702933142757252e+02   9.9999999999999955e+02   -4.9533832625170356e+02   5.6828901113869654e+02   6.5702933142757274e+02   1.8218117520276744e-02
1.0000000000000001e+03   0.0000000000000000e+00   0.0000000000000000e+00   8.6285577583601230e+02   1.0000000000000001e+03   0.0000000000000000e+00   0.0000000000000000e+00   -8.6285577583601230e+02   1.0000000000000016e+03   3.8061844350719520e+02   1.2641091694793496e+02   9.1605124339719316e+02   9.9999999999999909e+02   -3.8061844350719554e+02   -1.2641091694793401e+02   -9.1605124339719305e+02   2.1722962066383376e-02
1.0000000000000001e+03   0.0000000000000000e+00   0.0000000000000000e+00   8.6285577583601230e+02   1.0000000000000001e+03   0.0000000000000000e+00   0.0000000000000000e+00   -8.6285577583601230e+02   1.0000000000000006e+03   -9.5958169848126636e+02   -1.2104002268770665e+02   2.5407140106389028e+02   1.0000000000000018e+03   9.5958169848126533e+02   1.2104002268770874e+02   -2.5407140106389383e+02   1.5060151955161888e-02
1.0000000000000001e+03   0.0000000000000000e+00   0.0000000000000000e+00   8.6285577583601230e+02   1.0000000000000001e+03   0.0000000000000000e+00   0.0000000000000000e+00   -8.6285577583601230e+02   9.9999999999999852e+02   4.7305638079710874e+01   -2.8050254683792666e+01   9.9848653461578749e+02   9.9999999999999852e+02   -4.7305638079709105e+01   2.8050254683793256e+01   -9.9848653461578715e+02   2.3080520099278277e-02
1.0000000000000001e+03   0.0000000000000000e+00   0.0000000000000000e+00   8.6285577583601230e+02   1.0000000000000001e+03   0.0000000000000000e+00   0.0000000000000000e+00   -8.6285577583601230e+02   9.9999999999999966e+02   2.2668408118651925e+02   9.6326766493266189e+02   -1.4397823801811273e+02   1.0000000000000000e+03   -2.2668408118651917e+02   -9.6326766493266189e+02   1.4397823801811268e+02   1.4683206187909470e-02
1.0000000000000001e+03   0.0000000000000000e+00   0.0000000000000000e+00   8.6285577583601230e+02   1.0000000000000001e+03   0.0000000000000000e+00   0.0000000000000000e+00   -8.6285577583601230e+02   1.0000000000000000e+03   2.7605954626002239e+02   -6.1690300517083438e+02   7.3703582621260966e+02   1.0000000000000001e+03   -2.7605954626002239e+02   6.1690300517083449e+02   -7.3703582621260966e+02   1.9177495185282122e-02
1.0000000000000001e+03   0.0000000000000000e+00   0.0000000000000000e+00   8.6285577583601230e+02   1.0000000000000001e+03   0.0000000000000000e+00   0.0000000000000000e+00   -8.6285577583601230e+02   1.0000000000000000e+03   -5.9430216626390552e+02   -4.2638966227767884e+02   -6.8190673194195392e+02   1.0000000000000002e+03   5.9430216626390552e+02   4.2638966227767884e+02   6.8190673194195438e+02   1.8504631702679689e-02
1.0000000000000001e+03   0.0000000000000000e+00   0.0000000000000000e+00   8.6285577583601230e+02   1.0000000000000001e+03   0.0000000000000000e+00   0.0000000000000000e+00   -8.6285577583601230e+02   9.9999999999999989e+02   5.7160542687313534e+02   -4.7078392892877230e+02   -6.7203402311383718e+02   1.0000000000000003e+03   -5.7160542687313580e+02   4.7078392892877201e+02   6.7203402311383718e+02   1.8389653033680651e-02
1.0000000000000001e+03   0.0000000000000000e+00   0.0000000000000000e+00   8.6285577583601230e+02   1.0000000000000001e+03   0.0000000000000000e+00   0.0000000000000000e+00   -8.6285577583601230e+02   1.0000000000000015e+03   4.2371144775735223e+02   2.2775103416031275e+01   9.0551085233406081e+02   1.0000000000000015e+03   -4.2371144775735360e+02   -2.2775103416032920e+01   -9.0551085233406081e+02   2.1557810768237810e-02
1.0000000000000001e+03   0.0000000000000000e+00   0.0000000000000000e+00   8.6285577583601230e+02   1.0000000000000001e+03   0.0000000000000000e+00   0.0000000000000000e+00   -8.6285577583601230e+02   9.9999999999999977e+02   -2.1285096901458186e+02   -1.1071578063379970e+02   -9.7079167739489890e+02   9.9999999999999977e+02   2.1285096901458238e+02   1.1071578063379965e+02   9.7079167739489878e+02   2.2611396270178268e-02
1.0000000000000001e+03   0.0000000000000000e+00   0.0000000000000000e+00   8.6285577583601230e+02   1.0000000000000001e+03   0.0000000000000000e+00   0.0000000000000000e+00   -8.6285577583601230e+02   1.0000000000000001e+03   4.9800176802516563e+02   5.5882538738051846e+02   -6.6310513906455481e+02   9.9999999999999989e+02   -4.9800176802516563e+02   -5.5882538738051824e+02   6.6310513906455481e+02   1.8287110273093668e-02
1.0000000000000001e+03   0.0000000000000000e+00   0.0000000000000000e+00   8.6285577583601230e+02   1.0000000000000001e+03   0.0000000000000000e+00   0.0000000000000000e+00   -8.6285577583601230e+02   9.9999999999999852e+02   9.7741654549557632e+02   6.1758637969762226e+01   -2.0209593568057909e+02   9.9999999999999557e+02   -9.7741654549557882e+02   -6.1758637969760230e+01   2.0209593568057653e+02   1.4856211277221093e-02
1.0000000000000001e+03   0.0000000000000000e+00   0.0000000000000000e+00   8.6285577583601230e+02   1.0000000000000001e+03   0.0000000000000000e+00   0.0000000000000000e+00   -8.6285577583601230e+02   1.0000000000000005e+03   -8.6538409406092944e+02   -2.9744191594821490e+02   4.0328485760613353e+02   1.0000000000000001e+03   8.6538409406092944e+02   2.9744191594821507e+02   -4.0328485760613376e+02   1.5903855900909376e-02
1.0000000000000001e+03   0.0000000000000000e+00   0.0000000000000000e+00   8.6285577583601230e+02   1.0000000000000001e+03   0.0000000000000000e+00   0.0000000000000000e+00   -8.6285577583601230e+02   9.9999999999999955e+02   -4.9994315103119305e+02   4.1269445026063619e+02   -7.6140668269465050e+02   9.9999999999999932e+02   4.9994315103119266e+02   -4.1269445026063590e+02   7.6140668269465061e+02   1.9491612708274174e-02
1.0000000000000001e+03   0.0000000000000000e+00   0.0000000000000000e+00   8.6285577583601230e+02   1.0000000000000001e+03   0.0000000000000000e+00   0.0000000000000000e+00   -8.6285577583601230e+02   9.9999999999999932e+02   -7.8213647945976174e+02   7.6787197218672901e+01   6.1835770702125888e+02   9.9999999999999955e+02   7.8213647945976220e+02   -7.6787197218672830e+01   -6.1835770702125899e+02   1.7793873527902553e-02
1.0000000000000001e+03   0.0000000000000000e+00   0.0000000000000000e+00   8.6285577583601230e+02   1.0000000000000001e+03   0.0000000000000000e+00   0.0000000000000000e+00   -8.6285577583601230e+02   9.9999999999999977e+02   7.1801171693005210e+02   -6.9098228920389556e+02   8.3681840017432421e+01   1.0000000000000005e+03   -7.1801171693005210e+02   6.9098228920389590e+02   -8.3681840017432449e+01   1.4565130757772935e-02
1.0000000000000001e+03   0.0000000000000000e+00   0.0000000000000000e+00   8.6285577583601230e+02   1.0000000000000001e+03   0.0000000000000000e+00   0.0000000000000000e+00   -8.6285577583601230e+02   1.0000000000000001e+03   -2.8448085240731433e+02   -4.9234181740774233e+02   8.2259964711653652e+02   1.0000000000000001e+03   2.8448085240731439e+02   4.9234181740774187e+02   -8.2259964711653674e+02   2.0325370090686353e-02
1.0000000000000001e+03   0.0000000000000000e+00   0.0000000000000000e+00   8.6285577583601230e+02   1.0000000000000001e+03   0.0000000000000000e+00   0.0000000000000000e+00   -8.6285577583601230e+02   9.9999999999999955e+02   -8.5289855268170562e+00   -8.5740628745216577e+02   -5.1456944588109502e+02   9.9999999999999955e+02   8.5289855268171131e+00   8.5740628745216588e+02   5.1456944588109411e+02   1.6782453594559044e-02
1.0000000000000001e+03   0.0000000000000000e+00   0.0000000000000000e+00   8.6285577583601230e+02   1.0000000000000001e+03   0.0000000000000000e+00   0.0000000000000000e+00   -8.6285577583601230e+02   9.9999999999999886e+02   2.6604115140624225e+02   8.7836574095460435e+02   3.9710921780627365e+02   1.0000000000000002e+03   -2.6604115140624231e+02   -8.7836574095460412e+02   -3.9710921780627365e+02   1.5861338460691484e-02
1.0000000000000001e+03   0.0000000000000000e+00   0.0000000000000000e+00   8.6285577583601230e+02   1.0000000000000001e+03   0.0000000000000000e+00   0.0000000000000000e+00   -8.6285577583601230e+02   9.9999999999999920e+02   3.0338252604457728e+02   9.5285005099072168e+02   5.9852492671344226e+00   9.9999999999999966e+02   -3.0338252604457728e+02   -9.5285005099072180e+02   -5.9852492671346953e+00   1.4505204615360702e-02
1.0000000000000001e+03   0.0000000000000000e+00   0.0000000000000000e+00   8.6285577583601230e+02   1.0000000000000001e+03   0.0000000000000000e+00   0.0000000000000000e+00   -8.6285577583601230e+02   9.9999999999999943e+02   -2.3320378392646912e+01   3.4361135893466599e+02   -9.3882234419175120e+02   1.0000000000000001e+03   2.3320378392646795e+01   -3.4361135893466616e+02   9.3882234419175143e+02   2.2086273972041628e-02
1.0000000000000001e+03   0.0000000000000000e+00   0.0000000000000000e+00   8.6285577583601230e+02   1.0000000000000001e+03   0.0000000000000000e+00   0.0000000000000000e+00   -8.6285577583601230e+02   9.9999999999999636e+02   -2.9086703060825391e+02   -9.3507201122482127e+02   2.0257518189575646e+02   9.9999999999999284e+02   2.9086703060825084e+02   9.3507201122482672e+02   -2.0257518189575967e+02   1.4857879454445737e-02
1.0000000000000001e+03   0.0000000000000000e+00   0.0000000000000000e+00   8.6285577583601230e+02   1.0000000000000001e+03   0.0000000000000000e+00   0.0000000000000000e+00   -8.6285577583601230e+02   9.9999999999999955e+02   -9.3586147324482215e+02   -2.8266467861021664e+02   -2.1039007189792437e+02   9.9999999999999943e+02   9.3586147324482192e+02   2.8266467861021653e+02   2.1039007189792406e+02   1.4885639339847323e-02
1.0000000000000001e+03   0.0000000000000000e+00   0.0000000000000000e+00   8.6285577583601230e+02   1.0000000000000001e+03   0.0000000000000000e+00   0.0000000000000000e+00   -8.6285577583601230e+02   9.9999999999999898e+02   -8.8640366475067992e+02   -3.9004516713330224e+02   -2.4930565718297854e+02   9.9999999999999898e+02   8.8640366475073085e+02   3.9004516713329457e+02   2.4930565718297746e+02   1.5039516910919915e-02
1.0000000000000001e+03   0.0000000000000000e+00   0.0000000000000000e+00   8.6285577583601230e+02   1.0000000000000001e+03   0.0000000000000000e+00   0.0000000000000000e+00   -8.6285577583601230e+02   1.0000000000000010e+03   2.4955163771036229e+02   9.5998723459818950e+02   1.2707670721102275e+02   1.0000000000000003e+03   -2.4955163771036371e+02   -9.5998723459818927e+02   -1.2707670721102258e+02   1.4643799978264206e-02
1.0000000000000001e+03   0.0000000000000000e+00   0.0000000000000000e+00   8.6285577583601230e+02   1.0000000000000001e+03   0.0000000000000000e+00   0.0000000000000000e+00   -8.6285577583601230e+02   1.0000000000000000e+03   6.3652358710167186e+02   -6.4870041489134599e+02   -4.1716363069425876e+02   9.9999999999999977e+02   -6.3652358710167186e+02   6.4870041489134610e+02   4.1716363069425870e+02   1.6001801219105681e-02
1.0000000000000001e+03   0.0000000000000000e+00   0.0000000000000000e+00   8.6285577583601230e+02   1.0000000000000001e+03   0.0000000000000000e+00   0.0000000000000000e+00   -8.6285577583601230e+02   1.0000000000000003e+03   9.4294671678976545e+02   -3.3293604973651543e+02   -2.2530140360775595e+00   1.0000000000000001e+03   -9.4294671678976545e+02   3.3293604973651543e+02   2.2530140360775595e+00   1.4504940139546087e-02
1.0000000000000001e+03   0.0000000000000000e+00   0.0000000000000000e+00   8.6285577583601230e+02   1.0000000000000001e+03   0.0000000000000000e+00   0.0000000000000000e+00   -8.6285577583601230e+02   1.0000000000000000e+03   -5.3788884051452249e+02   -1.3159223426770154e+02   8.3268185948859070e+02   1.0000000000000000e+03   5.3788884051452237e+02   1.3159223426770163e+02   -8.3268185948859059e+02   2.0468922005948378e-02
1.0000000000000001e+03   0.0000000000000000e+00   0.0000000000000000e+00   8.6285577583601230e+02   1.0000000000000001e+03   0.0000000000000000e+00   0.0000000000000000e+00   -8.6285577583601230e+02   9.9999999999999955e+02   -7.5303298432180532e+02   -3.7596451649893407e+02   5.3999259888272343e+02   9.9999999999999966e+02   7.5303298432180532e+02   3.7596451649893407e+02   -5.3999259888272354e+02   1.7013066089608515e-02
1.0000000000000001e+03   0.0000000000000000e+00   0.0000000000000000e+00   8.6285577583601230e+02   1.0000000000000001e+03   0.0000000000000000e+00   0.0000000000000000e+00   -8.6285577583601230e+02   9.9999999999999977e+02   -4.2804776476347740e+02   6.1179508735368915e+02   6.6519311644204663e+02   9.9999999999999977e+02   4.2804776476347740e+02   -6.1179508735368904e+02   -6.6519311644204674e+02   1.8310966550610437e-02
1.0000000000000001e+03   0.0000000000000000e+00   0.0000000000000000e+00   8.6285577583601230e+02   1.0000000000000001e+03   0.0000000000000000e+00   0.0000000000000000e+00   -8.6285577583601230e+02   9.9999999999999966e+02   -7.6519380512667567e+02   4.1807777613526252e+02   4.8958085510827732e+02   9.9999999999999966e+02   7.6519380512667578e+02   -4.1807777613526252e+02   -4.8958085510827738e+02   1.6566618642760832e-02
1.0000000000000001e+03   0.0000000000000000e+00   0.0000000000000000e+00   8.6285577583601230e+02   1.0000000000000001e+03   0.0000000000000000e+00   0.0000000000000000e+00   -8.6285577583601230e+02   1.0000000000000001e+03   -9.6568719042538942e+02   -1.1294017674453387e+02   2.3386484711523264e+02   1.0000000000000003e+03   9.6568719042538942e+02   1.1294017674453369e+02   -2.3386484711523275e+02   1.4975343993683830e-02
1.0000000000000001e+03   0.0000000000000000e+00   0.0000000000000000e+00   8.6285577583601230e+02   1.0000000000000001e+03   0.0000000000000000e+00   0.0000000000000000e+00   -8.6285577583601230e+02   9.9999999999999818e+02   -6.2838450000913349e+02   -2.1211448604532288e+02   7.4842525675514253e+02   1.0000000000000009e+03   6.2838450000913360e+02   2.1211448604532342e+02   -7.4842525675514310e+02   1.9323022520122263e-02
1.0000000000000001e+03   0.0000000000000000e+00   0.0000000000000000e+00   8.6285577583601230e+02   1.0000000000000001e+03   0.0000000000000000e+00   0.0000000000000000e+00   -8.6285577583601230e+02   9.9999999999999989e+02   -6.3428447052502258e+02   -3.3739152537237158e+02   6.9559339347689024e+02   9.9999999999999977e+02   6.3428447052502258e+02   3.3739152537237152e+02   -6.9559339347689024e+02   1.8666801682090322e-02
1.0000000000000001e+03   0.0000000000000000e+00   0.0000000000000000e+00   8.6285577583601230e+02   1.0000000000000001e+03   0.0000000000000000e+00   0.0000000000000000e+00   -8.6285577583601230e+02   9.9999999999999977e+02   6.5679925888756102e+01   -9.9261381125335868e+02   1.0199984821228010e+02   9.9999999999999955e+02   -6.5679925888756188e+01   9.9261381125335890e+02   -1.0199984821228028e+02   1.4594387678306555e-02
1.0000000000000001e+03   0.0000000000000000e+00   0.0000000000000000e+00   8.6285577583601230e+02   1.0000000000000001e+03   0.0000000000000000e+00   0.0000000000000000e+00   -8.6285577583601230e+02   1.0000000000000003e+03   2.1598339283530883e+01   2.2275218566909760e+02   9.7463581686229509e+02   9.9999999999999966e+02   -2.1598339283530962e+01   -2.2275218566909822e+02   -9.7463581686229509e+02   2.2675723592232581e-02
1.0000000000000001e+03   0.0000000000000000e+00   0.0000000000000000e+00   8.6285577583601230e+02   1.0000000000000001e+03   0.0000000000000000e+00   0.0000000000000000e+00   -8.6285577583601230e+02   1.0000000000000003e+03   -4.3663560589388482e+02   4.6518115492262308e+02   7.7003625938103403e+02   9.9999999999999989e+02   4.3663560589388459e+02   -4.6518115492262308e+02   -7.7003625938103391e+02   1.9605289445563875e-02
1.0000000000000001e+03   0.0000000000000000e+00   0.0000000000000000e+00   8.6285577583601230e+02   1.0000000000000001e+03   0.0000000000000000e+00   0.0000000000000000e+00   -8.6285577583601230e+02   9.9999999999999989e+02   3.0875181323077646e+02   -8.9630550240231128e+02   -3.1829037714176690e+02   1.0000000000000003e+03   -3.0875181323077663e+02   8.9630550240231116e+02   3.1829037714176684e+02   1.5376318044950283e-02
1.0000000000000001e+03   0.0000000000000000e+00   0.0000000000000000e+00   8.6285577583601230e+02   1.0000000000000001e+03   0.0000000000000000e+00   0.0000000000000000e+00   -8.6285577583601230e+02   9.9999999999999989e+02   2.4441548254582479e+01   6.6357894172027429e+01   -9.9749648650557799e+02   9.9999999999999989e+02   -2.4441548254582525e+01   -6.6357894172027400e+01   9.9749648650557799e+02   2.3063522232199148e-02
1.0000000000000001e+03   0.0000000000000000e+00   0.0000000000000000e+00   8.6285577583601230e+02   1.0000000000000001e+03   0.0000000000000000e+00   0.0000000000000000e+00   -8.6285577583601230e+02   9.9999999999999966e+02   3.5623761190910540e+02   -9.2336189313890202e+02   1.4316975292023227e+02   9.9999999999999955e+02   -3.5623761190910534e+02   9.2336189313890191e+02   -1.4316975292023238e+02   1.4681209275166356e-02
1.0000000000000001e+03   0.0000000000000000e+00   0.0000000000000000e+00   8.6285577583601230e+02   1.0000000000000001e+03   0.0000000000000000e+00   0.0000000000000000e+00   -8.6285577583601230e+02   9.9999999999999989e+02   -1.2401998252421018e+02   -2.1283402685031055e+02   -9.6918559674624544e+02   9.9999999999999989e+02   1.2401998252421039e+02   2.1283402685031064e+02   9.6918559674624544e+02   2.2584595623159950e-02
1.0000000000000001e+03   0.0000000000000000e+00   0.0000000000000000e+00   8.6285577583601230e+02   1.0000000000000001e+03   0.0000000000000000e+00   0.0000000000000000e+00   -8.6285577583601230e+02   1.0000000000000001e+03   -9.5052287971019121e+02   3.0841459525460692e+02   -3.7238321288452539e+01   1.0000000000000002e+03   9.5052287971019121e+02   -3.0841459525460698e+02   3.7238321288452497e+01   1.4516824307975039e-02
1.0000000000000001e+03   0.0000000000000000e+00   0.0000000000000000e+00   8.6285577583601230e+02   1.0000000000000001e+03   0.0000000000000000e+00   0.0000000000000000e+00   -8.6285577583601230e+02   9.9999999999999932e+02   8.4084034427398990e+01   9.9332848227609145e+02   -7.8920222025077848e+01   1.0000000000000006e+03   -8.4084034427399089e+01   -9.9332848227609145e+02   7.8920222025077848e+01   1.4558470947049229e-02
1.0000000000000001e+03   0.0000000000000000e+00   0.0000000000000000e+00   8.6285577583601230e+02   1.0000000000000001e+03   0.0000000000000000e+00   0.0000000000000000e+00   -8.6285577583601230e+02   9.9999999999999932e+02   -9.0955242557399106e+02   -2.7923501761939804e+02   -3.0780219306977466e+02   1.0000000000000011e+03   9.0955242557399163e+02   2.7923501761939826e+02   3.0780219306977466e+02   1.5319834735098943e-02
1.0000000000000001e+03   0.0000000000000000e+00   0.0000000000000000e+00   8.6285577583601230e+02   1.0000000000000001e+03   0.0000000000000000e+00   0.0000000000000000e+00   -8.6285577583601230e+02   1.0000000000000015e+03   8.0606836529258294e+02   -2.5158534120989978e+02   -5.3568517484978202e+02   1.0000000000000005e+03   -8.0606836529258294e+02   2.5158534120989972e+02   5.3568517484978224e+02   1.6973211246031780e-02
1.0000000000000001e+03   0.0000000000000000e+00   0.0000000000000000e+00   8.6285577583601230e+02   1.0000000000000001e+03   0.0000000000000000e+00   0.0000000000000000e+00   -8.6285577583601230e+02   1.0000000000000000e+03   -6.1925530905636344e+02   -2.5944523358771363e+02   -7.4108773634781255e+02   1.0000000000000001e+03   6.1925530905636333e+02   2.5944523358771346e+02   7.4108773634781255e+02   1.9229012335603122e-02
1.0000000000000001e+03   0.0000000000000000e+00   0.0000000000000000e+00   8.6285577583601230e+02   1.0000000000000001e+03   0.0000000000000000e+00   0.0000000000000000e+00   -8.6285577583601230e+02   1.0000000000000001e+03   1.9248110430729767e+02   8.0718352106743714e+02   5.5803744300254380e+02   1.0000000000000001e+03   -1.9248110430729773e+02   -8.0718352106743714e+02   -5.5803744300254380e+02   1.7183497110038765e-02
1.0000000000000001e+03   0.0000000000000000e+00   0.0000000000000000e+00   8.6285577583601230e+02   1.0000000000000001e+03   0.0000000000000000e+00   0.0000000000000000e+00   -8.6285577583601230e+02   1.0000000000000001e+03   -4.3173197158914809e+02   3.2788767451079428e+02   8.4029588693664903e+02   1.0000000000000001e+03   4.3173197158914849e+02   -3.2788767451079372e+02   -8.4029588693664925e+02   2.0578490549608152e-02
1.0000000000000001e+03   0.0000000000000000e+00   0.0000000000000000e+00   8.6285577583601230e+02   1.0000000000000001e+03   0.0000000000000000e+00   0.0000000000000000e+00   -8.6285577583601230e+02   9.9999999999997590e+02   -1.1725260834008800e+02   1.8004082145075984e+02   9.7664585620367097e+02   1.0000000000000065e+03   1.1725260834008839e+02   -1.8004082145075745e+02   -9.7664585620366734e+02   2.2709460541673443e-02
1.0000000000000001e+03   0.0000000000000000e+00   0.0000000000000000e+00   8.6285577583601230e+02   1.0000000000000001e+03   0.0000000000000000e+00   0.0000000000000000e+00   -8.6285577583601230e+02   9.9999999999999989e+02   7.4702371110462389e+02   4.8606959206306965e+02   4.5353271845602984e+02   9.9999999999999966e+02   -7.4702371110462389e+02   -4.8606959206306965e+02   -4.5353271845602984e+02   1.6274184482215182e-02
1.0000000000000001e+03   0.0000000000000000e+00   0.0000000000000000e+00   8.6285577583601230e+02   1.0000000000000001e+03   0.0000000000000000e+00   0.0000000000000000e+00   -8.6285577583601230e+02   9.9999999999999784e+02   -4.2771499504988248e+02   -5.1493230383499122e+02   7.4290282370419322e+02   9.9999999999999693e+02   4.2771499504988259e+02   5.1493230383499269e+02   -7.4290282370419584e+02   1.9252181477903179e-02
1.0000000000000001e+03   0.0000000000000000e+00   0.0000000000000000e+00   8.6285577583601230e+02   1.0000000000000001e+03   0.0000000000000000e+00   0.0000000000000000e+00   -8.6285577583601230e+02   1.0000000000000033e+03   -2.9927967629365969e+02   7.2715638899641328e+02   -6.1779872231193940e+02   1.0000000000000041e+03   2.9927967629365713e+02   -7.2715638899641067e+02   6.1779872231193849e+02   1.7787929858472423e-02
1.0000000000000001e+03   0.0000000000000000e+00   0.0000000000000000e+00   8.6285577583601230e+02   1.0000000000000001e+03   0.0000000000000000e+00   0.0000000000000000e+00   -8.6285577583601230e+02   1.0000000000000001e+03   6.6536107293547661e+02   2.1001905142237393e+02   7.1637046327497183e+02   9.9999999999999989e+02   -6.6536107293547661e+02   -2.1001905142237393e+02   -7.1637046327497171e+02   1.8919143464068453e-02
1.0000000000000001e+03   0.0000000000000000e+00   0.0000000000000000e+00   8.6285577583601230e+02   1.0000000000000001e+03   0.0000000000000000e+00   0.0000000000000000e+00   -8.6285577583601230e+02   1.0000000000000002e+03   -3.8500431780143577e+02   9.1887897502709814e+02   8.6215454057847140e+01   1.0000000000000001e+03   3.8500431780143566e+02   -9.1887897502709825e+02   -8.6215454057846912e+01   1.4568833369788012e-02
1.0000000000000001e+03   0.0000000000000000e+00   0.0000000000000000e+00   8.6285577583601230e+02   1.0000000000000001e+03   0.0000000000000000e+00   0.0000000000000000e+00   -8.6285577583601230e+02   1.0000000000000022e+03   -7.9580913483519134e+02   6.0551205198602577e+02   -6.5555933019736052e+00   9.9999999999999864e+02   7.9580913483518964e+02   -6.0551205198602474e+02   6.5555933019742127e+00   1.4505266139409360e-02
1.0000000000000001e+03   0.0000000000000000e+00   0.0000000000000000e+00   8.6285577583601230e+02   1.0000000000000001e+03   0.0000000000000000e+00   0.0000000000000000e+00   -8.6285577583601230e+02   9.9999999999999989e+02   -3.3987816808410139e+02   4.0505325029593610e+02   -8.4877246378254597e+02   1.0000000000000000e+03   3.3987816808410139e+02   -4.0505325029593604e+02   8.4877246378254597e+02   2.0701644689336496e-02
1.0000000000000001e+03   0.0000000000000000e+00   0.0000000000000000e+00   8.6285577583601230e+02   1.0000000000000001e+03   0.0000000000000000e+00   0.0000000000000000e+00   -8.6285577583601230e+02   1.0000000000000009e+03   -3.2862767340631132e+02   -6.0870908938114144e+02   -7.2213371114173526e+02   9.9999999999999932e+02   3.2862767340631120e+02   6.0870908938114144e+02   7.2213371114173503e+02   1.8990454987062283e-02
