1.0000000000000001e+03   0.0000000000000000e+00   0.0000000000000000e+00   9.9583373190821374e+02   1.0000000000000001e+03   0.0000000000000000e+00   0.0000000000000000e+00   -9.9583373190821374e+02   2.1041059504285241e+02   -4.2243023753065977e+01   7.6609159708043009e+01   -1.4489369240692545e+02   6.3989317048552289e+02   -1.9849704079075889e+02   -5.7711296048870588e+02   1.4621157706313048e+02   3.1690939402109660e+02   -2.0237973728289259e+02   -1.8676116080631897e+02   9.4706255180966366e+01   8.3278684045052796e+02   4.4311980182671743e+02   6.8726496158698194e+02   -9.6024139837171461e+01   5.4739224010999375e+34
1.0000000000000001e+03   0.0000000000000000e+00   0.0000000000000000e+00   9.9583373190821374e+02   1.0000000000000001e+03   0.0000000000000000e+00   0.0000000000000000e+00   -9.9583373190821374e+02   2.5865383103177129e+02   -1.1674521015856983e+02   1.3698636255056670e+02   1.3741214170373794e+02   6.8640720927685970e+02   -6.1132688366783732e+01   1.6142619937765053e+02   6.5248312891199225e+02   6.8334039724005925e+02   3.5387329955199658e+02   -9.9094510328815758e+01   -5.6239049101765340e+02   3.7159856245130982e+02   -1.7599540102664301e+02   -1.9931805159940154e+02   -2.2750477959807679e+02   8.2952277114408817e+34
1.0000000000000001e+03   0.0000000000000000e+00   0.0000000000000000e+00   9.9583373190821374e+02   1.0000000000000001e+03   0.0000000000000000e+00   0.0000000000000000e+00   -9.9583373190821374e+02   5.1285455156023625e+02   2.5469662231321155e+02   -3.2612574572730603e+02   -2.7598264367909223e+02   2.4312639038402153e+02   -1.1028156088797812e+02   -4.1578429043842341e+01   -1.7203096601345061e+02   7.8026131559377961e+02   -3.0393552525246599e+02   6.8509510410668986e+02   1.7734321365839560e+02   4.6375774246196272e+02   1.5952046382723262e+02   -3.1739092933554144e+02   2.7067039603414713e+02   7.5308133006297480e+34
1.0000000000000001e+03   0.0000000000000000e+00   0.0000000000000000e+00   9.9583373190821374e+02   1.0000000000000001e+03   0.0000000000000000e+00   0.0000000000000000e+00   -9.9583373190821374e+02   3.3253696836623197e+02   -1.3359130153467837e+02   -2.6942538084810275e+02   -6.7224724910778320e+01   4.5170936963437060e+02   -2.6265958494986944e+02   3.1870080791232175e+02   -1.3362668927080466e+02   5.0033413128090865e+02   2.7959995177279935e+00   4.8274768363675668e+02   -4.0695199405634135e+01   7.1541953071849252e+02   3.9345488696681980e+02   -5.3202311070097574e+02   2.4154661358721719e+02   1.5015104480674022e+35
1.0000000000000001e+03   0.0000000000000000e+00   0.0000000000000000e+00   9.9583373190821374e+02   1.0000000000000001e+03   0.0000000000000000e+00   0.0000000000000000e+00   -9.9583373190821374e+02   7.9504063048621776e+02   -1.6581612736916522e+01   2.6375571603189167e+02   -7.3933928375507628e+02   1.9644533414218475e+02   5.2056672095511743e+01   1.3276928899079596e+02   -5.1265857034223984e+01   7.5563266065813593e+02   -6.8878757488327835e+01   -1.9220349038397660e+02   7.1670722956056068e+02   2.5288137471346141e+02   3.3403698129732589e+01   -2.0432151463871108e+02   7.3897911228739972e+01   4.3423346912536090e+34
1.0000000000000001e+03   0.0000000000000000e+00   0.0000000000000000e+00   9.9583373190821374e+02   1.0000000000000001e+03   0.0000000000000000e+00   0.0000000000000000e+00   -9.9583373190821374e+02   7.3422227304390628e+02   4.7518056507857473e+01   -4.7295596338039991e+02   -5.4544664014218142e+02   2.9365072570845354e+02   1.3242028978389698e+02   7.5379751739118817e+01   2.1768901807486512e+02   5.1689812503272515e+02   5.9810858973397870e+01   4.9736824766547409e+02   -2.4620297020680049e+01   4.5522887621493504e+02   -2.3974920526515260e+02   -9.9792036024193123e+01   3.5237791908799613e+02   9.2703095038772839e+34
1.0000000000000001e+03   0.0000000000000000e+00   0.0000000000000000e+00   9.9583373190821374e+02   1.0000000000000001e+03   0.0000000000000000e+00   0.0000000000000000e+00   -9.9583373190821374e+02   7.8794812368299733e+02   -6.0459422100328163e+02   -2.9423540949812570e+02   -3.9131649255105646e+02   1.7863228231034097e+02   -1.0203554445701552e+02   5.4279986679474042e+01   5.4101044322987669e+01   6.5015584242820898e+02   4.1444396625251812e+02   4.2628541020810508e+02   2.3150500496560167e+02   3.8326375157845257e+02   2.9218579920777864e+02   -1.8632998738945378e+02   1.0571044326246744e+02   5.7261910167104543e+34
1.0000000000000001e+03   0.0000000000000000e+00   0.0000000000000000e+00   9.9583373190821374e+02   1.0000000000000001e+03   0.0000000000000000e+00   0.0000000000000000e+00   -9.9583373190821374e+02   8.8467433909635588e+02   -8.3568622935549365e+02   -7.4628324392668773e+01   -2.5116294615152381e+02   3.2400142174351470e+02   2.5196506493364549e+02   7.8184104344062291e+01   1.4054455938498467e+02   4.9184253161795118e+02   4.0371673023997579e+02   -2.0447713161352726e+02   1.4658096834105768e+02   2.9948170754217830e+02   1.8000443418187240e+02   2.0092135166213393e+02   -3.5962581574518474e+01   5.4712849116651880e+34
1.0000000000000001e+03   0.0000000000000000e+00   0.0000000000000000e+00   9.9583373190821374e+02   1.0000000000000001e+03   0.0000000000000000e+00   0.0000000000000000e+00   -9.9583373190821374e+02   6.1206712488202527e+02   -6.3998358310713044e+01   -3.1337303066102237e+02   5.0665838505763253e+02   4.3997927678099234e+02   -3.7475309113827768e+02   6.2113192287342311e+00   1.9359314087144094e+02   3.7242465708524071e+02   1.4539256988324465e+02   2.2287477124456180e+02   -2.2861094061853041e+02   5.7552894125174191e+02   2.9335887956574612e+02   8.4286940187726358e+01   -4.7164058531054314e+02   1.4907360015798707e+35
1.0000000000000001e+03   0.0000000000000000e+00   0.0000000000000000e+00   9.9583373190821374e+02   1.0000000000000001e+03   0.0000000000000000e+00   0.0000000000000000e+00   -9.9583373190821374e+02   8.4132153025941477e+02   3.0871267930792879e+02   7.1271758679327627e+02   2.9820637214541824e+02   4.3245464117216426e+02   3.2576969940805856e+00   -3.8731067408923928e+02   1.4619112769993632e+02   4.0958748098541838e+02   -1.0352890852890141e+02   -2.8481807241766609e+02   -2.4555515735386206e+02   3.1663634758300259e+02   -2.0844146777310795e+02   -4.0588840286370917e+01   -1.9884234249149236e+02   7.1925186991060199e+34
1.0000000000000001e+03   0.0000000000000000e+00   0.0000000000000000e+00   9.9583373190821374e+02   1.0000000000000001e+03   0.0000000000000000e+00   0.0000000000000000e+00   -9.9583373190821374e+02   2.5285478355838521e+02   8.7281552163848602e+01   1.0637761782938178e+02   -1.7139508349183532e+02   5.4887049075493815e+02   2.2431403839906758e+02   -2.0136288404704820e+02   -4.4132756171229914e+02   4.4025915141648221e+02   1.0572683693122832e+02   -3.6080901454851858e+02   1.9194220843526162e+02   7.5801557427019452e+02   -4.1732242749414434e+02   4.5579428076618501e+02   4.2078043676887296e+02   8.1121242113111195e+34
1.0000000000000001e+03   0.0000000000000000e+00   0.0000000000000000e+00   9.9583373190821374e+02   1.0000000000000001e+03   0.0000000000000000e+00   0.0000000000000000e+00   -9.9583373190821374e+02   7.1918330634269319e+02   6.7842600481681370e+02   2.0032215117797037e+02   -3.4768086771278824e+01   2.3193037390893116e+02   -1.0284077530490877e+02   -1.4438368197969444e+02   -8.2120799157146237e+01   6.3015243646635895e+02   -5.3132351756267610e+02   -1.7434377159939635e+02   -2.6223398363639097e+02   4.1873388328201696e+02   -4.4261711949228783e+01   1.1840530240112048e+02   3.7912286956481603e+02   7.4306863094706075e+34
1.0000000000000001e+03   0.0000000000000000e+00   0.0000000000000000e+00   9.9583373190821374e+02   1.0000000000000001e+03   0.0000000000000000e+00   0.0000000000000000e+00   -9.9583373190821374e+02   6.5052922840634449e+02   3.6553456804091167e+02   -4.3900321635977389e+02   2.8499812736906165e+02   2.7326463654060029e+02   -8.6462156407256757e+01   1.9211095881412723e+02   1.2110423855749289e+02   5.8827836700526643e+02   1.8499313576072421e+02   2.3737092892807198e+02   -4.8977445718169236e+02   4.8792776804778879e+02   -4.6406554739437939e+02   9.5213286175745928e+00   8.3672091255137929e+01   1.0064321760669831e+35
1.0000000000000001e+03   0.0000000000000000e+00   0.0000000000000000e+00   9.9583373190821374e+02   1.0000000000000001e+03   0.0000000000000000e+00   0.0000000000000000e+00   -9.9583373190821374e+02   1.8427391190538597e+02   1.7168614257666079e+01   9.7811248848841732e+00   -1.3394567140961189e+02   8.0637858774428651e+02   6.0955069352908470e+02   3.0216684066437626e+01   -5.1201204165010688e+02   4.1363538238322576e+02   -2.3160331930765508e+02   1.6743263856407521e+02   2.7165316782335753e+02   5.9571211796710168e+02   -3.9511598847909573e+02   -2.0743044751539693e+02   3.7430454523636132e+02   5.6665806624988545e+34
1.0000000000000001e+03   0.0000000000000000e+00   0.0000000000000000e+00   9.9583373190821374e+02   1.0000000000000001e+03   0.0000000000000000e+00   0.0000000000000000e+00   -9.9583373190821374e+02   5.5975428037666018e+02   -3.1865114974819738e+02   -3.4601577258649388e+02   2.7646769121457271e+02   4.4839098048162435e+02   -2.4360288548086407e+02   1.1633709265294618e+02   3.3548887676900591e+02   4.8987406168613848e+02   1.2650592748070332e+02   2.2633707118512839e+02   -3.9638286647187419e+02   5.0198067745557717e+02   4.3574810774835873e+02   3.3416087484192745e+00   -2.1557370151170429e+02   1.7106646606371830e+35
1.0000000000000001e+03   0.0000000000000000e+00   0.0000000000000000e+00   9.9583373190821374e+02   1.0000000000000001e+03   0.0000000000000000e+00   0.0000000000000000e+00   -9.9583373190821374e+02   8.4829652388258739e+02   -6.4679368068041254e+02   5.1442968746780878e+02   -1.4492074977358601e+02   3.3316305531278715e+02   2.8093442873603283e+02   -9.8389745000122502e+01   -8.2267407002536757e+01   6.4162282649803069e+02   2.9212198094398082e+02   -5.1592536046205805e+02   2.1104649289855934e+02   1.7691759430659485e+02   7.3737271000398849e+01   9.9885417994371920e+01   1.6141663877563484e+01   4.1464354930366605e+34
1.0000000000000001e+03   0.0000000000000000e+00   0.0000000000000000e+00   9.9583373190821374e+02   1.0000000000000001e+03   0.0000000000000000e+00   0.0000000000000000e+00   -9.9583373190821374e+02   7.7915181154976904e+02   5.6422320219435449e+02   -3.6445298151370156e+02   3.7453804588133363e+02   6.0525439768415481e+02   -3.0796932110426877e+02   2.7005068558256005e+02   -4.2770949298674009e+02   2.6775765821761541e+02   3.2107728997988744e+01   1.2379073877817449e+02   1.9928399400234531e+02   3.4783613254846068e+02   -2.8836161008807454e+02   -2.9388442847033069e+01   -1.4611254689693931e+02   7.9402170822486661e+34
1.0000000000000001e+03   0.0000000000000000e+00   0.0000000000000000e+00   9.9583373190821374e+02   1.0000000000000001e+03   0.0000000000000000e+00   0.0000000000000000e+00   -9.9583373190821374e+02   8.3255703815231846e+02   1.3908578599758454e+02   3.5683007473399624e+02   -7.2859705165182038e+02   6.0378141374263294e+02   -2.7443235678448195e+02   -5.6038999084072309e+01   5.2007067568977834e+02   4.0102664350474998e+02   1.2035039337117914e+02   -3.4290705134618861e+02   1.1457707341850961e+02   1.6263490460029865e+02   1.4996177415718261e+01   4.2115975696264584e+01   9.3949302543532426e+01   3.8406607238434357e+34
1.0000000000000001e+03   0.0000000000000000e+00   0.0000000000000000e+00   9.9583373190821374e+02   1.0000000000000001e+03   0.0000000000000000e+00   0.0000000000000000e+00   -9.9583373190821374e+02   6.3009371593728349e+02   3.6297049848553513e+02   -3.3846736665468825e+02   3.6753958943582819e+02   3.1484938016182105e+02   -1.3090590589893228e+02   -1.2701262937336415e+02   -2.2413515558414127e+02   3.6638070761675681e+02   3.0844718664875558e+02   1.2740618971092685e+02   8.5075371204400582e+01   6.8867619628413888e+02   -5.4051177923535840e+02   3.3807380631712550e+02   -2.2847980505608746e+02   1.1538352185745524e+35
1.0000000000000001e+03   0.0000000000000000e+00   0.0000000000000000e+00   9.9583373190821374e+02   1.0000000000000001e+03   0.0000000000000000e+00   0.0000000000000000e+00   -9.9583373190821374e+02   6.3289751256045724e+02   -6.0873944786914421e+02   5.3349412789333023e+01   -1.0735169383021785e+02   5.0409488724251435e+02   2.4302934356902480e+02   2.0966724817607442e+02   3.6805303768713077e+02   4.6086125306962208e+02   -7.2731648705812502e+00   -3.4443971931299836e+02   -2.7942168028492426e+02   4.0214634712740650e+02   3.7298326917070068e+02   8.1423058347590910e+01   1.8720336428011329e+01   1.5593237953184132e+35
1.0000000000000001e+03   0.0000000000000000e+00   0.0000000000000000e+00   9.9583373190821374e+02   1.0000000000000001e+03   0.0000000000000000e+00   0.0000000000000000e+00   -9.9583373190821374e+02   4.7509027065150229e+02   3.3680133123375271e+02   1.1494943112963497e+02   -2.8885507928693767e+02   2.6841497315986913e+02   -1.6193959365405323e+02   1.7374231236549323e+02   3.2824864759481667e+00   7.2226747561630930e+02   2.6634403945686364e+02   -5.5224887801554428e+02   3.6073166718425108e+02   5.3422728057231939e+02   -4.4120577703656318e+02   2.6355713452041607e+02   -7.5159074373261575e+01   1.0252111906197296e+35
1.0000000000000001e+03   0.0000000000000000e+00   0.0000000000000000e+00   9.9583373190821374e+02   1.0000000000000001e+03   0.0000000000000000e+00   0.0000000000000000e+00   -9.9583373190821374e+02   7.4040330256097832e+02   2.2504659276517847e+02   -2.7796083314130666e+01   6.9365226106485079e+02   2.3940988042474302e+02   -1.4110277727791654e+02   -6.7686633236712304e+00   -1.4743229729696012e+02   6.5455943737870757e+02   1.5643494939892500e+02   -2.0742808360937011e+02   -5.8764338998939672e+02   3.6562737963557100e+02   -2.4037876488618693e+02   2.4199283024717204e+02   4.1423426221505800e+01   6.2484653259715314e+34
1.0000000000000001e+03   0.0000000000000000e+00   0.0000000000000000e+00   9.9583373190821374e+02   1.0000000000000001e+03   0.0000000000000000e+00   0.0000000000000000e+00   -9.9583373190821374e+02   2.8081077285364915e+02   1.6054086944438419e+02   -1.7317061959080058e+02   -8.6419071386142193e+01   7.1470470312186762e+02   -8.7511946910435881e+01   -1.1293285498428344e+02   -6.8903239552111097e+02   5.5445120324403047e+02   -2.9138389488335429e+02   1.3450719972899506e+02   4.3450474773289159e+02   4.5003332078045258e+02   2.1835497234940556e+02   1.5159627484608993e+02   3.4094671917436119e+02   9.9126925365052597e+34
1.0000000000000001e+03   0.0000000000000000e+00   0.0000000000000000e+00   9.9583373190821374e+02   1.0000000000000001e+03   0.0000000000000000e+00   0.0000000000000000e+00   -9.9583373190821374e+02   3.8908509817258226e+02   1.6361580386901690e+02   1.3627841251064186e+02   3.0069964520737756e+02   2.6282284933679711e+02   1.4162763006835996e+02   1.1665036577022160e+02   -1.4065971953763460e+02   5.2684766079896326e+02   4.0857435314953335e+01   4.8119824414039380e+02   -1.6947677570990618e+02   8.2124439169165737e+02   -3.4610086925233020e+02   -7.3412702242125727e+02   9.4368500401632271e+00   6.2486432319869287e+34
1.0000000000000001e+03   0.0000000000000000e+00   0.0000000000000000e+00   9.9583373190821374e+02   1.0000000000000001e+03   0.0000000000000000e+00   0.0000000000000000e+00   -9.9583373190821374e+02   7.6611500888360979e+02   2.9893248105001810e+01   -3.6547580128124179e+02   6.6093951253673765e+02   2.7199849959518718e+02   -1.3328271154936448e+02   1.4889382836332396e+02   -1.3573699001891475e+02   5.8807925669298629e+02   -1.5971200243446756e+02   -1.6181871319046760e+01   -5.5176302474120314e+02   3.7380723482821656e+02   2.6310146587883020e+02   2.3276384423696470e+02   2.6560502223380347e+01   7.7492481653193245e+34
1.0000000000000001e+03   0.0000000000000000e+00   0.0000000000000000e+00   9.9583373190821374e+02   1.0000000000000001e+03   0.0000000000000000e+00   0.0000000000000000e+00   -9.9583373190821374e+02   5.2011937776345621e+02   8.8908641950001950e+01   -4.2001664120113224e+02   -2.6566979810616516e+02   4.9695223579322089e+02   -3.7655028848362070e+02   -1.5806272288906815e+00   2.9923887869116601e+02   5.4472657812522084e+02   3.2434061362371824e+02   2.4050911890418433e+02   3.4359943974653737e+02   4.3820180831810222e+02   -3.6698967090099359e+01   1.8108814952583873e+02   -3.7716852033153822e+02   1.4950305051116847e+35
1.0000000000000001e+03   0.0000000000000000e+00   0.0000000000000000e+00   9.9583373190821374e+02   1.0000000000000001e+03   0.0000000000000000e+00   0.0000000000000000e+00   -9.9583373190821374e+02   5.4903096218035125e+02   1.1499930533740523e+02   6.5065902534210053e+01   -5.1802662627707195e+02   6.9025503265969712e+02   3.0819920376496896e+02   2.0972492488170826e+02   5.6732329124939054e+02   2.3887088888115068e+02   -2.1655472439576794e+01   -6.3717136416349138e+00   -2.0229864886735839e+02   5.2184311627880095e+02   -4.0154303666279714e+02   -2.6841911377428346e+02   1.5300198389503967e+02   7.6055389071336883e+34
1.0000000000000001e+03   0.0000000000000000e+00   0.0000000000000000e+00   9.9583373190821374e+02   1.0000000000000001e+03   0.0000000000000000e+00   0.0000000000000000e+00   -9.9583373190821374e+02   3.3543801061483128e+02   4.5952291089756606e+01   1.5265451219655861e+02   -2.6735490609837086e+02   5.4893382679825697e+02   -1.5112581782763337e+02   2.6427392120992920e+02   -4.3934454356192464e+02   7.7842407776393190e+02   -1.9755543335540247e+02   -3.9245418260616304e+02   6.3029406640814534e+02   3.3720408482297978e+02   3.0272896009327911e+02   -2.4474250800324821e+01   7.6405383252150202e+01   8.8766720043585067e+34
1.0000000000000001e+03   0.0000000000000000e+00   0.0000000000000000e+00   9.9583373190821374e+02   1.0000000000000001e+03   0.0000000000000000e+00   0.0000000000000000e+00   -9.9583373190821374e+02   5.8795660488343913e+02   -5.4960530908251076e+02   1.5522636766629736e+02   -6.2503985756956105e+01   4.1185505021081866e+02   -9.5032392870253091e+01   -9.6177880447631523e+01   3.6839956840652098e+02   1.7866749749610642e+02   -5.0199068098206453e+01   7.0797220169900996e+01   9.3620947654931314e+01   8.2152084740963573e+02   6.9483677005097024e+02   -1.2984570738856689e+02   -3.9951653030449620e+02   4.0144596817919929e+34
1.0000000000000001e+03   0.0000000000000000e+00   0.0000000000000000e+00   9.9583373190821374e+02   1.0000000000000001e+03   0.0000000000000000e+00   0.0000000000000000e+00   -9.9583373190821374e+02   8.0943993880571850e+02   3.3108043327267796e+02   -7.2444075161535557e+02   -7.1689320241999226e+01   3.5971553180973325e+02   -3.2882895212181063e+02   1.1312238969810764e+01   -7.4255082796539810e+01   3.6387291847670110e+02   -4.9380037058902232e+01   2.6948758516838535e+02   2.0424630763106998e+02   4.6697161090786614e+02   4.7128555908034912e+01   4.4364092747715932e+02   -5.8301904592530938e+01   9.1732364629496454e+34
1.0000000000000001e+03   0.0000000000000000e+00   0.0000000000000000e+00   9.9583373190821374e+02   1.0000000000000001e+03   0.0000000000000000e+00   0.0000000000000000e+00   -9.9583373190821374e+02   8.6974427973623312e+02   1.7866753086945302e+01   -6.8181880307444931e+02   -5.2500858187476740e+02   6.6810114603407374e+02   2.6552757650119048e+01   6.2418963529206724e+02   2.0103828388436949e+02   3.2635957517627855e+02   -1.6395058630756758e+01   8.5553420337666765e+01   2.8861286636299076e+02   1.3579499905341441e+02   -2.8024452106307585e+01   -2.7924252555284745e+01   3.5357431627407138e+01   2.3820272840013349e+34
1.0000000000000001e+03   0.0000000000000000e+00   0.0000000000000000e+00   9.9583373190821374e+02   1.0000000000000001e+03   0.0000000000000000e+00   0.0000000000000000e+00   -9.9583373190821374e+02   7.0445289483327235e+02   4.1088896327853882e+02   4.7645758294845950e+02   -2.9118261030799368e+02   2.6962865977818234e+02   7.6318648471067476e+01   -1.5469249657417649e+02   -1.6528856455598142e+02   2.7023243715914634e+02   -1.8952720250799615e+02   -5.5385196899180023e-01   -1.4655955393784964e+02   7.5568600822939902e+02   -2.9768040924161016e+02   -3.2121123440529135e+02   6.0303072880182481e+02   5.8905724153632861e+34
1.0000000000000001e+03   0.0000000000000000e+00   0.0000000000000000e+00   9.9583373190821374e+02   1.0000000000000001e+03   0.0000000000000000e+00   0.0000000000000000e+00   -9.9583373190821374e+02   1.5237290441028534e+02   -8.2773014357811391e+01   2.3804659600052553e+01   -1.3208643907424124e+01   6.2627722315404878e+02   -1.0944605416711012e+01   6.1357596462852428e+02   1.7063071220338986e+00   6.9147304842965082e+02   -4.0345017457990485e+02   -5.4131047233510867e+02   -8.1981131221641292e+01   5.2987682400601523e+02   4.9716779435442709e+02   -9.6070151893468008e+01   9.3483468007031490e+01   5.2541919347760055e+34
1.0000000000000001e+03   0.0000000000000000e+00   0.0000000000000000e+00   9.9583373190821374e+02   1.0000000000000001e+03   0.0000000000000000e+00   0.0000000000000000e+00   -9.9583373190821374e+02   8.5714565216852361e+02   -8.4184819443753645e+02   9.1201494756150680e+01   4.5250126054046675e+01   1.5623510770515432e+02   -7.7616682457835495e+01   4.6611644378995805e+01   2.4236627079004485e+01   5.3536639591676828e+02   5.1950766067035568e+02   2.3259480576344355e+01   -2.3726882328767314e+01   4.5125284420955387e+02   3.9995721622501640e+02   -1.6107261971149083e+02   -4.5759870804283842e+01   5.3480025051611473e+34
1.0000000000000001e+03   0.0000000000000000e+00   0.0000000000000000e+00   9.9583373190821374e+02   1.0000000000000001e+03   0.0000000000000000e+00   0.0000000000000000e+00   -9.9583373190821374e+02   5.3816293119522618e+02   4.0447068249909177e+02   -1.4988887781401002e+02   -2.9653183946924378e+02   3.7070930451159558e+02   -1.6377131377935683e+02   3.0586560306478793e+02   3.7756828472051843e+01   4.5364937254784184e+02   3.5379880671232729e+02   -2.4036854257140996e+02   8.4983064925196459e+01   6.3747839174533669e+02   -5.9449817543206188e+02   8.4391817320632128e+01   1.7379194607199554e+02   1.8206705524753178e+35
1.0000000000000001e+03   0.0000000000000000e+00   0.0000000000000000e+00   9.9583373190821374e+02   1.0000000000000001e+03   0.0000000000000000e+00   0.0000000000000000e+00   -9.9583373190821374e+02   3.0908357203157544e+02   -1.5202615304375877e+02   -9.6613870036000080e+01   2.1785652023104709e+02   4.0220469118137197e+02   2.0416153325431833e+02   -6.0302543602051493e+01   -3.1752997525063893e+02   6.5902587677524025e+02   -4.9282992083238116e+02   -1.6839883891208575e+02   3.8399297707742602e+02   6.2968586001182632e+02   4.4069454062182155e+02   3.2531525255013730e+02   -2.8431952205783426e+02   1.2411557217850637e+35
1.0000000000000001e+03   0.0000000000000000e+00   0.0000000000000000e+00   9.9583373190821374e+02   1.0000000000000001e+03   0.0000000000000000e+00   0.0000000000000000e+00   -9.9583373190821374e+02   6.3609194990806020e+02   -3.5999526359218902e+02   2.5029793814979348e+02   4.4355644633686785e+02   3.3191169862423970e+02   2.4813067418239811e+01   -2.8762926760887706e+02   -1.0580213506213812e+02   3.0922263446556008e+02   -2.0871318344593993e+02   1.5937601583985168e+02   1.0503204414224331e+02   7.2277371700213985e+02   5.4389537961988913e+02   -1.2204468638076806e+02   -4.4278635541697309e+02   1.1226400336206710e+35
1.0000000000000001e+03   0.0000000000000000e+00   0.0000000000000000e+00   9.9583373190821374e+02   1.0000000000000001e+03   0.0000000000000000e+00   0.0000000000000000e+00   -9.9583373190821374e+02   3.8971157573633616e+02   -2.6307199385502389e+02   1.9265858526128906e+02   -1.7299106288233205e+02   6.6311422727229649e+02   4.1939679230976009e+02   3.3453746128758735e+02   -3.6917000962493523e+02   7.6495366526572616e+02   -2.3500567128893559e+02   -4.2623484742304908e+02   5.7673676777864216e+02   1.8222053172564117e+02   7.8680872834199448e+01   -1.0096119912582735e+02   -3.4575695271374833e+01   5.7517182113684129e+34
1.0000000000000001e+03   0.0000000000000000e+00   0.0000000000000000e+00   9.9583373190821374e+02   1.0000000000000001e+03   0.0000000000000000e+00   0.0000000000000000e+00   -9.9583373190821374e+02   7.4200968355368173e+02   -3.8972681685172643e+02   -1.5504244927698224e+02   5.9918963411949153e+02   6.6554814190212323e+02   4.6006222363314276e+02   3.1362264695137111e+02   -3.4250972963452097e+02   3.3789314753873731e+02   -1.3826186493973857e+01   -2.9899896080687870e+02   -9.4632114829350272e+01   2.5454902700545756e+02   -5.6509220287442453e+01   1.4041876313248983e+02   -1.6204778965562031e+02   7.7682146978403594e+34
1.0000000000000001e+03   0.0000000000000000e+00   0.0000000000000000e+00   9.9583373190821374e+02   1.0000000000000001e+03   0.0000000000000000e+00   0.0000000000000000e+00   -9.9583373190821374e+02   5.8820198958634569e+02   -1.7991942935523633e+02   3.5187201727440419e+02   4.1733878678246884e+02   2.9595481657805652e+02   -8.4127245151436910e+01   1.7419898606682139e+02   -1.8585363416482463e+02   2.8451071657597640e+02   -4.3069226939909235e+01   7.1827951842609266e+01   2.4146870371017025e+02   8.3133247725962156e+02   3.0711590144658254e+02   -5.9789895518383491e+02   -4.7295385632781438e+02   5.5843969349748817e+34
1.0000000000000001e+03   0.0000000000000000e+00   0.0000000000000000e+00   9.9583373190821374e+02   1.0000000000000001e+03   0.0000000000000000e+00   0.0000000000000000e+00   -9.9583373190821374e+02   4.1432269627077523e+02   2.4426582386428973e+02   -3.0909316274053725e+02   2.8877684880139356e+01   6.4367359066657252e+02   2.2986212217418341e+01   4.9405243370476637e+02   3.9252327080046030e+02   6.6979770231511941e+02   -1.6322274723611446e+02   -1.1278202643595678e+02   -6.2740936502757734e+02   2.7220601074753273e+02   -1.0402928884559360e+02   -7.2177244528272425e+01   2.0600840934697766e+02   8.8781078194002025e+34
1.0000000000000001e+03   0.0000000000000000e+00   0.0000000000000000e+00   9.9583373190821374e+02   1.0000000000000001e+03   0.0000000000000000e+00   0.0000000000000000e+00   -9.9583373190821374e+02   3.1524972249091962e+02   2.6750277312983616e+02   -7.7407739177657291e+01   7.8788932051735330e+01   4.5134343549234507e+02   1.9204972837707356e+02   3.8841096265526716e+02   1.8431567527844447e+01   7.0630944348089361e+02   -2.8161307184941757e+02   -2.6954204908729730e+02   -5.7557726804282811e+02   5.2709739853584858e+02   -1.7793942965749216e+02   -4.1461174390312571e+01   4.7835676846324827e+02   1.0488248631960539e+35
1.0000000000000001e+03   0.0000000000000000e+00   0.0000000000000000e+00   9.9583373190821374e+02   1.0000000000000001e+03   0.0000000000000000e+00   0.0000000000000000e+00   -9.9583373190821374e+02   4.3750878645462791e+02   -2.1571200536229333e+02   3.5951902539169356e+02   -1.8273885700470831e+00   3.6449684157005430e+02   2.2674806580705058e+02   2.5650652135967914e+02   4.7609523483419913e+00   3.0623073116800697e+02   7.8309561738540438e+01   2.6013988740254592e+02   -6.5932634060839632e+01   8.9176364080731082e+02   -8.9345622183297678e+01   -8.7616543415391868e+02   6.2999070282544686e+01   5.6322491061731216e+34
1.0000000000000001e+03   0.0000000000000000e+00   0.0000000000000000e+00   9.9583373190821374e+02   1.0000000000000001e+03   0.0000000000000000e+00   0.0000000000000000e+00   -9.9583373190821374e+02   2.2927107933791970e+02   -7.3530477463899530e+01   -1.6842483356413854e+02   5.6272303521340554e+01   6.0214659934679605e+02   3.1094274058664206e+02   -1.5435984671574153e+02   4.7586045948709784e+02   6.7840455884002347e+02   1.8360140915840304e+02   1.2742861379109331e+02   -6.2821987902107696e+02   4.9017776247526092e+02   -4.2101367228114549e+02   1.9535606648878675e+02   9.6087116012638461e+01   7.8906174302207737e+34
1.0000000000000001e+03   0.0000000000000000e+00   0.0000000000000000e+00   9.9583373190821374e+02   1.0000000000000001e+03   0.0000000000000000e+00   0.0000000000000000e+00   -9.9583373190821374e+02   5.0138216870833696e+02   -3.5744875199441071e+02   1.3025194613842528e+01   -3.2835927442602411e+02   5.6593859541523977e+02   2.6526833291378892e+02   2.6930722733812632e+02   4.0220370788589747e+02   3.4383049466486972e+02   1.0409265096589112e+02   2.1774047428281031e+02   2.1059015868620006e+02   5.8884874121155406e+02   -1.1912231885269538e+01   -5.0007289623477919e+02   -2.8443459214607333e+02   1.5055055646295861e+35
1.0000000000000001e+03   0.0000000000000000e+00   0.0000000000000000e+00   9.9583373190821374e+02   1.0000000000000001e+03   0.0000000000000000e+00   0.0000000000000000e+00   -9.9583373190821374e+02   3.3020557674979278e+02   -8.9053357568756120e+00   3.0417906004547899e+02   2.8399248961364545e+01   7.8252873330141870e+02   2.5398758838777903e+02   -1.1581473398205451e+02   -7.2028013354524012e+02   7.6101665125700526e+02   -2.4927156994012961e+02   -2.0004630427971475e+02   6.7923965141475480e+02   1.2624903869178318e+02   4.1893173092265332e+00   1.1681978216290901e+01   1.2641233169121005e+01   2.3921398211909956e+34
1.0000000000000001e+03   0.0000000000000000e+00   0.0000000000000000e+00   9.9583373190821374e+02   1.0000000000000001e+03   0.0000000000000000e+00   0.0000000000000000e+00   -9.9583373190821374e+02   4.0423820979805748e+02   1.9283082420560359e+02   9.6700859841907274e+00   3.3242486810403392e+02   6.6187406034906974e+02   -4.0720931369693665e+02   -4.7615722852553046e+02   1.7293681020627105e+02   1.4735222967361923e+02   -6.9658762458896419e+01   -2.6317130237459665e+01   2.3296889460755413e+01   7.8653550017925363e+02   2.8403725195022946e+02   4.9280427277879937e+02   -5.2865856777106046e+02   3.5250862944810726e+34
1.0000000000000001e+03   0.0000000000000000e+00   0.0000000000000000e+00   9.9583373190821374e+02   1.0000000000000001e+03   0.0000000000000000e+00   0.0000000000000000e+00   -9.9583373190821374e+02   1.5920701180066175e+02   4.9023847203255656e+01   -2.0503286555055563e+01   -8.3055103710302859e+01   8.0121365393277790e+02   3.6398210031230713e+02   -7.0262806475116156e+02   -1.2212801668431302e+01   5.9659476394589331e+02   -7.8298842697602524e+01   5.1755454465618425e+02   2.5750125612431839e+02   4.4298457032066699e+02   -3.3470710481796038e+02   2.0557680665003298e+02   -1.6223335074558429e+02   4.7217085913243905e+34
1.0000000000000001e+03   0.0000000000000000e+00   0.0000000000000000e+00   9.9583373190821374e+02   1.0000000000000001e+03   0.0000000000000000e+00   0.0000000000000000e+00   -9.9583373190821374e+02   8.7968555570839555e+02   -4.7396600018491989e+02   7.2779646922143468e+02   6.2371523786987034e+01   3.6230752951234649e+02   1.2552980857392754e+02   -2.9213547294906772e+02   -1.2058556524541996e+02   1.3556952793226540e+02   -2.8465097827105325e+01   3.6404251262252764e+01   -2.4870979062059085e+01   6.2243738684699269e+02   3.7690128943809776e+02   -4.7206524753461963e+02   8.3085020520492094e+01   3.2982855541686922e+34
1.0000000000000001e+03   0.0000000000000000e+00   0.0000000000000000e+00   9.9583373190821374e+02   1.0000000000000001e+03   0.0000000000000000e+00   0.0000000000000000e+00   -9.9583373190821374e+02   3.0699928228900296e+02   -1.2860336077262366e+02   1.4116547797752978e+02   -2.0532180291270831e+02   7.4636829388117951e+02   2.1797699590993125e+02   -1.6568396803247992e+02   6.8299010395627045e+02   6.5586710937472731e+02   -1.7776834341755549e+02   -1.9744390770541850e+02   -5.8647334513015380e+02   2.9076531445509016e+02   8.8394708280248040e+01   2.2196239776036865e+02   1.0880504408659179e+02   7.2814883646060406e+34
1.0000000000000001e+03   0.0000000000000000e+00   0.0000000000000000e+00   9.9583373190821374e+02   1.0000000000000001e+03   0.0000000000000000e+00   0.0000000000000000e+00   -9.9583373190821374e+02   3.4365659835643135e+02   4.1640159135598580e+01   3.1382276588737159e+02   4.7499751071721469e+01   7.3397644122759868e+02   -1.9125957039919317e+02   4.0959631730711664e+01   -6.9630345509435108e+02   4.1143567954040520e+02   1.6971282617443143e+02   -3.1742580641487461e+02   1.5521833800369305e+02   5.1093128087556977e+02   -2.0093414910836941e+01   -3.7356591203208524e+01   4.9358536601893661e+02   1.1096020166007368e+35
1.0000000000000001e+03   0.0000000000000000e+00   0.0000000000000000e+00   9.9583373190821374e+02   1.0000000000000001e+03   0.0000000000000000e+00   0.0000000000000000e+00   -9.9583373190821374e+02   5.7170957125517714e+02   -2.2078965052265127e+02   5.1231841116417945e+02   -2.9342237601935119e+00   3.3734941847640687e+02   -2.7023845305789854e+02   -1.5455279279210103e+02   3.5556193207453127e+01   2.5610517088838435e+02   -1.3850459991233049e+02   1.7160946446282031e+02   3.6490081743918346e+01   8.3483583938003176e+02   6.2953270349288039e+02   -5.2937508283489876e+02   -6.9112051191177798e+01   6.5833101874356158e+34
1.0000000000000001e+03   0.0000000000000000e+00   0.0000000000000000e+00   9.9583373190821374e+02   1.0000000000000001e+03   0.0000000000000000e+00   0.0000000000000000e+00   -9.9583373190821374e+02   3.5896531890263526e+02   -1.5013529214881693e+01   3.2323843359857557e+02   -9.2317978531398566e+01   7.3859299982953860e+02   -5.9537403897518072e+02   -4.4816876337763638e+01   4.1643225224146943e+02   4.8033915700307551e+02   4.4762036557089073e+02   2.7612660809009341e+01   -1.1821275328683495e+02   4.2210252426475404e+02   1.6276720261917166e+02   -3.0603421806982078e+02   -2.0590152042323609e+02   1.2845023359065164e+35
1.0000000000000001e+03   0.0000000000000000e+00   0.0000000000000000e+00   9.9583373190821374e+02   1.0000000000000001e+03   0.0000000000000000e+00   0.0000000000000000e+00   -9.9583373190821374e+02   4.3156924001685911e+02   1.3215031600501606e+01   -3.1702884152516054e+02   -2.6447133211322114e+02   1.5323288252145142e+02   -8.0556535337343135e+01   -3.6433857030163132e+01   6.2076535165832434e+00   6.6807886739857236e+02   -6.0967452832123627e+02   2.4269776325214949e+02   -9.9568214426245625e+00   7.4711901006311734e+02   6.7701603205807783e+02   1.1076493530317414e+02   2.6822050003926239e+02   4.1035432627381930e+34
1.0000000000000001e+03   0.0000000000000000e+00   0.0000000000000000e+00   9.9583373190821374e+02   1.0000000000000001e+03   0.0000000000000000e+00   0.0000000000000000e+00   -9.9583373190821374e+02   4.2562318885923548e+02   2.2668676611348198e+02   -3.2237981139221830e+02   1.0106664222399822e+02   6.9622371873485633e+02   -5.1065911646169747e+02   2.7525907159246538e+02   3.6409089086326372e+02   2.4894929433282425e+02   -1.7474420410876439e+02   1.1153697619443979e+02   -5.8092316364616316e+01   6.2920379807308370e+02   4.5871655445697991e+02   -6.4416236394686877e+01   -4.0706521672264557e+02   1.0760013966996636e+35
1.0000000000000001e+03   0.0000000000000000e+00   0.0000000000000000e+00   9.9583373190821374e+02   1.0000000000000001e+03   0.0000000000000000e+00   0.0000000000000000e+00   -9.9583373190821374e+02   7.2180578029877904e+02   6.8418077354746018e+01   7.0695316551740609e+02   -3.0245213319281177e+01   2.4179634815468950e+02   -3.8789359535235988e+01   1.0787350469508448e+01   -2.0302584229018242e+02   7.2911803890279532e+02   -2.9132824998517509e+02   -6.1646499312150434e+02   2.2602406435983033e+02   3.0727983264373609e+02   2.6169953216566512e+02   -1.0127552286541007e+02   7.2469912496332594e+00   6.1443380410551545e+34
1.0000000000000001e+03   0.0000000000000000e+00   0.0000000000000000e+00   9.9583373190821374e+02   1.0000000000000001e+03   0.0000000000000000e+00   0.0000000000000000e+00   -9.9583373190821374e+02   7.0276010870934442e+02   -6.7638278758860031e+02   1.3633752940672545e+02   -4.6531420806955680e+01   1.8578988530420926e+02   1.3196117483674365e+02   3.6275920535835141e+01   1.2774482624958788e+01   3.0351135539374229e+02   -2.4577785574389623e+02   -8.0118799979908076e+01   9.8327851439246686e+01   8.0793865059270399e+02   7.9019946849575297e+02   -9.2494649962652701e+01   -6.4570913257249686e+01   5.7735185537557059e+34
1.0000000000000001e+03   0.0000000000000000e+00   0.0000000000000000e+00   9.9583373190821374e+02   1.0000000000000001e+03   0.0000000000000000e+00   0.0000000000000000e+00   -9.9583373190821374e+02   4.1728787411909735e+02   1.4095126205582932e+02   -3.7098242175366954e+02   -3.1764041957645230e+01   2.6169023069798322e+02   -1.5047808198459036e+01   -1.6564973067592547e+02   1.5871517582820920e+02   6.5149262352762150e+02   4.1900877514692701e+02   4.2740864615420310e+02   2.2488026603818747e+02   6.6952927165529809e+02   -5.4491222900429727e+02   1.0922350627539178e+02   -3.5183139990875139e+02   8.7430878694799775e+34
1.0000000000000001e+03   0.0000000000000000e+00   0.0000000000000000e+00   9.9583373190821374e+02   1.0000000000000001e+03   0.0000000000000000e+00   0.0000000000000000e+00   -9.9583373190821374e+02   6.2913010846681220e+02   2.9797893786087769e+02   3.3356408815142669e+02   4.2440928956194318e+02   3.7900785532370890e+02   9.0840209221824139e+01   3.4425115724486864e+02   -3.5512695211450620e+01   4.9685602901379718e+02   -3.2095625125290780e+02   -3.5574046987961253e+02   -4.0947728128335719e+01   4.9500600719568200e+02   -6.7862895829793871e+01   -3.2207477551668279e+02   -3.4794886622215688e+02   1.7517328957699582e+35
1.0000000000000001e+03   0.0000000000000000e+00   0.0000000000000000e+00   9.9583373190821374e+02   1.0000000000000001e+03   0.0000000000000000e+00   0.0000000000000000e+00   -9.9583373190821374e+02   2.1940868039427721e+02   -4.0646385464534788e+01   -8.2391975920918838e+01   1.5515992615644424e+02   7.5459551700079612e+02   5.6583966447000762e+02   -1.2223290055164517e+02   4.6762590434331082e+02   2.3439687693521651e+02   8.8386160123896261e+01   1.5940797099545843e+01   -1.7677860052440485e+02   7.9159892566971041e+02   -6.1357943912936901e+02   1.8868407937301814e+02   -4.4600722997535024e+02   3.6851496859454133e+34
1.0000000000000001e+03   0.0000000000000000e+00   0.0000000000000000e+00   9.9583373190821374e+02   1.0000000000000001e+03   0.0000000000000000e+00   0.0000000000000000e+00   -9.9583373190821374e+02   2.6522411394374490e+02   -6.8496543351995513e+01   1.1234517017986430e+02   1.9340531767076652e+02   7.4117903867295456e+02   -3.9268763926132743e+02   6.0184248582330247e+02   1.3154241748408975e+02   6.6164199724987247e+02   3.7891496794048959e+02   -4.1788664574536654e+02   -3.2239623276822624e+02   3.3195485013342824e+02   8.2269214672833357e+01   -2.9630101025780027e+02   -2.5515023866301245e+00   9.1693034734495740e+34
1.0000000000000001e+03   0.0000000000000000e+00   0.0000000000000000e+00   9.9583373190821374e+02   1.0000000000000001e+03   0.0000000000000000e+00   0.0000000000000000e+00   -9.9583373190821374e+02   8.1989666282321446e+02   -5.2040095653233129e+02   5.2196299134936498e+02   -3.3666454789671792e+02   6.9707255794491175e+02   3.7592221699625998e+02   -3.2453582540308554e+02   4.7291028307536016e+02   3.4807623877543040e+02   1.4498168215015772e+02   -2.4040336221658438e+02   -1.6345826157133448e+02   1.3495454045644334e+02   -5.0294261408630170e-01   4.2976196270304868e+01   2.7212526392692247e+01   2.9930190518781833e+34
1.0000000000000001e+03   0.0000000000000000e+00   0.0000000000000000e+00   9.9583373190821374e+02   1.0000000000000001e+03   0.0000000000000000e+00   0.0000000000000000e+00   -9.9583373190821374e+02   4.2553645336267527e+02   1.6172404096573871e+02   -1.0022900830669337e+02   3.5952156209058325e+02   4.7737666031058882e+02   -4.1595465984258635e+02   1.5068913985745328e+02   1.2860007734659544e+02   7.4359653405106451e+02   9.7352977046300694e+01   1.3275572587009998e+02   -7.1428924152732509e+02   3.5349035227567526e+02   1.5687764183054702e+02   -1.8321585742085992e+02   2.2616760209014623e+02   1.0240335041891004e+35
1.0000000000000001e+03   0.0000000000000000e+00   0.0000000000000000e+00   9.9583373190821374e+02   1.0000000000000001e+03   0.0000000000000000e+00   0.0000000000000000e+00   -9.9583373190821374e+02   8.4844532010556622e+02   8.7831861547206856e+01   -7.1653446969243191e+02   4.2789996383357459e+02   6.6814812265860792e+02   -2.5952414450293480e+02   5.9547655589765827e+02   -9.4084024193829677e+01   2.9247316852151323e+02   1.1432256750158859e+02   1.2740005842928603e+02   -2.0153195770664442e+02   1.9093338871431274e+02   5.7369715454139396e+01   -6.3421446345120298e+00   -1.3228398193310045e+02   3.4178230585498345e+34
1.0000000000000001e+03   0.0000000000000000e+00   0.0000000000000000e+00   9.9583373190821374e+02   1.0000000000000001e+03   0.0000000000000000e+00   0.0000000000000000e+00   -9.9583373190821374e+02   4.5181631912180057e+02   1.9660568316428979e+02   3.5596471752010353e+02   -1.5214569153646312e+02   2.6194851015634941e+02   5.0726062802193450e+00   2.1041157362465731e+02   -9.3237655072681832e+01   9.4230992821936945e+02   -1.5952240786028591e+02   -8.8380338226797255e+02   2.5645113316759119e+02   3.4392524250248067e+02   -4.2155881584223209e+01   3.1742709112321177e+02   -1.1067786558446230e+01   3.5693760391981802e+34
1.0000000000000001e+03   0.0000000000000000e+00   0.0000000000000000e+00   9.9583373190821374e+02   1.0000000000000001e+03   0.0000000000000000e+00   0.0000000000000000e+00   -9.9583373190821374e+02   8.6848273677917666e+02   -7.4725166603649257e+02   1.4198077619308040e+02   -4.0011707146877023e+02   2.3629932604860028e+02   5.5966581826584388e+01   1.8863075314274920e+02   3.8711137654040954e+01   5.2586488007014384e+02   3.7452003965079928e+02   -2.2655094759533526e+02   2.6328364957742087e+02   3.6935305710207888e+02   3.1676504455910896e+02   -1.0406058174049427e+02   9.8122284237308122e+01   6.3245780723858062e+34
1.0000000000000001e+03   0.0000000000000000e+00   0.0000000000000000e+00   9.9583373190821374e+02   1.0000000000000001e+03   0.0000000000000000e+00   0.0000000000000000e+00   -9.9583373190821374e+02   7.1820429283446299e+02   6.1998101047325304e+02   1.9296936186162199e+02   -2.8031906514030334e+02   8.1652753082414915e+02   -4.9745088069400612e+02   -4.9780136988349102e+02   3.9475134709416653e+02   1.4078063952326133e+02   -4.8899148727592149e+01   2.6092787282270383e+01   -3.3499674179571770e+01   3.2448753681812667e+02   -7.3630981051654814e+01   2.7873922073959864e+02   -8.0932607774291370e+01   2.8117153590113719e+34
1.0000000000000001e+03   0.0000000000000000e+00   0.0000000000000000e+00   9.9583373190821374e+02   1.0000000000000001e+03   0.0000000000000000e+00   0.0000000000000000e+00   -9.9583373190821374e+02   7.2130773849974196e+02   -4.4853247703017252e+02   -1.3796548276205297e+02   -5.3333291313683560e+02   6.5374400971685554e+02   3.9861565254661082e+02   9.0251902416405841e+01   4.9468817036162415e+02   3.0990331147953952e+02   -6.5517532619693952e+01   2.2723188952064947e+02   -1.5648700831151200e+02   3.1504494030386314e+02   1.1543435710325572e+02   -1.7951830917500240e+02   1.9513175108672340e+02   9.6679076389524204e+34
1.0000000000000001e+03   0.0000000000000000e+00   0.0000000000000000e+00   9.9583373190821374e+02   1.0000000000000001e+03   0.0000000000000000e+00   0.0000000000000000e+00   -9.9583373190821374e+02   6.1495942675247056e+02   4.6118790111434276e+02   3.8671401888249886e+02   1.7552322274273397e+01   4.3168316584522182e+02   2.5543653272379834e+02   -2.5666792029363688e+02   -1.9899525651717565e+02   5.7435482186743707e+02   -4.8972323777625780e+02   1.4173341591487420e+02   2.3311209877956813e+02   3.7900258553487112e+02   -2.2690119606188387e+02   -2.7177951450373649e+02   -5.1669164536666479e+01   1.5541921730158690e+35
1.0000000000000001e+03   0.0000000000000000e+00   0.0000000000000000e+00   9.9583373190821374e+02   1.0000000000000001e+03   0.0000000000000000e+00   0.0000000000000000e+00   -9.9583373190821374e+02   4.1251506163401211e+02   1.5723337540731484e+02   2.5523004826329179e+02   2.5432059333929880e+02   3.3507551206930782e+02   -1.8979944086205046e+02   1.9934287188838252e+02   1.4453093255166445e+02   5.6810742706066583e+02   3.6034136770544791e+02   1.3297041180857920e+02   -3.9949219890395057e+02   6.8430199923601867e+02   -3.2777530225071223e+02   -5.8754333196025357e+02   6.4067301298749757e-01   1.1219311582717911e+35
1.0000000000000001e+03   0.0000000000000000e+00   0.0000000000000000e+00   9.9583373190821374e+02   1.0000000000000001e+03   0.0000000000000000e+00   0.0000000000000000e+00   -9.9583373190821374e+02   5.1114268875723656e+02   -2.7708279050783108e+02   3.6924764781238952e+02   1.8034175905593244e+02   5.2483212505156598e+02   -4.7365676096380884e+02   -3.8947024870049290e+01   -1.8427197706973115e+02   1.5622620316411863e+02   -6.6963596977088029e+00   -8.3227378754257188e+01   -4.2543962527846297e+01   8.0779898302707875e+02   7.5743591116934829e+02   -2.4707324418808301e+02   4.6474180541645012e+01   4.6905732559491302e+34
1.0000000000000001e+03   0.0000000000000000e+00   0.0000000000000000e+00   9.9583373190821374e+02   1.0000000000000001e+03   0.0000000000000000e+00   0.0000000000000000e+00   -9.9583373190821374e+02   4.4063694642980784e+02   2.6412737191770145e+02   2.9486071643160443e+02   1.4774913829960096e+02   4.2519165463609619e+02   5.5150535292807085e+01   2.9915966688689565e+02   -2.6948999116334511e+02   8.2653249285596473e+02   -2.5854426332382121e+02   -6.7286221951251639e+02   3.8463262888336470e+02   3.0763890607813136e+02   -6.0733643886687354e+01   7.8841836194016309e+01   -2.6289177601962041e+02   7.2064660750484217e+34
1.0000000000000001e+03   0.0000000000000000e+00   0.0000000000000000e+00   9.9583373190821374e+02   1.0000000000000001e+03   0.0000000000000000e+00   0.0000000000000000e+00   -9.9583373190821374e+02   4.5949255469638683e+02   -2.1042311288223758e+02   -3.7909914301257049e+02   8.6685414883334076e+01   4.9619011848933161e+02   -1.9249265198187010e+02   2.5823425573016942e+02   3.5614783698196049e+02   7.1636025274349049e+02   2.7911493672987547e+02   -6.9125341106565031e+01   -6.4409902268354392e+02   3.2795707407079573e+02   1.2380082813423222e+02   1.8999022838896616e+02   2.0126577081824951e+02   1.1442402482636153e+35
1.0000000000000001e+03   0.0000000000000000e+00   0.0000000000000000e+00   9.9583373190821374e+02   1.0000000000000001e+03   0.0000000000000000e+00   0.0000000000000000e+00   -9.9583373190821374e+02   5.1934358684981760e+02   2.2859689432771586e+02   -2.9448657645390318e+02   3.3928436066847604e+02   3.8744188668928120e+02   -5.8984465400862362e+01   7.9724607546631759e+01   -3.5305953514139787e+02   6.4592014889092241e+02   -4.8720696471078838e+02   2.7655819248382312e+02   2.9619719521064457e+02   4.4729437756997885e+02   3.1759453578393487e+02   -6.1796223576551675e+01   -2.8242202073772279e+02   1.2735078586274565e+35
1.0000000000000001e+03   0.0000000000000000e+00   0.0000000000000000e+00   9.9583373190821374e+02   1.0000000000000001e+03   0.0000000000000000e+00   0.0000000000000000e+00   -9.9583373190821374e+02   4.5468013162432788e+02   8.8453321672492478e+01   -3.8474388923052430e+02   1.8776893161220445e+02   3.6425105231787342e+02   -1.1118929829175055e+01   2.8898820653764204e+02   1.8280047865443115e+02   5.4766073335672661e+02   -4.2895579221185159e+02   -3.1098826808523017e+02   -5.9920816934343698e+01   6.3340808270107243e+02   3.5162140036853492e+02   4.0674395077811232e+02   -3.1064859333229197e+02   1.5650986872483888e+35
1.0000000000000001e+03   0.0000000000000000e+00   0.0000000000000000e+00   9.9583373190821374e+02   1.0000000000000001e+03   0.0000000000000000e+00   0.0000000000000000e+00   -9.9583373190821374e+02   6.4323863781088357e+02   -4.6791066201354249e+02   3.1329481432391680e+02   -2.8466983834714949e+02   4.0445741654357340e+02   3.3001065919586256e+02   1.8410526966041473e+02   -7.1826292522167208e+01   2.2772158982232168e+02   -1.0500187084979520e+02   1.2294945123608869e+02   1.0044979855626057e+02   7.2458235582322118e+02   2.4290187366747506e+02   -6.2034953522042031e+02   2.5604633231305559e+02   7.8129835755449952e+34
1.0000000000000001e+03   0.0000000000000000e+00   0.0000000000000000e+00   9.9583373190821374e+02   1.0000000000000001e+03   0.0000000000000000e+00   0.0000000000000000e+00   -9.9583373190821374e+02   3.9542577731363997e+02   -3.5122585731846840e+02   3.3838271328631429e+01   -1.2740452860276665e+02   5.2676997916698349e+02   1.9391047144830142e+02   6.7333624437743680e+01   4.6874995790331383e+02   4.7662111369891983e+02   2.5180114163646428e+02   3.8419500186331737e+02   -2.3088344189596235e+01   6.0118312982045666e+02   -9.4485755766297657e+01   -4.8536689762969223e+02   -3.1825708511095098e+02   1.5668981156227344e+35
1.0000000000000001e+03   0.0000000000000000e+00   0.0000000000000000e+00   9.9583373190821374e+02   1.0000000000000001e+03   0.0000000000000000e+00   0.0000000000000000e+00   -9.9583373190821374e+02   4.6710712261584257e+02   -2.7104182473039828e+02   3.1059230907565990e+02   -1.8064553907671689e+02   7.8939175531236435e+02   4.1219353354185307e+02   -1.1352183703358089e+02   6.5170823746361964e+02   4.8958593115513452e+02   1.4515941480619793e+01   -4.0177599899424813e+01   -4.7142807711706467e+02   2.5391519091665867e+02   -1.5566765029207471e+02   -1.5689287214265369e+02   3.6537873016175038e-01   7.4558050150963446e+34
1.0000000000000001e+03   0.0000000000000000e+00   0.0000000000000000e+00   9.9583373190821374e+02   1.0000000000000001e+03   0.0000000000000000e+00   0.0000000000000000e+00   -9.9583373190821374e+02   3.4931702555594319e+02   -2.0244077317223778e+02   -2.4678557434636215e+02   -6.7171407572078294e+01   2.6925285022953364e+02   1.9920918743284994e+02   -9.9671461732557106e+01   -8.5166875692177015e+01   5.6784406750885728e+02   -3.7883065470051895e+02   -1.0848710104320867e+02   -3.8928109249155773e+02   8.1358605670566601e+02   3.8206224043990676e+02   4.5494413712212793e+02   5.4161937575581294e+02   7.9443318484736227e+34
1.0000000000000001e+03   0.0000000000000000e+00   0.0000000000000000e+00   9.9583373190821374e+02   1.0000000000000001e+03   0.0000000000000000e+00   0.0000000000000000e+00   -9.9583373190821374e+02   6.8260340911605101e+02   5.7375359594615384e+02   -2.9720789813247706e+02   -1.8109856587888240e+02   2.9508431978734848e+02   -1.1061439198353091e+02   2.4184310945545661e+02   -2.6946659893052175e+01   5.9755100917175855e+02   -2.3129124846192909e+02   -2.3339968773676972e-01   5.3660647822374938e+02   4.2476126192486072e+02   -2.3184795550069407e+02   5.5598188364757505e+01   -3.2856125245181494e+02   9.2959468419846410e+34
1.0000000000000001e+03   0.0000000000000000e+00   0.0000000000000000e+00   9.9583373190821374e+02   1.0000000000000001e+03   0.0000000000000000e+00   0.0000000000000000e+00   -9.9583373190821374e+02   6.1343330347666517e+02   -2.4398170170906005e+02   -4.3446183535978173e+02   -3.3524805840042620e+02   5.1813952444112908e+02   3.6713115925131142e+01   -3.0412134056294190e+02   3.9875546908016997e+02   7.2662063780810411e+02   2.2483745819409086e+02   6.7837872394571457e+02   -4.0037177463701177e+01   1.4180653427410169e+02   -1.7568872410161841e+01   6.0204451977009192e+01   -2.3470233216042566e+01   4.1645940827144092e+34
1.0000000000000001e+03   0.0000000000000000e+00   0.0000000000000000e+00   9.9583373190821374e+02   1.0000000000000001e+03   0.0000000000000000e+00   0.0000000000000000e+00   -9.9583373190821374e+02   5.6860022026450497e+02   4.3824570263252627e+02   -2.2638152967965516e+02   -2.5371897372657469e+02   1.4991640345729451e+02   5.2005118947523563e+00   2.5800024117021440e+01   -7.8468091968417028e+01   6.9450581859943031e+02   -2.9254074652880632e+02   -3.1602246498176487e+02   5.3034238498887009e+02   5.8697755767877027e+02   -1.5090546799847232e+02   5.1660397054439852e+02   -1.9815531929387836e+02   4.4338983836225304e+34
1.0000000000000001e+03   0.0000000000000000e+00   0.0000000000000000e+00   9.9583373190821374e+02   1.0000000000000001e+03   0.0000000000000000e+00   0.0000000000000000e+00   -9.9583373190821374e+02   8.8290991635005196e+02   -7.8227529055370167e+02   1.0252096149371297e+02   3.7608475458702333e+02   4.5969665170167434e+02   2.9075008681674325e+02   -2.2324393852460133e+02   -2.4763388805616006e+02   1.8665150897848031e+02   9.4824302008915723e+01   -8.6300842903792301e+01   -5.2671643856638923e+01   4.7074192296979339e+02   3.9670090172804277e+02   2.0702381993468072e+02   -7.5779222674224258e+01   3.9285206227792853e+34
1.0000000000000001e+03   0.0000000000000000e+00   0.0000000000000000e+00   9.9583373190821374e+02   1.0000000000000001e+03   0.0000000000000000e+00   0.0000000000000000e+00   -9.9583373190821374e+02   4.2758890109878797e+02   1.9218250603566719e+02   3.4543711687608766e+02   1.0462481063808859e+02   5.6193123554723525e+02   9.0235309526265198e+01   -5.2407402496352734e+02   -1.3170314634385042e+02   5.1801573090616557e+02   -8.2938456633655502e+00   4.1643812982298113e+02   -2.8147076867749360e+02   4.9246413244781149e+02   -2.7412396989856683e+02   -2.3780122173554159e+02   3.0854910438325544e+02   1.8033314924739200e+35
1.0000000000000001e+03   0.0000000000000000e+00   0.0000000000000000e+00   9.9583373190821374e+02   1.0000000000000001e+03   0.0000000000000000e+00   0.0000000000000000e+00   -9.9583373190821374e+02   3.6858015220305720e+02   -1.6305936210826619e+02   -2.9309153147337264e+02   -8.7950708953749867e+01   4.3745157086060505e+02   -3.1684474709669718e+01   3.3387967329705077e+02   -2.5151408443631544e+02   6.8943342649380122e+02   3.7734386858508299e+02   -4.9000085159964527e+02   2.7785647345320160e+02   5.0453485044253733e+02   -1.8260003176714727e+02   4.4921270977596720e+02   6.1608319936863758e+01   1.5544156668334856e+35
1.0000000000000001e+03   0.0000000000000000e+00   0.0000000000000000e+00   9.9583373190821374e+02   1.0000000000000001e+03   0.0000000000000000e+00   0.0000000000000000e+00   -9.9583373190821374e+02   8.3647088141247275e+02   -8.3873121111390773e+01   7.4994395131867566e+02   3.3853789283701303e+02   5.2024400725410658e+02   2.9985052082047974e+02   -4.0426242462139237e+02   -4.1114283244769609e+01   4.6656785725054846e+02   -2.7203180459071268e+02   -2.3827751430130206e+02   -2.6698893027404944e+02   1.7671725408287210e+02   5.6054404881623668e+01   -1.0740401239598117e+02   -3.0434679318193897e+01   4.3196018490040925e+34
1.0000000000000001e+03   0.0000000000000000e+00   0.0000000000000000e+00   9.9583373190821374e+02   1.0000000000000001e+03   0.0000000000000000e+00   0.0000000000000000e+00   -9.9583373190821374e+02   9.2819934089521018e+02   -2.4424770867078070e+02   -4.4190179726091168e+02   -7.6876191036298860e+02   4.8428054547881896e+02   7.9197096911990783e+01   1.0703970908968564e+02   4.4852309555692955e+02   4.2979375490200414e+02   1.1701028460126645e+02   2.5358610105000034e+02   3.0182835255249574e+02   1.5772635872396668e+02   4.8040327157523492e+01   8.1275987121225711e+01   1.8410462253563342e+01   2.5426027935102099e+34
1.0000000000000001e+03   0.0000000000000000e+00   0.0000000000000000e+00   9.9583373190821374e+02   1.0000000000000001e+03   0.0000000000000000e+00   0.0000000000000000e+00   -9.9583373190821374e+02   5.0086097558622259e+02   -2.3357870623795431e+01   2.0536089806949866e+02   4.3876876403088886e+02   9.0298205315110602e+02   -7.0644812154225860e+01   4.7514354048699118e+01   -8.9022653576941673e+02   3.8060124004120479e+02   6.4149512982474349e+01   -1.3105289810177416e+02   3.2854570732873714e+02   2.1555573122146669e+02   2.9853169795546840e+01   -1.2182235401642390e+02   1.2291206440979086e+02   3.7637511777687521e+34
1.0000000000000001e+03   0.0000000000000000e+00   0.0000000000000000e+00   9.9583373190821374e+02   1.0000000000000001e+03   0.0000000000000000e+00   0.0000000000000000e+00   -9.9583373190821374e+02   7.2801756739059090e+02   5.7701405989276805e+02   -2.7482874482981731e+02   -3.2543588328677862e+02   4.5424231908436855e+02   -3.4621323248532156e+02   -6.7172459183268373e+01   2.5755648473001440e+02   4.8615540155697772e+02   -4.5002543215191309e+02   1.3440506206528713e+02   1.1595868692616040e+01   3.3158471196806795e+02   2.1922460474446655e+02   2.0759614194779846e+02   5.6283529864148250e+01   1.3953846555358677e+35
1.0000000000000001e+03   0.0000000000000000e+00   0.0000000000000000e+00   9.9583373190821374e+02   1.0000000000000001e+03   0.0000000000000000e+00   0.0000000000000000e+00   -9.9583373190821374e+02   2.2659466180867975e+02   -9.3140868724796675e+01   -1.6368581867406238e+02   -1.5870478832792930e+01   7.0532060480273879e+02   -5.1675623308396030e+02   -3.2715766590859012e+01   4.6232545868094849e+02   7.8233312734172989e+02   6.4739472480684310e+02   3.4555831937687998e+02   -2.4060266070430200e+02   2.8575160604685158e+02   -3.7497622998086079e+01   -1.4915673411195857e+02   -2.0585231914385355e+02   4.4592185251531996e+34
1.0000000000000001e+03   0.0000000000000000e+00   0.0000000000000000e+00   9.9583373190821374e+02   1.0000000000000001e+03   0.0000000000000000e+00   0.0000000000000000e+00   -9.9583373190821374e+02   4.4312670616238870e+02   3.0978551996880736e+02   -1.4714364808171010e+02   -2.5123287237379859e+02   5.9061516329711162e+02   -2.0635714671736591e+02   -1.5033262908516426e+02   5.1770464528289074e+02   3.7589181783165600e+02   3.3905902189258029e+02   -3.2406903963722435e+01   -9.8277316617415394e+01   5.9036631270884402e+02   -4.4248739514402155e+02   3.2988318113059688e+02   -1.6819445629167657e+02   1.3951922596775823e+35
1.0000000000000001e+03   0.0000000000000000e+00   0.0000000000000000e+00   9.9583373190821374e+02   1.0000000000000001e+03   0.0000000000000000e+00   0.0000000000000000e+00   -9.9583373190821374e+02   3.1702231799461373e+02   2.2943139226583014e+02   -9.6771936530885412e+01   1.5124344167501300e+02   5.2125476405777181e+02   -5.0150463741323676e+02   -5.5223556346252636e+01   3.9051075918768895e+01   5.8050976260659422e+02   5.5691778203870442e+01   -2.7820036543717936e+02   -4.9078464421034522e+02   5.8121315534102200e+02   2.1638146694353617e+02   4.3019585831431738e+02   3.0049012661656320e+02   1.3134569592742567e+35
1.0000000000000001e+03   0.0000000000000000e+00   0.0000000000000000e+00   9.9583373190821374e+02   1.0000000000000001e+03   0.0000000000000000e+00   0.0000000000000000e+00   -9.9583373190821374e+02   4.3436769944905137e+02   -3.4148918325057389e+02   -2.0989695792354510e+02   -1.1125962026700785e+02   4.9592081819468393e+02   -3.5948856183381650e+02   -5.4929826406614147e+01   3.1315035685829594e+02   3.8349251806862696e+02   6.6514323010995767e+01   3.5628792484313357e+02   8.7333189555132282e+00   6.8621896428763807e+02   6.3446342207339455e+02   -9.1461140512974396e+01   -2.1062405554680103e+02   1.5012383469288714e+35
1.0000000000000001e+03   0.0000000000000000e+00   0.0000000000000000e+00   9.9583373190821374e+02   1.0000000000000001e+03   0.0000000000000000e+00   0.0000000000000000e+00   -9.9583373190821374e+02   4.7219054468308423e+02   -4.0969855268801518e+02   1.5505785866104551e+02   1.2427013672200056e+02   4.0302692641388671e+02   7.6039028678429773e+01   -3.3049109985671191e+02   -1.7832386954013336e+02   4.2506574738391367e+02   -1.6627839196436042e+02   -3.7232041520165140e+01   -3.6881046765111267e+02   6.9971678151911578e+02   4.9993791597394619e+02   2.1266528271583167e+02   4.2286420046924468e+02   1.2661243283793532e+35
1.0000000000000001e+03   0.0000000000000000e+00   0.0000000000000000e+00   9.9583373190821374e+02   1.0000000000000001e+03   0.0000000000000000e+00   0.0000000000000000e+00   -9.9583373190821374e+02   5.8532501004914650e+02   3.9836699226965351e+02   -2.0454045912339558e+02   3.5559430175503883e+02   5.0103351653617091e+02   3.2194001015680163e+02   -2.1135101490771808e+02   -2.9511855761764178e+02   6.4599801506834990e+02   -5.4919001319951053e+02   2.7878654448914466e+02   -1.4952199666260270e+02   2.6764345834633252e+02   -1.7111698922694455e+02   1.3710492954196829e+02   8.9046252525205418e+01   1.2140542321470233e+35
1.0000000000000001e+03   0.0000000000000000e+00   0.0000000000000000e+00   9.9583373190821374e+02   1.0000000000000001e+03   0.0000000000000000e+00   0.0000000000000000e+00   -9.9583373190821374e+02   2.7942633293849622e+02   1.4874628482261178e+02   8.5813368026118894e+01   1.8156179157228996e+02   6.3631595056471065e+02   6.1591222840325622e+02   -9.9539921555203065e+01   4.1133761304487626e+00   7.3407601769490373e+02   -5.6819848796804592e+02   4.2603431850118589e+01   -4.4562094387520352e+02   3.5018169880188924e+02   -1.9646002525782217e+02   -2.8876878321034432e+01   2.5994577617246472e+02   8.2000446459907414e+34
1.0000000000000001e+03   0.0000000000000000e+00   0.0000000000000000e+00   9.9583373190821374e+02   1.0000000000000001e+03   0.0000000000000000e+00   0.0000000000000000e+00   -9.9583373190821374e+02   3.7355849842631500e+02   3.4415672802660066e+02   -2.6733154585001904e+00   -7.3959121716032854e+01   3.7464440633632000e+02   3.4749115812357689e+02   -5.1651778356628064e+01   3.6268719547658698e+01   2.9168653443103528e+02   2.4810341245338108e+02   -4.6817476451314121e+01   -7.5556965238855426e+01   9.6011056080632966e+02   -9.3975129860355855e+02   1.0114257026644246e+02   1.1324736740722969e+02   3.3593583941590426e+34
1.0000000000000001e+03   0.0000000000000000e+00   0.0000000000000000e+00   9.9583373190821374e+02   1.0000000000000001e+03   0.0000000000000000e+00   0.0000000000000000e+00   -9.9583373190821374e+02   1.8673304282784272e+02   1.3863588483011060e+02   -1.7217262798509481e+00   4.6212963261984790e+00   6.7488919870011307e+02   3.9336810468482332e+02   4.0855791549719203e+02   3.4379120760039825e+02   6.2777126237876848e+02   -5.6507695486370437e+02   -2.1793338010960076e+02   1.0800386467437249e+02   5.1060649609327561e+02   3.3072965348770452e+01   -1.8890280910774030e+02   -4.5641636860096941e+02   6.2910656221362889e+34
1.0000000000000001e+03   0.0000000000000000e+00   0.0000000000000000e+00   9.9583373190821374e+02   1.0000000000000001e+03   0.0000000000000000e+00   0.0000000000000000e+00   -9.9583373190821374e+02   1.8615702599009202e+02   4.3476438607561221e+01   -1.1250652436487655e+02   -6.6944152745510223e+01   5.9645857133538073e+02   7.3419071663987452e+01   -4.9202143924443749e+02   -3.0440494503091463e+02   7.3460192749809664e+02   3.4300667367703278e+02   5.5637575400188541e+02   3.1113893047281937e+02   4.8278247517643047e+02   -4.5990218394858141e+02   4.8152209607428439e+01   6.0210167303605409e+01   6.3525522233735912e+34
1.0000000000000001e+03   0.0000000000000000e+00   0.0000000000000000e+00   9.9583373190821374e+02   1.0000000000000001e+03   0.0000000000000000e+00   0.0000000000000000e+00   -9.9583373190821374e+02   5.5261195483049300e+02   3.5686456901292468e+02   1.3018203525810642e+02   -3.8138601141213275e+02   5.8898912884030358e+02   -4.0806481827951325e+02   3.8419810272554446e+02   1.3098899128041086e+02   3.1440975318018110e+02   -2.5292900611321798e+02   -1.2348057787819147e+02   6.3308432678988837e+01   5.4398916314902453e+02   3.0412925537980652e+02   -3.9089956010545944e+02   1.8708858745273290e+02   1.4051443857996820e+35
