1.0000000000000000e+03   0.0000000000000000e+00   0.0000000000000000e+00   1.0000000000000000e+03   1.0000000000000000e+03   0.0000000000000000e+00   0.0000000000000000e+00   -1.0000000000000000e+03   9.7176889988088851e+02   2.1180926026577833e+02   8.4940174225446265e+02   -3.8104513077954880e+02   1.0282311001191117e+03   -2.1180926026577836e+02   -8.4940174225446276e+02   3.8104513077954869e+02   6.5192876725600165e-04
1.0000000000000000e+03   0.0000000000000000e+00   0.0000000000000000e+00   1.0000000000000000e+03   1.0000000000000000e+03   0.0000000000000000e+00   0.0000000000000000e+00   -1.0000000000000000e+03   9.7176889988088863e+02   -5.3831597870866119e+02   -7.4621302241757803e+02   2.5480170017371447e+02   1.0282311001191115e+03   5.3831597870866131e+02   7.4621302241757826e+02   -2.5480170017371447e+02   6.6405114225901851e-04
1.0000000000000000e+03   0.0000000000000000e+00   0.0000000000000000e+00   1.0000000000000000e+03   1.0000000000000000e+03   0.0000000000000000e+00   0.0000000000000000e+00   -1.0000000000000000e+03   9.7176889988088681e+02   -4.5946442145000310e+02   5.3555962440596750e+02   -6.4312534415758046e+02   1.0282311001191135e+03   4.5946442145000287e+02   -5.3555962440596750e+02   6.4312534415758046e+02   5.9554412126854755e-04
1.0000000000000000e+03   0.0000000000000000e+00   0.0000000000000000e+00   1.0000000000000000e+03   1.0000000000000000e+03   0.0000000000000000e+00   0.0000000000000000e+00   -1.0000000000000000e+03   9.7176889988088885e+02   8.6124905218248159e+02   1.1548560228228310e+02   -3.9554395451116665e+02   1.0282311001191115e+03   -8.6124905218248159e+02   -1.1548560228228310e+02   3.9554395451116648e+02   6.5009038370143464e-04
1.0000000000000000e+03   0.0000000000000000e+00   0.0000000000000000e+00   1.0000000000000000e+03   1.0000000000000000e+03   0.0000000000000000e+00   0.0000000000000000e+00   -1.0000000000000000e+03   9.7176889988088885e+02   8.7021177949969785e+02   -3.8894381468572300e+02   -5.4736112464639731e+01   1.0282311001191115e+03   -8.7021177949969808e+02   3.8894381468572328e+02   5.4736112464640911e+01   6.7235590683027127e-04
1.0000000000000000e+03   0.0000000000000000e+00   0.0000000000000000e+00   1.0000000000000000e+03   1.0000000000000000e+03   0.0000000000000000e+00   0.0000000000000000e+00   -1.0000000000000000e+03   9.7176889988088897e+02   -3.5771558534268627e+02   8.4885207911093266e+02   -2.5106091285192451e+02   1.0282311001191113e+03   3.5771558534268627e+02   -8.4885207911093289e+02   2.5106091285192451e+02   6.6431757741623005e-04
1.0000000000000000e+03   0.0000000000000000e+00   0.0000000000000000e+00   1.0000000000000000e+03   1.0000000000000000e+03   0.0000000000000000e+00   0.0000000000000000e+00   -1.0000000000000000e+03   9.7176889988088885e+02   2.2430462911581304e+02   -9.2350607707188135e+02   9.1464928462102279e+01   1.0282311001191115e+03   -2.2430462911581284e+02   9.2350607707188135e+02   -9.1464928462102279e+01   6.7166830561363362e-04
1.0000000000000000e+03   0.0000000000000000e+00   0.0000000000000000e+00   1.0000000000000000e+03   1.0000000000000000e+03   0.0000000000000000e+00   0.0000000000000000e+00   -1.0000000000000000e+03   9.7176889988088874e+02   -2.5915894731590600e+02   8.9117551457708703e+02   -2.2401945543731583e+02   1.0282311001191115e+03   2.5915894731590595e+02   -8.9117551457708703e+02   2.2401945543731583e+02   6.6610452334188322e-04
1.0000000000000000e+03   0.0000000000000000e+00   0.0000000000000000e+00   1.0000000000000000e+03   1.0000000000000000e+03   0.0000000000000000e+00   0.0000000000000000e+00   -1.0000000000000000e+03   9.7176889988089067e+02   -3.5445376079327423e+02   -2.6974759281669077e+02   -8.4447654899302051e+02   1.0282311001191094e+03   3.5445376079327389e+02   2.6974759281669202e+02   8.4447654899301779e+02   4.7683611726075152e-04
1.0000000000000000e+03   0.0000000000000000e+00   0.0000000000000000e+00   1.0000000000000000e+03   1.0000000000000000e+03   0.0000000000000000e+00   0.0000000000000000e+00   -1.0000000000000000e+03   9.7176889988088828e+02   -3.0408429545529009e+02   3.9563306796060692e+02   8.1397118558557952e+02   1.0282311001191115e+03   3.0408429545529003e+02   -3.9563306796060704e+02   -8.1397118558557918e+02   5.0379967436631049e-04
1.0000000000000000e+03   0.0000000000000000e+00   0.0000000000000000e+00   1.0000000000000000e+03   1.0000000000000000e+03   0.0000000000000000e+00   0.0000000000000000e+00   -1.0000000000000000e+03   9.7176889988088885e+02   7.2313459347996996e+01   -5.7209732766954983e+02   -7.6093185334860414e+02   1.0282311001191115e+03   -7.2313459347996897e+01   5.7209732766954983e+02   7.6093185334860414e+02   5.4100422396931812e-04
1.0000000000000000e+03   0.0000000000000000e+00   0.0000000000000000e+00   1.0000000000000000e+03   1.0000000000000000e+03   0.0000000000000000e+00   0.0000000000000000e+00   -1.0000000000000000e+03   9.7176889988088817e+02   4.1710996503214335e+02   6.9211849618428971e+02   -5.0846154080769719e+02   1.0282311001191115e+03   -4.1710996503214290e+02   -6.9211849618428869e+02   5.0846154080769861e+02   6.3160775111188174e-04
1.0000000000000000e+03   0.0000000000000000e+00   0.0000000000000000e+00   1.0000000000000000e+03   1.0000000000000000e+03   0.0000000000000000e+00   0.0000000000000000e+00   -1.0000000000000000e+03   9.7176889988088851e+02   -7.5486955202524868e+01   -2.5011785731227582e+02   -9.1830531481518983e+02   1.0282311001191117e+03   7.5486955202524868e+01   2.5011785731227590e+02   9.1830531481518960e+02   3.8615801660243937e-04
1.0000000000000000e+03   0.0000000000000000e+00   0.0000000000000000e+00   1.0000000000000000e+03   1.0000000000000000e+03   0.0000000000000000e+00   0.0000000000000000e+00   -1.0000000000000000e+03   9.7176889988088817e+02   -1.3550460657040065e+02   9.4474537698008589e+02   -2.5229911672741828e+01   1.0282311001191119e+03   1.3550460657040253e+02   -9.4474537698008555e+02   2.5229911672741711e+01   6.7265617901925753e-04
1.0000000000000000e+03   0.0000000000000000e+00   0.0000000000000000e+00   1.0000000000000000e+03   1.0000000000000000e+03   0.0000000000000000e+00   0.0000000000000000e+00   -1.0000000000000000e+03   9.7176889988088908e+02   -8.5099572920726257e+02   -7.9671814474111983e+01   -4.2544158825796359e+02   1.0282311001191110e+03   8.5099572920726200e+02   7.9671814474112239e+01   4.2544158825796342e+02   6.4595372250089288e-04
1.0000000000000000e+03   0.0000000000000000e+00   0.0000000000000000e+00   1.0000000000000000e+03   1.0000000000000000e+03   0.0000000000000000e+00   0.0000000000000000e+00   -1.0000000000000000e+03   9.7176889988088874e+02   4.5123187952071834e+02   -7.8859037096642953e+02   2.9335454980839262e+02   1.0282311001191115e+03   -4.5123187952071839e+02   7.8859037096642987e+02   -2.9335454980839262e+02   6.6101791412438065e-04
1.0000000000000000e+03   0.0000000000000000e+00   0.0000000000000000e+00   1.0000000000000000e+03   1.0000000000000000e+03   0.0000000000000000e+00   0.0000000000000000e+00   -1.0000000000000000e+03   9.7176889988088806e+02   6.5403837220965556e+02   -5.0916802356769153e+02   4.7383921916993228e+02   1.0282311001191117e+03   -6.5403837220965579e+02   5.0916802356769153e+02   -4.7383921916993205e+02   6.3815391076991459e-04
1.0000000000000000e+03   0.0000000000000000e+00   0.0000000000000000e+00   1.0000000000000000e+03   1.0000000000000000e+03   0.0000000000000000e+00   0.0000000000000000e+00   -1.0000000000000000e+03   9.7176889988088681e+02   -3.7173787294047162e+02   6.5862685421467006e+02   5.8272076923603402e+02   1.0282311001191135e+03   3.7173787294046963e+02   -6.5862685421467279e+02   -5.8272076923603151e+02   6.1417433350434121e-04
1.0000000000000000e+03   0.0000000000000000e+00   0.0000000000000000e+00   1.0000000000000000e+03   1.0000000000000000e+03   0.0000000000000000e+00   0.0000000000000000e+00   -1.0000000000000000e+03   9.7176889988088885e+02   2.1527187111414003e+02   9.2969223264442758e+02   -2.9533849015875013e+01   1.0282311001191113e+03   -2.1527187111414003e+02   -9.2969223264442758e+02   2.9533849015875003e+01   6.7262623435458669e-04
1.0000000000000000e+03   0.0000000000000000e+00   0.0000000000000000e+00   1.0000000000000000e+03   1.0000000000000000e+03   0.0000000000000000e+00   0.0000000000000000e+00   -1.0000000000000000e+03   9.7176889988088976e+02   5.1566962974496539e+02   -8.0073077358475007e+02   -6.6760282826812954e+01   1.0282311001191101e+03   -5.1566962974496550e+02   8.0073077358474973e+02   6.6760282826811277e+01   6.7216942384405417e-04
1.0000000000000000e+03   0.0000000000000000e+00   0.0000000000000000e+00   1.0000000000000000e+03   1.0000000000000000e+03   0.0000000000000000e+00   0.0000000000000000e+00   -1.0000000000000000e+03   9.7176889988088908e+02   -2.2079735212146272e+02   9.0227883917735960e+02   2.2064292383614779e+02   1.0282311001191110e+03   2.2079735212146295e+02   -9.0227883917735949e+02   -2.2064292383614765e+02   6.6631090706276088e-04
1.0000000000000000e+03   0.0000000000000000e+00   0.0000000000000000e+00   1.0000000000000000e+03   1.0000000000000000e+03   0.0000000000000000e+00   0.0000000000000000e+00   -1.0000000000000000e+03   9.7176889988088885e+02   4.5467430686050164e+02   -8.1716438058267136e+02   -1.9249811416717259e+02   1.0282311001191115e+03   -4.5467430686050164e+02   8.1716438058267136e+02   1.9249811416717259e+02   6.6789217887283973e-04
1.0000000000000000e+03   0.0000000000000000e+00   0.0000000000000000e+00   1.0000000000000000e+03   1.0000000000000000e+03   0.0000000000000000e+00   0.0000000000000000e+00   -1.0000000000000000e+03   9.7176889988088885e+02   8.7059559409519500e+02   3.8576406923696220e+02   -6.9218990153220162e+01   1.0282311001191115e+03   -8.7059559409519500e+02   -3.8576406923696231e+02   6.9218990153219991e+01   6.7212668496941397e-04
1.0000000000000000e+03   0.0000000000000000e+00   0.0000000000000000e+00   1.0000000000000000e+03   1.0000000000000000e+03   0.0000000000000000e+00   0.0000000000000000e+00   -1.0000000000000000e+03   9.7176889988088851e+02   -3.3270216917538778e+02   -3.3358674588810771e+02   -8.3040413279549114e+02   1.0282311001191117e+03   3.3270216917538738e+02   3.3358674588810771e+02   8.3040413279549114e+02   4.8987188045884094e-04
1.0000000000000000e+03   0.0000000000000000e+00   0.0000000000000000e+00   1.0000000000000000e+03   1.0000000000000000e+03   0.0000000000000000e+00   0.0000000000000000e+00   -1.0000000000000000e+03   9.7176889988088828e+02   4.2851308856055732e+02   -8.4259048985995844e+02   1.3401370638820345e+02   1.0282311001191119e+03   -4.2851308856055721e+02   8.4259048985995867e+02   -1.3401370638820379e+02   6.7042498096973868e-04
1.0000000000000000e+03   0.0000000000000000e+00   0.0000000000000000e+00   1.0000000000000000e+03   1.0000000000000000e+03   0.0000000000000000e+00   0.0000000000000000e+00   -1.0000000000000000e+03   9.7176889988088874e+02   6.1551341289473044e+02   2.7464210620259524e+02   -6.7620767979766345e+02   1.0282311001191113e+03   -6.1551341289472998e+02   -2.7464210620259524e+02   6.7620767979766345e+02   5.8310036268770260e-04
1.0000000000000000e+03   0.0000000000000000e+00   0.0000000000000000e+00   1.0000000000000000e+03   1.0000000000000000e+03   0.0000000000000000e+00   0.0000000000000000e+00   -1.0000000000000000e+03   9.7176889988088647e+02   -8.3010322989102929e+02   -1.7786938244422410e+02   -4.3684434834783326e+02   1.0282311001191135e+03   8.3010322989103088e+02   1.7786938244422564e+02   4.3684434834783337e+02   6.4424511915740345e-04
1.0000000000000000e+03   0.0000000000000000e+00   0.0000000000000000e+00   1.0000000000000000e+03   1.0000000000000000e+03   0.0000000000000000e+00   0.0000000000000000e+00   -1.0000000000000000e+03   9.7176889988088681e+02   2.8680981126366407e+02   8.7581438898022361e+02   -2.4946174534014781e+02   1.0282311001191133e+03   -2.8680981126366680e+02   -8.7581438898022191e+02   2.4946174534015330e+02   6.6443002358719874e-04
1.0000000000000000e+03   0.0000000000000000e+00   0.0000000000000000e+00   1.0000000000000000e+03   1.0000000000000000e+03   0.0000000000000000e+00   0.0000000000000000e+00   -1.0000000000000000e+03   9.7176889988088851e+02   -1.9194038850330326e+01   -9.3526490481533415e+02   -1.9092674213800865e+02   1.0282311001191117e+03   1.9194038850330507e+01   9.3526490481533369e+02   1.9092674213800953e+02   6.6797329811497453e-04
1.0000000000000000e+03   0.0000000000000000e+00   0.0000000000000000e+00   1.0000000000000000e+03   1.0000000000000000e+03   0.0000000000000000e+00   0.0000000000000000e+00   -1.0000000000000000e+03   9.7176889988088919e+02   -4.3518905442500380e+02   5.8562042713854726e+02   -6.1579304672657088e+02   1.0282311001191106e+03   4.3518905442500960e+02   -5.8562042713854646e+02   6.1579304672656974e+02   6.0456011472134210e-04
1.0000000000000000e+03   0.0000000000000000e+00   0.0000000000000000e+00   1.0000000000000000e+03   1.0000000000000000e+03   0.0000000000000000e+00   0.0000000000000000e+00   -1.0000000000000000e+03   9.7176889988088885e+02   -7.8208995460185258e+02   5.4402727794783164e+02   -6.2541969345401242e+01   1.0282311001191115e+03   7.8208995460185258e+02   -5.4402727794783164e+02   6.2541969345401277e+01   6.7223909983516210e-04
1.0000000000000000e+03   0.0000000000000000e+00   0.0000000000000000e+00   1.0000000000000000e+03   1.0000000000000000e+03   0.0000000000000000e+00   0.0000000000000000e+00   -1.0000000000000000e+03   9.7176889988088908e+02   2.3818376021279633e+02   -9.1079553238929896e+02   1.5893982735816496e+02   1.0282311001191110e+03   -2.3818376021279556e+02   9.1079553238929861e+02   -1.5893982735816493e+02   6.6946568515344012e-04
1.0000000000000000e+03   0.0000000000000000e+00   0.0000000000000000e+00   1.0000000000000000e+03   1.0000000000000000e+03   0.0000000000000000e+00   0.0000000000000000e+00   -1.0000000000000000e+03   9.7176889988088897e+02   5.7168488567808367e+02   -4.1433248421884338e+02   6.4268721644228594e+02   1.0282311001191110e+03   -5.7168488567808379e+02   4.1433248421884326e+02   -6.4268721644228594e+02   5.9569711853342316e-04
1.0000000000000000e+03   0.0000000000000000e+00   0.0000000000000000e+00   1.0000000000000000e+03   1.0000000000000000e+03   0.0000000000000000e+00   0.0000000000000000e+00   -1.0000000000000000e+03   9.7176889988088863e+02   7.4969351066785759e+02   2.1802344575430865e+02   5.4951550599958262e+02   1.0282311001191115e+03   -7.4969351066785759e+02   -2.1802344575430874e+02   -5.4951550599958296e+02   6.2260767919935665e-04
1.0000000000000000e+03   0.0000000000000000e+00   0.0000000000000000e+00   1.0000000000000000e+03   1.0000000000000000e+03   0.0000000000000000e+00   0.0000000000000000e+00   -1.0000000000000000e+03   9.7176889988088885e+02   2.8199049828457487e+02   3.2775734259857120e+02   -8.5123343297828501e+02   1.0282311001191113e+03   -2.8199049828457487e+02   -3.2775734259857114e+02   8.5123343297828501e+02   4.7017674731334141e-04
1.0000000000000000e+03   0.0000000000000000e+00   0.0000000000000000e+00   1.0000000000000000e+03   1.0000000000000000e+03   0.0000000000000000e+00   0.0000000000000000e+00   -1.0000000000000000e+03   9.7176889988088874e+02   2.2846502714637967e+02   -9.2536392934909202e+02   5.5201483681756550e+01   1.0282311001191110e+03   -2.2846502714637978e+02   9.2536392934909236e+02   -5.5201483681757225e+01   6.7234938337986153e-04
1.0000000000000000e+03   0.0000000000000000e+00   0.0000000000000000e+00   1.0000000000000000e+03   1.0000000000000000e+03   0.0000000000000000e+00   0.0000000000000000e+00   -1.0000000000000000e+03   9.7176889988088885e+02   6.2920419000584059e+02   -1.3017391777219430e+02   7.0618603255869391e+02   1.0282311001191115e+03   -6.2920419000584036e+02   1.3017391777219410e+02   -7.0618603255869391e+02   5.7010562783393816e-04
1.0000000000000000e+03   0.0000000000000000e+00   0.0000000000000000e+00   1.0000000000000000e+03   1.0000000000000000e+03   0.0000000000000000e+00   0.0000000000000000e+00   -1.0000000000000000e+03   9.7176889988088885e+02   8.6384722895565324e+02   -1.9542658482385818e+02   3.5653651866222447e+02   1.0282311001191115e+03   -8.6384722895565324e+02   1.9542658482385818e+02   -3.5653651866222435e+02   6.5480572324176384e-04
1.0000000000000000e+03   0.0000000000000000e+00   0.0000000000000000e+00   1.0000000000000000e+03   1.0000000000000000e+03   0.0000000000000000e+00   0.0000000000000000e+00   -1.0000000000000000e+03   9.7176889988088885e+02   -8.0359961968499942e+02   -1.8518127854517709e+02   -4.8112100295929110e+02   1.0282311001191115e+03   8.0359961968499954e+02   1.8518127854517709e+02   4.8112100295929122e+02   6.3684904696678104e-04
1.0000000000000000e+03   0.0000000000000000e+00   0.0000000000000000e+00   1.0000000000000000e+03   1.0000000000000000e+03   0.0000000000000000e+00   0.0000000000000000e+00   -1.0000000000000000e+03   9.7176889988088885e+02   -6.1877910228728194e+02   -6.0345985869062383e+02   -4.0557427888328067e+02   1.0282311001191110e+03   6.1877910228728149e+02   6.0345985869062417e+02   4.0557427888328101e+02   6.4875595478885767e-04
1.0000000000000000e+03   0.0000000000000000e+00   0.0000000000000000e+00   1.0000000000000000e+03   1.0000000000000000e+03   0.0000000000000000e+00   0.0000000000000000e+00   -1.0000000000000000e+03   9.7176889988088885e+02   8.2937095368654411e+02   -2.1132802110728878e+02   -4.2311483411245001e+02   1.0282311001191115e+03   -8.2937095368654411e+02   2.1132802110728869e+02   4.2311483411245007e+02   6.4629319383066825e-04
1.0000000000000000e+03   0.0000000000000000e+00   0.0000000000000000e+00   1.0000000000000000e+03   1.0000000000000000e+03   0.0000000000000000e+00   0.0000000000000000e+00   -1.0000000000000000e+03   9.7176889988088851e+02   6.0373511166610479e+02   -6.5778439226638352e+02   3.3817965994766070e+02   1.0282311001191110e+03   -6.0373511166610467e+02   6.5778439226638386e+02   -3.3817965994766070e+02   6.5678190434063325e-04
1.0000000000000000e+03   0.0000000000000000e+00   0.0000000000000000e+00   1.0000000000000000e+03   1.0000000000000000e+03   0.0000000000000000e+00   0.0000000000000000e+00   -1.0000000000000000e+03   9.7176889988088908e+02   4.2134389113793520e+02   -2.6652514882847694e+01   8.5632986811229421e+02   1.0282311001191108e+03   -4.2134389113793520e+02   2.6652514882847683e+01   -8.5632986811229409e+02   4.6497000376811612e-04
1.0000000000000000e+03   0.0000000000000000e+00   0.0000000000000000e+00   1.0000000000000000e+03   1.0000000000000000e+03   0.0000000000000000e+00   0.0000000000000000e+00   -1.0000000000000000e+03   9.7176889988088885e+02   4.7292279139406918e+02   -5.4257224047250543e+02   -6.2729679691414344e+02   1.0282311001191115e+03   -4.7292279139406918e+02   5.4257224047250543e+02   6.2729679691414367e+02   6.0089279357591506e-04
1.0000000000000000e+03   0.0000000000000000e+00   0.0000000000000000e+00   1.0000000000000000e+03   1.0000000000000000e+03   0.0000000000000000e+00   0.0000000000000000e+00   -1.0000000000000000e+03   9.7176889988088988e+02   3.6339432509008151e+02   1.2069044638254579e+02   8.7459719575034228e+02   1.0282311001191101e+03   -3.6339432509008179e+02   -1.2069044638254488e+02   -8.7459719575034217e+02   4.4489923856010229e-04
1.0000000000000000e+03   0.0000000000000000e+00   0.0000000000000000e+00   1.0000000000000000e+03   1.0000000000000000e+03   0.0000000000000000e+00   0.0000000000000000e+00   -1.0000000000000000e+03   9.7176889988088828e+02   -9.1615776806622796e+02   -1.1556260108729015e+02   2.4257391329634396e+02   1.0282311001191119e+03   9.1615776806622694e+02   1.1556260108729215e+02   -2.4257391329634734e+02   6.6490448536579380e-04
1.0000000000000000e+03   0.0000000000000000e+00   0.0000000000000000e+00   1.0000000000000000e+03   1.0000000000000000e+03   0.0000000000000000e+00   0.0000000000000000e+00   -1.0000000000000000e+03   9.7176889988088885e+02   4.5164917034839519e+01   -2.6780897098668994e+01   9.5330204446958146e+02   1.0282311001191115e+03   -4.5164917034837828e+01   2.6780897098669556e+01   -9.5330204446958112e+02   3.2534580962670758e-04
1.0000000000000000e+03   0.0000000000000000e+00   0.0000000000000000e+00   1.0000000000000000e+03   1.0000000000000000e+03   0.0000000000000000e+00   0.0000000000000000e+00   -1.0000000000000000e+03   9.7176889988088863e+02   2.1642595122924783e+02   9.1967693355533982e+02   -1.3746279384189154e+02   1.0282311001191115e+03   -2.1642595122924774e+02   -9.1967693355533982e+02   1.3746279384189148e+02   6.7030260331148693e-04
1.0000000000000000e+03   0.0000000000000000e+00   0.0000000000000000e+00   1.0000000000000000e+03   1.0000000000000000e+03   0.0000000000000000e+00   0.0000000000000000e+00   -1.0000000000000000e+03   9.7176889988088885e+02   2.6356702942047161e+02   -5.8898630645537980e+02   7.0368275947373752e+02   1.0282311001191115e+03   -2.6356702942047161e+02   5.8898630645537992e+02   -7.0368275947373752e+02   5.7126102394066650e-04
1.0000000000000000e+03   0.0000000000000000e+00   0.0000000000000000e+00   1.0000000000000000e+03   1.0000000000000000e+03   0.0000000000000000e+00   0.0000000000000000e+00   -1.0000000000000000e+03   9.7176889988088874e+02   -5.6740822283606121e+02   -4.0709425986041538e+02   -6.5104842094638309e+02   1.0282311001191115e+03   5.6740822283606121e+02   4.0709425986041538e+02   6.5104842094638354e+02   5.9272657362663720e-04
1.0000000000000000e+03   0.0000000000000000e+00   0.0000000000000000e+00   1.0000000000000000e+03   1.0000000000000000e+03   0.0000000000000000e+00   0.0000000000000000e+00   -1.0000000000000000e+03   9.7176889988088863e+02   5.4573857851547950e+02   -4.4947955369665124e+02   -6.4162248160317688e+02   1.0282311001191117e+03   -5.4573857851547984e+02   4.4947955369665095e+02   6.4162248160317688e+02   5.9606772651437040e-04
1.0000000000000000e+03   0.0000000000000000e+00   0.0000000000000000e+00   1.0000000000000000e+03   1.0000000000000000e+03   0.0000000000000000e+00   0.0000000000000000e+00   -1.0000000000000000e+03   9.7176889988088885e+02   4.0453724252543600e+02   2.1744462140256296e+01   8.6453378878225499e+02   1.0282311001191115e+03   -4.0453724252543731e+02   -2.1744462140257866e+01   -8.6453378878225499e+02   4.5623824846856401e-04
1.0000000000000000e+03   0.0000000000000000e+00   0.0000000000000000e+00   1.0000000000000000e+03   1.0000000000000000e+03   0.0000000000000000e+00   0.0000000000000000e+00   -1.0000000000000000e+03   9.7176889988088885e+02   -2.0321882859142551e+02   -1.0570556174186187e+02   -9.2686046203990304e+02   1.0282311001191115e+03   2.0321882859142602e+02   1.0570556174186183e+02   9.2686046203990293e+02   3.7254801306723609e-04
1.0000000000000000e+03   0.0000000000000000e+00   0.0000000000000000e+00   1.0000000000000000e+03   1.0000000000000000e+03   0.0000000000000000e+00   0.0000000000000000e+00   -1.0000000000000000e+03   9.7176889988088874e+02   4.7546570449298622e+02   5.3353687388117328e+02   -6.3309765615594335e+02   1.0282311001191110e+03   -4.7546570449298622e+02   -5.3353687388117316e+02   6.3309765615594335e+02   5.9897456005138347e-04
1.0000000000000000e+03   0.0000000000000000e+00   0.0000000000000000e+00   1.0000000000000000e+03   1.0000000000000000e+03   0.0000000000000000e+00   0.0000000000000000e+00   -1.0000000000000000e+03   9.7176889988088999e+02   9.3318553512378742e+02   5.8963875624908432e+01   -1.9295049255463752e+02   1.0282311001191099e+03   -9.3318553512378980e+02   -5.8963875624906528e+01   1.9295049255463508e+02   6.6786868752866687e-04
1.0000000000000000e+03   0.0000000000000000e+00   0.0000000000000000e+00   1.0000000000000000e+03   1.0000000000000000e+03   0.0000000000000000e+00   0.0000000000000000e+00   -1.0000000000000000e+03   9.7176889988088874e+02   -8.2622288585712795e+02   -2.8398178318297647e+02   3.8503501642862477e+02   1.0282311001191110e+03   8.2622288585712795e+02   2.8398178318297664e+02   -3.8503501642862494e+02   6.5143329840453620e-04
1.0000000000000000e+03   0.0000000000000000e+00   0.0000000000000000e+00   1.0000000000000000e+03   1.0000000000000000e+03   0.0000000000000000e+00   0.0000000000000000e+00   -1.0000000000000000e+03   9.7176889988088885e+02   -4.7731923413468229e+02   3.9401879698467945e+02   -7.2695076210007687e+02   1.0282311001191113e+03   4.7731923413468195e+02   -3.9401879698467917e+02   7.2695076210007699e+02   5.5997375305930162e-04
1.0000000000000000e+03   0.0000000000000000e+00   0.0000000000000000e+00   1.0000000000000000e+03   1.0000000000000000e+03   0.0000000000000000e+00   0.0000000000000000e+00   -1.0000000000000000e+03   9.7176889988088840e+02   -7.4674247380826091e+02   7.3312347798277798e+01   5.9037517871356908e+02   1.0282311001191113e+03   7.4674247380826125e+02   -7.3312347798277727e+01   -5.9037517871356920e+02   6.1206426563651566e-04
1.0000000000000000e+03   0.0000000000000000e+00   0.0000000000000000e+00   1.0000000000000000e+03   1.0000000000000000e+03   0.0000000000000000e+00   0.0000000000000000e+00   -1.0000000000000000e+03   9.7176889988088828e+02   6.8551954780834080e+02   -6.5971328220646876e+02   7.9894987471504834e+01   1.0282311001191115e+03   -6.8551954780834080e+02   6.5971328220646910e+02   -7.9894987471504862e+01   6.7192286848796062e-04
1.0000000000000000e+03   0.0000000000000000e+00   0.0000000000000000e+00   1.0000000000000000e+03   1.0000000000000000e+03   0.0000000000000000e+00   0.0000000000000000e+00   -1.0000000000000000e+03   9.7176889988088885e+02   -2.7160724637783574e+02   -4.7006188350178712e+02   7.8537456259027067e+02   1.0282311001191115e+03   2.7160724637783574e+02   4.7006188350178667e+02   -7.8537456259027090e+02   5.2517135413630562e-04
1.0000000000000000e+03   0.0000000000000000e+00   0.0000000000000000e+00   1.0000000000000000e+03   1.0000000000000000e+03   0.0000000000000000e+00   0.0000000000000000e+00   -1.0000000000000000e+03   9.7176889988088885e+02   -8.1430235241928575e+00   -8.1860609876300555e+02   -4.9128364557142913e+02   1.0282311001191115e+03   8.1430235241929108e+00   8.1860609876300566e+02   4.9128364557142828e+02   6.3496540550507139e-04
1.0000000000000000e+03   0.0000000000000000e+00   0.0000000000000000e+00   1.0000000000000000e+03   1.0000000000000000e+03   0.0000000000000000e+00   0.0000000000000000e+00   -1.0000000000000000e+03   9.7176889988088806e+02   2.5400199677825665e+02   8.3861707455701378e+02   3.7913884272671390e+02   1.0282311001191119e+03   -2.5400199677825671e+02   -8.3861707455701355e+02   -3.7913884272671390e+02   6.5216274667901362e-04
1.0000000000000000e+03   0.0000000000000000e+00   0.0000000000000000e+00   1.0000000000000000e+03   1.0000000000000000e+03   0.0000000000000000e+00   0.0000000000000000e+00   -1.0000000000000000e+03   9.7176889988088851e+02   2.8965356297561874e+02   9.0973074767796356e+02   5.7143989079580804e+00   1.0282311001191117e+03   -2.8965356297561874e+02   -9.0973074767796368e+02   -5.7143989079583406e+00   6.7273284987782751e-04
1.0000000000000000e+03   0.0000000000000000e+00   0.0000000000000000e+00   1.0000000000000000e+03   1.0000000000000000e+03   0.0000000000000000e+00   0.0000000000000000e+00   -1.0000000000000000e+03   9.7176889988088828e+02   -2.2265061799825911e+01   3.2806192133720992e+02   -8.9633783639967100e+02   1.0282311001191115e+03   2.2265061799825798e+01   -3.2806192133721004e+02   8.9633783639967123e+02   4.1777249540074583e-04
1.0000000000000000e+03   0.0000000000000000e+00   0.0000000000000000e+00   1.0000000000000000e+03   1.0000000000000000e+03   0.0000000000000000e+00   0.0000000000000000e+00   -1.0000000000000000e+03   9.7176889988089033e+02   -2.7770443099099316e+02   -8.9275721717160400e+02   1.9340805145092168e+02   1.0282311001191097e+03   2.7770443099099020e+02   8.9275721717160923e+02   -1.9340805145092475e+02   6.6784486425891521e-04
1.0000000000000000e+03   0.0000000000000000e+00   0.0000000000000000e+00   1.0000000000000000e+03   1.0000000000000000e+03   0.0000000000000000e+00   0.0000000000000000e+00   -1.0000000000000000e+03   9.7176889988088885e+02   -8.9351095368341714e+02   -2.6987325985537211e+02   -2.0086929440021925e+02   1.0282311001191113e+03   8.9351095368341691e+02   2.6987325985537200e+02   2.0086929440021896e+02   6.6744741475399270e-04
1.0000000000000000e+03   0.0000000000000000e+00   0.0000000000000000e+00   1.0000000000000000e+03   1.0000000000000000e+03   0.0000000000000000e+00   0.0000000000000000e+00   -1.0000000000000000e+03   9.7176889988088885e+02   -8.4629125835663683e+02   -3.7239446139024307e+02   -2.3802383352302058e+02   1.0282311001191115e+03   8.4629125835668538e+02   3.7239446139023573e+02   2.3802383352301956e+02   6.6520921986793413e-04
1.0000000000000000e+03   0.0000000000000000e+00   0.0000000000000000e+00   1.0000000000000000e+03   1.0000000000000000e+03   0.0000000000000000e+00   0.0000000000000000e+00   -1.0000000000000000e+03   9.7176889988088897e+02   2.3825868269877276e+02   9.1654495246578324e+02   1.2132610765286397e+02   1.0282311001191108e+03   -2.3825868269877412e+02   -9.1654495246578301e+02   -1.2132610765286380e+02   6.7084697247285084e-04
1.0000000000000000e+03   0.0000000000000000e+00   0.0000000000000000e+00   1.0000000000000000e+03   1.0000000000000000e+03   0.0000000000000000e+00   0.0000000000000000e+00   -1.0000000000000000e+03   9.7176889988088874e+02   6.0771899860485132e+02   -6.1934478866271843e+02   -3.9828573369015544e+02   1.0282311001191110e+03   -6.0771899860485132e+02   6.1934478866271854e+02   3.9828573369015538e+02   6.4973080505651066e-04
1.0000000000000000e+03   0.0000000000000000e+00   0.0000000000000000e+00   1.0000000000000000e+03   1.0000000000000000e+03   0.0000000000000000e+00   0.0000000000000000e+00   -1.0000000000000000e+03   9.7176889988088874e+02   9.0027556885126978e+02   -3.1786970168163089e+02   -2.1510584392986933e+00   1.0282311001191110e+03   -9.0027556885126978e+02   3.1786970168163089e+02   2.1510584392986933e+00   6.7273640645357062e-04
1.0000000000000000e+03   0.0000000000000000e+00   0.0000000000000000e+00   1.0000000000000000e+03   1.0000000000000000e+03   0.0000000000000000e+00   0.0000000000000000e+00   -1.0000000000000000e+03   9.7176889988088885e+02   -5.1354776813007061e+02   -1.2563729365863830e+02   7.9500052481794785e+02   1.0282311001191115e+03   5.1354776813007049e+02   1.2563729365863838e+02   -7.9500052481794773e+02   5.1834891778217802e-04
1.0000000000000000e+03   0.0000000000000000e+00   0.0000000000000000e+00   1.0000000000000000e+03   1.0000000000000000e+03   0.0000000000000000e+00   0.0000000000000000e+00   -1.0000000000000000e+03   9.7176889988088885e+02   -7.1895599852354394e+02   -3.5895100214282274e+02   5.1555632516509161e+02   1.0282311001191115e+03   7.1895599852354394e+02   3.5895100214282274e+02   -5.1555632516509172e+02   6.3015414235878119e-04
1.0000000000000000e+03   0.0000000000000000e+00   0.0000000000000000e+00   1.0000000000000000e+03   1.0000000000000000e+03   0.0000000000000000e+00   0.0000000000000000e+00   -1.0000000000000000e+03   9.7176889988088885e+02   -4.0867732826930506e+02   5.8410953713576077e+02   6.3509114633709567e+02   1.0282311001191115e+03   4.0867732826930506e+02   -5.8410953713576066e+02   -6.3509114633709578e+02   5.9830430668510008e-04
1.0000000000000000e+03   0.0000000000000000e+00   0.0000000000000000e+00   1.0000000000000000e+03   1.0000000000000000e+03   0.0000000000000000e+00   0.0000000000000000e+00   -1.0000000000000000e+03   9.7176889988088885e+02   -7.3056650596035377e+02   3.9915851132674817e+02   4.6742586297117873e+02   1.0282311001191115e+03   7.3056650596035388e+02   -3.9915851132674817e+02   -4.6742586297117879e+02   6.3927314726569312e-04
1.0000000000000000e+03   0.0000000000000000e+00   0.0000000000000000e+00   1.0000000000000000e+03   1.0000000000000000e+03   0.0000000000000000e+00   0.0000000000000000e+00   -1.0000000000000000e+03   9.7176889988088874e+02   -9.2198696831184327e+02   -1.0782929730219067e+02   2.2328176610844795e+02   1.0282311001191115e+03   9.2198696831184327e+02   1.0782929730219048e+02   -2.2328176610844807e+02   6.6614992435689256e-04
1.0000000000000000e+03   0.0000000000000000e+00   0.0000000000000000e+00   1.0000000000000000e+03   1.0000000000000000e+03   0.0000000000000000e+00   0.0000000000000000e+00   -1.0000000000000000e+03   9.7176889988088737e+02   -5.9994822944929297e+02   -2.0251567367048133e+02   7.1455678435552420e+02   1.0282311001191124e+03   5.9994822944929308e+02   2.0251567367048185e+02   -7.1455678435552477e+02   5.6614154488315491e-04
1.0000000000000000e+03   0.0000000000000000e+00   0.0000000000000000e+00   1.0000000000000000e+03   1.0000000000000000e+03   0.0000000000000000e+00   0.0000000000000000e+00   -1.0000000000000000e+03   9.7176889988088885e+02   -6.0558120872354186e+02   -3.2212355377226589e+02   6.6411572027479997e+02   1.0282311001191113e+03   6.0558120872354186e+02   3.2212355377226584e+02   -6.6411572027479997e+02   5.8786097557378793e-04
1.0000000000000000e+03   0.0000000000000000e+00   0.0000000000000000e+00   1.0000000000000000e+03   1.0000000000000000e+03   0.0000000000000000e+00   0.0000000000000000e+00   -1.0000000000000000e+03   9.7176889988088874e+02   6.2707713584194487e+01   -9.4769507933392924e+02   9.7384051226859711e+01   1.0282311001191110e+03   -6.2707713584194572e+01   9.4769507933392947e+02   -9.7384051226859881e+01   6.7152442412385968e-04
1.0000000000000000e+03   0.0000000000000000e+00   0.0000000000000000e+00   1.0000000000000000e+03   1.0000000000000000e+03   0.0000000000000000e+00   0.0000000000000000e+00   -1.0000000000000000e+03   9.7176889988088908e+02   2.0620950090288861e+01   2.1267198569696231e+02   9.3053064274484836e+02   1.0282311001191110e+03   -2.0620950090288936e+01   -2.1267198569696291e+02   -9.3053064274484836e+02   3.6646920994569523e-04
1.0000000000000000e+03   0.0000000000000000e+00   0.0000000000000000e+00   1.0000000000000000e+03   1.0000000000000000e+03   0.0000000000000000e+00   0.0000000000000000e+00   -1.0000000000000000e+03   9.7176889988088897e+02   -4.1687654400569693e+02   4.4413032190473893e+02   7.3518982473420795e+02   1.0282311001191110e+03   4.1687654400569670e+02   -4.4413032190473893e+02   -7.3518982473420783e+02   5.5566398108875632e-04
1.0000000000000000e+03   0.0000000000000000e+00   0.0000000000000000e+00   1.0000000000000000e+03   1.0000000000000000e+03   0.0000000000000000e+00   0.0000000000000000e+00   -1.0000000000000000e+03   9.7176889988088863e+02   2.9477987392173219e+02   -8.5574500835731874e+02   -3.0388678940071753e+02   1.0282311001191117e+03   -2.9477987392173236e+02   8.5574500835731862e+02   3.0388678940071748e+02   6.6009412579558517e-04
1.0000000000000000e+03   0.0000000000000000e+00   0.0000000000000000e+00   1.0000000000000000e+03   1.0000000000000000e+03   0.0000000000000000e+00   0.0000000000000000e+00   -1.0000000000000000e+03   9.7176889988088885e+02   2.3335495385584910e+01   6.3355001783005086e+01   -9.5235679898567480e+02   1.0282311001191115e+03   -2.3335495385584956e+01   -6.3355001783005058e+01   9.5235679898567480e+02   3.2717264882768427e-04
1.0000000000000000e+03   0.0000000000000000e+00   0.0000000000000000e+00   1.0000000000000000e+03   1.0000000000000000e+03   0.0000000000000000e+00   0.0000000000000000e+00   -1.0000000000000000e+03   9.7176889988088885e+02   3.4011679875141056e+02   -8.8157701681308140e+02   1.3669089510313771e+02   1.0282311001191113e+03   -3.4011679875141050e+02   8.8157701681308129e+02   -1.3669089510313782e+02   6.7033027742550077e-04
1.0000000000000000e+03   0.0000000000000000e+00   0.0000000000000000e+00   1.0000000000000000e+03   1.0000000000000000e+03   0.0000000000000000e+00   0.0000000000000000e+00   -1.0000000000000000e+03   9.7176889988088885e+02   -1.1840770886400075e+02   -2.0320265311055755e+02   -9.2532706132505643e+02   1.0282311001191115e+03   1.1840770886400095e+02   2.0320265311055761e+02   9.2532706132505643e+02   3.7504445316732896e-04
1.0000000000000000e+03   0.0000000000000000e+00   0.0000000000000000e+00   1.0000000000000000e+03   1.0000000000000000e+03   0.0000000000000000e+00   0.0000000000000000e+00   -1.0000000000000000e+03   9.7176889988088885e+02   -9.0750888783043456e+02   2.9445791606354430e+02   -3.5553176318553824e+01   1.0282311001191115e+03   9.0750888783043456e+02   -2.9445791606354436e+02   3.5553176318553781e+01   6.7257643543059808e-04
1.0000000000000000e+03   0.0000000000000000e+00   0.0000000000000000e+00   1.0000000000000000e+03   1.0000000000000000e+03   0.0000000000000000e+00   0.0000000000000000e+00   -1.0000000000000000e+03   9.7176889988088817e+02   8.0278981386298014e+01   9.4837740936390446e+02   -7.5348846877990056e+01   1.0282311001191119e+03   -8.0278981386298113e+01   -9.4837740936390446e+02   7.5348846877990056e+01   6.7201329117180569e-04
1.0000000000000000e+03   0.0000000000000000e+00   0.0000000000000000e+00   1.0000000000000000e+03   1.0000000000000000e+03   0.0000000000000000e+00   0.0000000000000000e+00   -1.0000000000000000e+03   9.7176889988088783e+02   -8.6839246879338066e+02   -2.6659880124122242e+02   -2.9387322690189933e+02   1.0282311001191122e+03   8.6839246879338111e+02   2.6659880124122265e+02   2.9387322690189933e+02   6.6097340842875938e-04
1.0000000000000000e+03   0.0000000000000000e+00   0.0000000000000000e+00   1.0000000000000000e+03   1.0000000000000000e+03   0.0000000000000000e+00   0.0000000000000000e+00   -1.0000000000000000e+03   9.7176889988088919e+02   7.6959137051493394e+02   -2.4020035505662787e+02   -5.1144382490129851e+02   1.0282311001191110e+03   -7.6959137051493394e+02   2.4020035505662781e+02   5.1144382490129874e+02   6.3100162512715453e-04
1.0000000000000000e+03   0.0000000000000000e+00   0.0000000000000000e+00   1.0000000000000000e+03   1.0000000000000000e+03   0.0000000000000000e+00   0.0000000000000000e+00   -1.0000000000000000e+03   9.7176889988088885e+02   -5.9123216158266143e+02   -2.4770456389001416e+02   -7.0755130860483052e+02   1.0282311001191115e+03   5.9123216158266132e+02   2.4770456389001399e+02   7.0755130860483052e+02   5.6946973034331454e-04
1.0000000000000000e+03   0.0000000000000000e+00   0.0000000000000000e+00   1.0000000000000000e+03   1.0000000000000000e+03   0.0000000000000000e+00   0.0000000000000000e+00   -1.0000000000000000e+03   9.7176889988088885e+02   1.8377076094322732e+02   7.7065606216896845e+02   5.3278458633355956e+02   1.0282311001191115e+03   -1.8377076094322737e+02   -7.7065606216896845e+02   -5.3278458633355956e+02   6.2645176870126495e-04
1.0000000000000000e+03   0.0000000000000000e+00   0.0000000000000000e+00   1.0000000000000000e+03   1.0000000000000000e+03   0.0000000000000000e+00   0.0000000000000000e+00   -1.0000000000000000e+03   9.7176889988088885e+02   -4.1219481376099674e+02   3.1304978047379882e+02   8.0226999484207238e+02   1.0282311001191115e+03   4.1219481376099708e+02   -3.1304978047379831e+02   -8.0226999484207249e+02   5.1295402158582030e-04
1.0000000000000000e+03   0.0000000000000000e+00   0.0000000000000000e+00   1.0000000000000000e+03   1.0000000000000000e+03   0.0000000000000000e+00   0.0000000000000000e+00   -1.0000000000000000e+03   9.7176889988087487e+02   -1.1194657852147114e+02   1.7189343794509674e+02   9.3244972181820208e+02   1.0282311001191254e+03   1.1194657852147151e+02   -1.7189343794509446e+02   -9.3244972181819867e+02   3.6323175724708681e-04
1.0000000000000000e+03   0.0000000000000000e+00   0.0000000000000000e+00   1.0000000000000000e+03   1.0000000000000000e+03   0.0000000000000000e+00   0.0000000000000000e+00   -1.0000000000000000e+03   9.7176889988088897e+02   7.1321866282084477e+02   4.6407349503869074e+02   4.3300901188852515e+02   1.0282311001191113e+03   -7.1321866282084477e+02   -4.6407349503869074e+02   -4.3300901188852515e+02   6.4482824457429253e-04
1.0000000000000000e+03   0.0000000000000000e+00   0.0000000000000000e+00   1.0000000000000000e+03   1.0000000000000000e+03   0.0000000000000000e+00   0.0000000000000000e+00   -1.0000000000000000e+03   9.7176889988088919e+02   -4.0835961737655998e+02   -4.9163008312197206e+02   7.0928425785125796e+02   1.0282311001191110e+03   4.0835961737656010e+02   4.9163008312197348e+02   -7.0928425785126046e+02   5.6865667191380613e-04
1.0000000000000000e+03   0.0000000000000000e+00   0.0000000000000000e+00   1.0000000000000000e+03   1.0000000000000000e+03   0.0000000000000000e+00   0.0000000000000000e+00   -1.0000000000000000e+03   9.7176889988088828e+02   -2.8573637939816814e+02   6.9425039622205327e+02   -5.8984148972753883e+02   1.0282311001191115e+03   2.8573637939816570e+02   -6.9425039622205077e+02   5.8984148972753792e+02   6.1221353760436718e-04
1.0000000000000000e+03   0.0000000000000000e+00   0.0000000000000000e+00   1.0000000000000000e+03   1.0000000000000000e+03   0.0000000000000000e+00   0.0000000000000000e+00   -1.0000000000000000e+03   9.7176889988088874e+02   6.3525150229886140e+02   2.0051506370644378e+02   6.8395256577038754e+02   1.0282311001191110e+03   -6.3525150229886140e+02   -2.0051506370644378e+02   -6.8395256577038742e+02   5.7991233835367551e-04
1.0000000000000000e+03   0.0000000000000000e+00   0.0000000000000000e+00   1.0000000000000000e+03   1.0000000000000000e+03   0.0000000000000000e+00   0.0000000000000000e+00   -1.0000000000000000e+03   9.7176889988088874e+02   -3.6758172550714869e+02   8.7729696410028509e+02   8.2313947929047288e+01   1.0282311001191113e+03   3.6758172550714858e+02   -8.7729696410028521e+02   -8.2313947929047075e+01   6.7187255258902034e-04
1.0000000000000000e+03   0.0000000000000000e+00   0.0000000000000000e+00   1.0000000000000000e+03   1.0000000000000000e+03   0.0000000000000000e+00   0.0000000000000000e+00   -1.0000000000000000e+03   9.7176889988089044e+02   -7.5979640079761180e+02   5.7811082783541610e+02   -6.2589331761867788e+00   1.0282311001191099e+03   7.5979640079761020e+02   -5.7811082783541508e+02   6.2589331761873588e+00   6.7273202250174276e-04
1.0000000000000000e+03   0.0000000000000000e+00   0.0000000000000000e+00   1.0000000000000000e+03   1.0000000000000000e+03   0.0000000000000000e+00   0.0000000000000000e+00   -1.0000000000000000e+03   9.7176889988088885e+02   -3.2449766849367234e+02   3.8672338408123693e+02   -8.1036298133428045e+02   1.0282311001191115e+03   3.2449766849367234e+02   -3.8672338408123687e+02   8.1036298133428045e+02   5.0668682151952765e-04
1.0000000000000000e+03   0.0000000000000000e+00   0.0000000000000000e+00   1.0000000000000000e+03   1.0000000000000000e+03   0.0000000000000000e+00   0.0000000000000000e+00   -1.0000000000000000e+03   9.7176889988088942e+02   -3.1375629221486400e+02   -5.8116318976454556e+02   -6.8945500950267547e+02   1.0282311001191106e+03   3.1375629221486389e+02   5.8116318976454556e+02   6.8945500950267524e+02   5.7757815447323827e-04
