1.0000000000000000e+03   0.0000000000000000e+00   0.0000000000000000e+00   9.9999842113425359e+02   1.0000000000000000e+03   0.0000000000000000e+00   0.0000000000000000e+00   -9.9999842113425359e+02   9.9999999999999955e+02   2.0336783326997789e+02   8.1554976246684794e+02   -3.6585899279131991e+02   1.0000000000000000e+03   -2.0336783326997792e+02   -8.1554976246684805e+02   3.6585899279131979e+02   4.7248838345909400e-06
1.0000000000000000e+03   0.0000000000000000e+00   0.0000000000000000e+00   9.9999842113425359e+02   1.0000000000000000e+03   0.0000000000000000e+00   0.0000000000000000e+00   -9.9999842113425359e+02   1.0000000000000000e+03   -5.1686198264994323e+02   -7.1647351648592337e+02   2.4464685638773796e+02   1.0000000000000003e+03   5.1686198264994334e+02   7.1647351648592348e+02   -2.4464685638773796e+02   1.9181839053191011e-06
1.0000000000000000e+03   0.0000000000000000e+00   0.0000000000000000e+00   9.9999842113425359e+02   1.0000000000000000e+03   0.0000000000000000e+00   0.0000000000000000e+00   -9.9999842113425359e+02   9.9999999999999829e+02   -4.4115296818317677e+02   5.1421547984095446e+02   -6.1749428518006914e+02   1.0000000000000019e+03   4.4115296818317654e+02   -5.1421547984095446e+02   6.1749428518006914e+02   2.0502511642893002e-05
1.0000000000000000e+03   0.0000000000000000e+00   0.0000000000000000e+00   9.9999842113425359e+02   1.0000000000000000e+03   0.0000000000000000e+00   0.0000000000000000e+00   -9.9999842113425359e+02   1.0000000000000001e+03   8.2692491078244041e+02   1.1088304959167519e+02   -3.7977998172052253e+02   1.0000000000000001e+03   -8.2692491078244041e+02   -1.1088304959167519e+02   3.7977998172052236e+02   5.1654347725990938e-06
1.0000000000000000e+03   0.0000000000000000e+00   0.0000000000000000e+00   9.9999842113425359e+02   1.0000000000000000e+03   0.0000000000000000e+00   0.0000000000000000e+00   -9.9999842113425359e+02   1.0000000000000011e+03   8.3553043838026588e+02   -3.7344288326743788e+02   -5.2554664416408130e+01   1.0000000000000011e+03   -8.3553043838026611e+02   3.7344288326743816e+02   5.2554664416409267e+01   8.6645664756616487e-08
1.0000000000000000e+03   0.0000000000000000e+00   0.0000000000000000e+00   9.9999842113425359e+02   1.0000000000000000e+03   0.0000000000000000e+00   0.0000000000000000e+00   -9.9999842113425359e+02   1.0000000000000003e+03   -3.4345922093661056e+02   8.1502200554825185e+02   -2.4105515406366757e+02   1.0000000000000000e+03   3.4345922093661056e+02   -8.1502200554825208e+02   2.4105515406366757e+02   1.8583219352494820e-06
1.0000000000000000e+03   0.0000000000000000e+00   0.0000000000000000e+00   9.9999842113425359e+02   1.0000000000000000e+03   0.0000000000000000e+00   0.0000000000000000e+00   -9.9999842113425359e+02   1.0000000000000001e+03   2.1536521282624520e+02   -8.8670074986381587e+02   8.7819693521381950e+01   1.0000000000000001e+03   -2.1536521282624503e+02   8.8670074986381587e+02   -8.7819693521381950e+01   2.3566517122098764e-07
1.0000000000000000e+03   0.0000000000000000e+00   0.0000000000000000e+00   9.9999842113425359e+02   1.0000000000000000e+03   0.0000000000000000e+00   0.0000000000000000e+00   -9.9999842113425359e+02   1.0000000000000000e+03   -2.4883045019859111e+02   8.5565868666641074e+02   -2.1509140443359590e+02   1.0000000000000002e+03   2.4883045019859105e+02   -8.5565868666641074e+02   2.1509140443359590e+02   1.4587663095210099e-06
1.0000000000000000e+03   0.0000000000000000e+00   0.0000000000000000e+00   9.9999842113425359e+02   1.0000000000000000e+03   0.0000000000000000e+00   0.0000000000000000e+00   -9.9999842113425359e+02   1.0000000000000009e+03   -3.4032739284614621e+02   -2.5899709678456361e+02   -8.1082085740972889e+02   9.9999999999999727e+02   3.4032739284614587e+02   2.5899709678456486e+02   8.1082085740972627e+02   8.5147196792831193e-05
1.0000000000000000e+03   0.0000000000000000e+00   0.0000000000000000e+00   9.9999842113425359e+02   1.0000000000000000e+03   0.0000000000000000e+00   0.0000000000000000e+00   -9.9999842113425359e+02   9.9999999999999977e+02   -2.9196534759892984e+02   3.7986554365065325e+02   7.8153125198124189e+02   1.0000000000000005e+03   2.9196534759892978e+02   -3.7986554365065331e+02   -7.8153125198124167e+02   6.3906076998706437e-05
1.0000000000000000e+03   0.0000000000000000e+00   0.0000000000000000e+00   9.9999842113425359e+02   1.0000000000000000e+03   0.0000000000000000e+00   0.0000000000000000e+00   -9.9999842113425359e+02   1.0000000000000001e+03   6.9431485315634433e+01   -5.4929701280156360e+02   -7.3060574446761711e+02   1.0000000000000001e+03   -6.9431485315634347e+01   5.4929701280156360e+02   7.3060574446761711e+02   4.2394455485183466e-05
1.0000000000000000e+03   0.0000000000000000e+00   0.0000000000000000e+00   9.9999842113425359e+02   1.0000000000000000e+03   0.0000000000000000e+00   0.0000000000000000e+00   -9.9999842113425359e+02   9.9999999999999909e+02   4.0048650241950043e+02   6.6453486858155054e+02   -4.8819736080199482e+02   9.9999999999999977e+02   -4.0048650241949997e+02   -6.6453486858154963e+02   4.8819736080199618e+02   9.8380800008611430e-06
1.0000000000000000e+03   0.0000000000000000e+00   0.0000000000000000e+00   9.9999842113425359e+02   1.0000000000000000e+03   0.0000000000000000e+00   0.0000000000000000e+00   -9.9999842113425359e+02   9.9999999999999955e+02   -7.2478504954987102e+01   -2.4014968297373045e+02   -8.8170725831312279e+02   1.0000000000000000e+03   7.2478504954987102e+01   2.4014968297373053e+02   8.8170725831312268e+02   2.5840089246634854e-04
1.0000000000000000e+03   0.0000000000000000e+00   0.0000000000000000e+00   9.9999842113425359e+02   1.0000000000000000e+03   0.0000000000000000e+00   0.0000000000000000e+00   -9.9999842113425359e+02   9.9999999999999932e+02   -1.3010421830350717e+02   9.0709358064507057e+02   -2.4224401067451485e+01   1.0000000000000005e+03   1.3010421830350899e+02   -9.0709358064507023e+02   2.4224401067451371e+01   2.1713528344176757e-08
1.0000000000000000e+03   0.0000000000000000e+00   0.0000000000000000e+00   9.9999842113425359e+02   1.0000000000000000e+03   0.0000000000000000e+00   0.0000000000000000e+00   -9.9999842113425359e+02   9.9999999999999989e+02   -8.1708022280859484e+02   -7.6496581225753218e+01   -4.0848607789099191e+02   9.9999999999999943e+02   8.1708022280859427e+02   7.6496581225753459e+01   4.0848607789099179e+02   6.1720045432111785e-06
1.0000000000000000e+03   0.0000000000000000e+00   0.0000000000000000e+00   9.9999842113425359e+02   1.0000000000000000e+03   0.0000000000000000e+00   0.0000000000000000e+00   -9.9999842113425359e+02   9.9999999999999989e+02   4.3324852523123946e+02   -7.5716196203968445e+02   2.8166322425923516e+02   1.0000000000000001e+03   -4.3324852523123946e+02   7.5716196203968468e+02   -2.8166322425923516e+02   2.6050440559536700e-06
1.0000000000000000e+03   0.0000000000000000e+00   0.0000000000000000e+00   9.9999842113425359e+02   1.0000000000000000e+03   0.0000000000000000e+00   0.0000000000000000e+00   -9.9999842113425359e+02   9.9999999999999943e+02   6.2797238640463399e+02   -4.8887568746232319e+02   4.5495487402208101e+02   1.0000000000000005e+03   -6.2797238640463411e+02   4.8887568746232319e+02   -4.5495487402208079e+02   8.1301200048506443e-06
1.0000000000000000e+03   0.0000000000000000e+00   0.0000000000000000e+00   9.9999842113425359e+02   1.0000000000000000e+03   0.0000000000000000e+00   0.0000000000000000e+00   -9.9999842113425359e+02   9.9999999999999886e+02   -3.5692266555972020e+02   6.3237799946511700e+02   5.5949706869399836e+02   1.0000000000000026e+03   3.5692266555971833e+02   -6.3237799946511961e+02   -5.5949706869399597e+02   1.4706318176946512e-05
1.0000000000000000e+03   0.0000000000000000e+00   0.0000000000000000e+00   9.9999842113425359e+02   1.0000000000000000e+03   0.0000000000000000e+00   0.0000000000000000e+00   -9.9999842113425359e+02   1.0000000000000000e+03   2.0669244554049351e+02   8.9264036295476899e+02   -2.8356809683129747e+01   9.9999999999999989e+02   -2.0669244554049351e+02   -8.9264036295476899e+02   2.8356809683129736e+01   2.8184975197592457e-08
1.0000000000000000e+03   0.0000000000000000e+00   0.0000000000000000e+00   9.9999842113425359e+02   1.0000000000000000e+03   0.0000000000000000e+00   0.0000000000000000e+00   -9.9999842113425359e+02   1.0000000000000007e+03   4.9511817921829129e+02   -7.6881852215615390e+02   -6.4099624586496248e+01   9.9999999999999864e+02   -4.9511817921829140e+02   7.6881852215615356e+02   6.4099624586494627e+01   1.2701551453669155e-07
1.0000000000000000e+03   0.0000000000000000e+00   0.0000000000000000e+00   9.9999842113425359e+02   1.0000000000000000e+03   0.0000000000000000e+00   0.0000000000000000e+00   -9.9999842113425359e+02   1.0000000000000003e+03   -2.1199771453026108e+02   8.6631950037784748e+02   2.1184944081578473e+02   9.9999999999999977e+02   2.1199771453026131e+02   -8.6631950037784736e+02   -2.1184944081578459e+02   1.4128342880056691e-06
1.0000000000000000e+03   0.0000000000000000e+00   0.0000000000000000e+00   9.9999842113425359e+02   1.0000000000000000e+03   0.0000000000000000e+00   0.0000000000000000e+00   -9.9999842113425359e+02   9.9999999999999989e+02   4.3655375838489186e+02   -7.8459718567532207e+02   -1.8482631183174854e+02   9.9999999999999989e+02   -4.3655375838489186e+02   7.8459718567532207e+02   1.8482631183174854e+02   1.0623689111798907e-06
1.0000000000000000e+03   0.0000000000000000e+00   0.0000000000000000e+00   9.9999842113425359e+02   1.0000000000000000e+03   0.0000000000000000e+00   0.0000000000000000e+00   -9.9999842113425359e+02   9.9999999999999966e+02   8.3589895646377829e+02   3.7038986310461183e+02   -6.6460342814722068e+01   9.9999999999999977e+02   -8.3589895646377829e+02   -3.7038986310461195e+02   6.6460342814721898e+01   1.3627238457643211e-07
1.0000000000000000e+03   0.0000000000000000e+00   0.0000000000000000e+00   9.9999842113425359e+02   1.0000000000000000e+03   0.0000000000000000e+00   0.0000000000000000e+00   -9.9999842113425359e+02   9.9999999999999966e+02   -3.1944268718241739e+02   -3.2029201005527574e+02   -7.9730928200753135e+02   1.0000000000000002e+03   3.1944268718241699e+02   3.2029201005527574e+02   7.9730928200753135e+02   7.4120360442497791e-05
1.0000000000000000e+03   0.0000000000000000e+00   0.0000000000000000e+00   9.9999842113425359e+02   1.0000000000000000e+03   0.0000000000000000e+00   0.0000000000000000e+00   -9.9999842113425359e+02   9.9999999999999966e+02   4.1143516689986160e+02   -8.0900996510583059e+02   1.2867273632158251e+02   1.0000000000000007e+03   -4.1143516689986149e+02   8.0900996510583082e+02   -1.2867273632158285e+02   5.0629812988003157e-07
1.0000000000000000e+03   0.0000000000000000e+00   0.0000000000000000e+00   9.9999842113425359e+02   1.0000000000000000e+03   0.0000000000000000e+00   0.0000000000000000e+00   -9.9999842113425359e+02   1.0000000000000005e+03   5.9098279731462299e+02   2.6369654467911442e+02   -6.4925816042420047e+02   1.0000000000000003e+03   -5.9098279731462253e+02   -2.6369654467911442e+02   6.4925816042420047e+02   2.4777615289453763e-05
1.0000000000000000e+03   0.0000000000000000e+00   0.0000000000000000e+00   9.9999842113425359e+02   1.0000000000000000e+03   0.0000000000000000e+00   0.0000000000000000e+00   -9.9999842113425359e+02   9.9999999999999739e+02   -7.9702037126005803e+02   -1.7078059225248748e+02   -4.1943439341725519e+02   1.0000000000000016e+03   7.9702037126005962e+02   1.7078059225248896e+02   4.1943439341725531e+02   6.5940834366288378e-06
1.0000000000000000e+03   0.0000000000000000e+00   0.0000000000000000e+00   9.9999842113425359e+02   1.0000000000000000e+03   0.0000000000000000e+00   0.0000000000000000e+00   -9.9999842113425359e+02   9.9999999999999716e+02   2.7537931912926160e+02   8.4090976197207760e+02   -2.3951971962846980e+02   1.0000000000000008e+03   -2.7537931912926422e+02   -8.4090976197207613e+02   2.3951971962847509e+02   1.8330803688789977e-06
1.0000000000000000e+03   0.0000000000000000e+00   0.0000000000000000e+00   9.9999842113425359e+02   1.0000000000000000e+03   0.0000000000000000e+00   0.0000000000000000e+00   -9.9999842113425359e+02   9.9999999999999898e+02   -1.8429081371576498e+01   -8.9799094235577797e+02   -1.8331756512052752e+02   9.9999999999999943e+02   1.8429081371576672e+01   8.9799094235577752e+02   1.8331756512052837e+02   1.0444590695143271e-06
1.0000000000000000e+03   0.0000000000000000e+00   0.0000000000000000e+00   9.9999842113425359e+02   1.0000000000000000e+03   0.0000000000000000e+00   0.0000000000000000e+00   -9.9999842113425359e+02   9.9999999999999864e+02   -4.1784506942788613e+02   5.6228116389417039e+02   -5.9125128664515876e+02   9.9999999999999750e+02   4.1784506942789164e+02   -5.6228116389416959e+02   5.9125128664515762e+02   1.7613654530106057e-05
1.0000000000000000e+03   0.0000000000000000e+00   0.0000000000000000e+00   9.9999842113425359e+02   1.0000000000000000e+03   0.0000000000000000e+00   0.0000000000000000e+00   -9.9999842113425359e+02   1.0000000000000000e+03   -7.5092061267772590e+02   5.2234566428864537e+02   -6.0049427386941410e+01   1.0000000000000000e+03   7.5092061267772590e+02   -5.2234566428864537e+02   6.0049427386941453e+01   1.1192810216331291e-07
1.0000000000000000e+03   0.0000000000000000e+00   0.0000000000000000e+00   9.9999842113425359e+02   1.0000000000000000e+03   0.0000000000000000e+00   0.0000000000000000e+00   -9.9999842113425359e+02   9.9999999999999920e+02   2.2869120629471604e+02   -8.7449677007306116e+02   1.5260545393329409e+02   9.9999999999999864e+02   -2.2869120629471530e+02   8.7449677007306082e+02   -1.5260545393329406e+02   7.1615214441598176e-07
1.0000000000000000e+03   0.0000000000000000e+00   0.0000000000000000e+00   9.9999842113425359e+02   1.0000000000000000e+03   0.0000000000000000e+00   0.0000000000000000e+00   -9.9999842113425359e+02   1.0000000000000005e+03   5.4890100823571618e+02   -3.9781971507393808e+02   6.1707361856689488e+02   1.0000000000000000e+03   -5.4890100823571629e+02   3.9781971507393803e+02   -6.1707361856689488e+02   2.0452091808599050e-05
1.0000000000000000e+03   0.0000000000000000e+00   0.0000000000000000e+00   9.9999842113425359e+02   1.0000000000000000e+03   0.0000000000000000e+00   0.0000000000000000e+00   -9.9999842113425359e+02   1.0000000000000000e+03   7.1981529367400663e+02   2.0933435917519279e+02   5.2761516499874472e+02   1.0000000000000003e+03   -7.1981529367400663e+02   -2.0933435917519287e+02   -5.2761516499874517e+02   1.2290242669798155e-05
1.0000000000000000e+03   0.0000000000000000e+00   0.0000000000000000e+00   9.9999842113425359e+02   1.0000000000000000e+03   0.0000000000000000e+00   0.0000000000000000e+00   -9.9999842113425359e+02   9.9999999999999989e+02   2.7075207461135261e+02   3.1469493127428973e+02   -8.1730845315514489e+02   9.9999999999999977e+02   -2.7075207461135261e+02   -3.1469493127428967e+02   8.1730845315514489e+02   9.1439521542264552e-05
1.0000000000000000e+03   0.0000000000000000e+00   0.0000000000000000e+00   9.9999842113425359e+02   1.0000000000000000e+03   0.0000000000000000e+00   0.0000000000000000e+00   -9.9999842113425359e+02   1.0000000000000007e+03   2.1935980273206604e+02   -8.8848455946533227e+02   5.3001488771360783e+01   1.0000000000000005e+03   -2.1935980273206616e+02   8.8848455946533261e+02   -5.3001488771361437e+01   8.8057292366799445e-08
1.0000000000000000e+03   0.0000000000000000e+00   0.0000000000000000e+00   9.9999842113425359e+02   1.0000000000000000e+03   0.0000000000000000e+00   0.0000000000000000e+00   -9.9999842113425359e+02   9.9999999999999966e+02   6.0412794343984376e+02   -1.2498597829186909e+02   6.7804175864065064e+02   9.9999999999999977e+02   -6.0412794343984353e+02   1.2498597829186888e+02   -6.7804175864065064e+02   2.9645747312738152e-05
1.0000000000000000e+03   0.0000000000000000e+00   0.0000000000000000e+00   9.9999842113425359e+02   1.0000000000000000e+03   0.0000000000000000e+00   0.0000000000000000e+00   -9.9999842113425359e+02   1.0000000000000003e+03   8.2941954005478351e+02   -1.8763807148521019e+02   3.4232714467240260e+02   1.0000000000000003e+03   -8.2941954005478351e+02   1.8763807148521019e+02   -3.4232714467240248e+02   4.0435778468647038e-06
1.0000000000000000e+03   0.0000000000000000e+00   0.0000000000000000e+00   9.9999842113425359e+02   1.0000000000000000e+03   0.0000000000000000e+00   0.0000000000000000e+00   -9.9999842113425359e+02   9.9999999999999989e+02   -7.7157303352482904e+02   -1.7780108071120799e+02   -4.6194645026253488e+02   1.0000000000000000e+03   7.7157303352482916e+02   1.7780108071120799e+02   4.6194645026253494e+02   8.4657274668206991e-06
1.0000000000000000e+03   0.0000000000000000e+00   0.0000000000000000e+00   9.9999842113425359e+02   1.0000000000000000e+03   0.0000000000000000e+00   0.0000000000000000e+00   -9.9999842113425359e+02   1.0000000000000008e+03   -5.9411833621911967e+02   -5.7940962436356574e+02   -3.8941055845731086e+02   1.0000000000000005e+03   5.9411833621911910e+02   5.7940962436356608e+02   3.8941055845731114e+02   5.4878070009709176e-06
1.0000000000000000e+03   0.0000000000000000e+00   0.0000000000000000e+00   9.9999842113425359e+02   1.0000000000000000e+03   0.0000000000000000e+00   0.0000000000000000e+00   -9.9999842113425359e+02   1.0000000000000000e+03   7.9631727912483063e+02   -2.0290577337314488e+02   -4.0625205399358890e+02   1.0000000000000001e+03   -7.9631727912483063e+02   2.0290577337314483e+02   4.0625205399358896e+02   6.0885904023105978e-06
1.0000000000000000e+03   0.0000000000000000e+00   0.0000000000000000e+00   9.9999842113425359e+02   1.0000000000000000e+03   0.0000000000000000e+00   0.0000000000000000e+00   -9.9999842113425359e+02   1.0000000000000005e+03   5.7967390743199462e+02   -6.3156911291870051e+02   3.2470187853559867e+02   1.0000000000000005e+03   -5.7967390743199439e+02   6.3156911291870085e+02   -3.2470187853559867e+02   3.5812069123253655e-06
1.0000000000000000e+03   0.0000000000000000e+00   0.0000000000000000e+00   9.9999842113425359e+02   1.0000000000000000e+03   0.0000000000000000e+00   0.0000000000000000e+00   -9.9999842113425359e+02   1.0000000000000000e+03   4.0455169001932325e+02   -2.5590307978599352e+01   8.2220177542681449e+02   9.9999999999999920e+02   -4.0455169001932325e+02   2.5590307978599341e+01   -8.2220177542681438e+02   9.6718393418555117e-05
1.0000000000000000e+03   0.0000000000000000e+00   0.0000000000000000e+00   9.9999842113425359e+02   1.0000000000000000e+03   0.0000000000000000e+00   0.0000000000000000e+00   -9.9999842113425359e+02   9.9999999999999966e+02   4.5407496947545303e+02   -5.2094861574453341e+02   -6.0229656741895667e+02   9.9999999999999966e+02   -4.5407496947545303e+02   5.2094861574453341e+02   6.0229656741895678e+02   1.8768871135827869e-05
1.0000000000000000e+03   0.0000000000000000e+00   0.0000000000000000e+00   9.9999842113425359e+02   1.0000000000000000e+03   0.0000000000000000e+00   0.0000000000000000e+00   -9.9999842113425359e+02   1.0000000000000014e+03   3.4891164070656185e+02   1.1588046030851665e+02   8.3974107865048472e+02   9.9999999999999932e+02   -3.4891164070656214e+02   -1.1588046030851577e+02   -8.3974107865048472e+02   1.2069289298564565e-04
1.0000000000000000e+03   0.0000000000000000e+00   0.0000000000000000e+00   9.9999842113425359e+02   1.0000000000000000e+03   0.0000000000000000e+00   0.0000000000000000e+00   -9.9999842113425359e+02   1.0000000000000006e+03   -8.7964529969698845e+02   -1.1095697969331022e+02   2.3290639461653166e+02   1.0000000000000016e+03   8.7964529969698742e+02   1.1095697969331214e+02   -2.3290639461653493e+02   1.7267216242871620e-06
1.0000000000000000e+03   0.0000000000000000e+00   0.0000000000000000e+00   9.9999842113425359e+02   1.0000000000000000e+03   0.0000000000000000e+00   0.0000000000000000e+00   -9.9999842113425359e+02   9.9999999999999886e+02   4.3364918538821968e+01   -2.5713573661266906e+01   9.1530923148661827e+02   9.9999999999999886e+02   -4.3364918538820348e+01   2.5713573661267446e+01   -9.1530923148661793e+02   6.8002784925909093e-04
1.0000000000000000e+03   0.0000000000000000e+00   0.0000000000000000e+00   9.9999842113425359e+02   1.0000000000000000e+03   0.0000000000000000e+00   0.0000000000000000e+00   -9.9999842113425359e+02   9.9999999999999977e+02   2.0780053105165078e+02   8.8302421268474393e+02   -1.3198436415756595e+02   1.0000000000000001e+03   -2.0780053105165069e+02   -8.8302421268474393e+02   1.3198436415756589e+02   5.3301834857891640e-07
1.0000000000000000e+03   0.0000000000000000e+00   0.0000000000000000e+00   9.9999842113425359e+02   1.0000000000000000e+03   0.0000000000000000e+00   0.0000000000000000e+00   -9.9999842113425359e+02   1.0000000000000001e+03   2.5306285299985100e+02   -5.6551289976281839e+02   6.7563825077356421e+02   1.0000000000000002e+03   -2.5306285299985100e+02   5.6551289976281851e+02   -6.7563825077356421e+02   2.9194654590694117e-05
1.0000000000000000e+03   0.0000000000000000e+00   0.0000000000000000e+00   9.9999842113425359e+02   1.0000000000000000e+03   0.0000000000000000e+00   0.0000000000000000e+00   -9.9999842113425359e+02   1.0000000000000001e+03   -5.4479478712566186e+02   -3.9086996225081600e+02   -6.2510159638708910e+02   1.0000000000000003e+03   5.4479478712566186e+02   3.9086996225081600e+02   6.2510159638708956e+02   2.1440015171624243e-05
1.0000000000000000e+03   0.0000000000000000e+00   0.0000000000000000e+00   9.9999842113425359e+02   1.0000000000000000e+03   0.0000000000000000e+00   0.0000000000000000e+00   -9.9999842113425359e+02   1.0000000000000000e+03   5.2398876283910329e+02   -4.3156603644120082e+02   -6.1605131757323215e+02   1.0000000000000005e+03   -5.2398876283910363e+02   4.3156603644120059e+02   6.1605131757323215e+02   2.0330164898434703e-05
1.0000000000000000e+03   0.0000000000000000e+00   0.0000000000000000e+00   9.9999842113425359e+02   1.0000000000000000e+03   0.0000000000000000e+00   0.0000000000000000e+00   -9.9999842113425359e+02   1.0000000000000014e+03   3.8841485205215946e+02   2.0877860323652111e+01   8.3007873778849557e+02   1.0000000000000014e+03   -3.8841485205216071e+02   -2.0877860323653621e+01   -8.3007873778849557e+02   1.0637535110526725e-04
1.0000000000000000e+03   0.0000000000000000e+00   0.0000000000000000e+00   9.9999842113425359e+02   1.0000000000000000e+03   0.0000000000000000e+00   0.0000000000000000e+00   -9.9999842113425359e+02   9.9999999999999989e+02   -1.9511976387832448e+02   -1.0149278189751354e+02   -8.8992144947838381e+02   9.9999999999999989e+02   1.9511976387832496e+02   1.0149278189751350e+02   8.8992144947838369e+02   3.2423712742155948e-04
1.0000000000000000e+03   0.0000000000000000e+00   0.0000000000000000e+00   9.9999842113425359e+02   1.0000000000000000e+03   0.0000000000000000e+00   0.0000000000000000e+00   -9.9999842113425359e+02   1.0000000000000002e+03   4.5651653754698947e+02   5.1227334383161804e+02   -6.0786623974408894e+02   1.0000000000000000e+03   -4.5651653754698947e+02   -5.1227334383161781e+02   6.0786623974408894e+02   1.9383831023321579e-05
1.0000000000000000e+03   0.0000000000000000e+00   0.0000000000000000e+00   9.9999842113425359e+02   1.0000000000000000e+03   0.0000000000000000e+00   0.0000000000000000e+00   -9.9999842113425359e+02   9.9999999999999886e+02   8.9599444367480976e+02   5.6613934688177970e+01   -1.8526066117210019e+02   9.9999999999999636e+02   -8.9599444367481215e+02   -5.6613934688176137e+01   1.8526066117209783e+02   1.0675566781920960e-06
1.0000000000000000e+03   0.0000000000000000e+00   0.0000000000000000e+00   9.9999842113425359e+02   1.0000000000000000e+03   0.0000000000000000e+00   0.0000000000000000e+00   -9.9999842113425359e+02   1.0000000000000005e+03   -7.9329467410438997e+02   -2.7266399902250942e+02   3.6968986590059507e+02   1.0000000000000002e+03   7.9329467410438997e+02   2.7266399902250953e+02   -3.6968986590059529e+02   4.8432149326452333e-06
1.0000000000000000e+03   0.0000000000000000e+00   0.0000000000000000e+00   9.9999842113425359e+02   1.0000000000000000e+03   0.0000000000000000e+00   0.0000000000000000e+00   -9.9999842113425359e+02   9.9999999999999966e+02   -4.5829619678691290e+02   3.7831560768339142e+02   -6.9797893253932386e+02   9.9999999999999943e+02   4.5829619678691256e+02   -3.7831560768339119e+02   6.9797893253932398e+02   3.3768075142202172e-05
1.0000000000000000e+03   0.0000000000000000e+00   0.0000000000000000e+00   9.9999842113425359e+02   1.0000000000000000e+03   0.0000000000000000e+00   0.0000000000000000e+00   -9.9999842113425359e+02   9.9999999999999943e+02   -7.1698186716903206e+02   7.0390564156460883e+01   5.6684642003233967e+02   9.9999999999999966e+02   7.1698186716903251e+02   -7.0390564156460826e+01   -5.6684642003233978e+02   1.5329943221129743e-05
1.0000000000000000e+03   0.0000000000000000e+00   0.0000000000000000e+00   9.9999842113425359e+02   1.0000000000000000e+03   0.0000000000000000e+00   0.0000000000000000e+00   -9.9999842113425359e+02   9.9999999999999989e+02   6.5819891409404090e+02   -6.3342112905453473e+02   7.6710859906804330e+01   1.0000000000000005e+03   -6.5819891409404090e+02   6.3342112905453507e+02   -7.6710859906804359e+01   1.8044170179563681e-07
1.0000000000000000e+03   0.0000000000000000e+00   0.0000000000000000e+00   9.9999842113425359e+02   1.0000000000000000e+03   0.0000000000000000e+00   0.0000000000000000e+00   -9.9999842113425359e+02   1.0000000000000002e+03   -2.6078263588180778e+02   -4.5132807994612716e+02   7.5407431619808995e+02   1.0000000000000002e+03   2.6078263588180783e+02   4.5132807994612676e+02   -7.5407431619809017e+02   5.0687319716192517e-05
1.0000000000000000e+03   0.0000000000000000e+00   0.0000000000000000e+00   9.9999842113425359e+02   1.0000000000000000e+03   0.0000000000000000e+00   0.0000000000000000e+00   -9.9999842113425359e+02   9.9999999999999966e+02   -7.8184922052207479e+00   -7.8598144575041295e+02   -4.7170407184024236e+02   9.9999999999999966e+02   7.8184922052207995e+00   7.8598144575041306e+02   4.7170407184024157e+02   8.9544022240094510e-06
1.0000000000000000e+03   0.0000000000000000e+00   0.0000000000000000e+00   9.9999842113425359e+02   1.0000000000000000e+03   0.0000000000000000e+00   0.0000000000000000e+00   -9.9999842113425359e+02   9.9999999999999909e+02   2.4387902429867421e+02   8.0519490593500984e+02   3.6402867776917680e+02   1.0000000000000003e+03   -2.4387902429867424e+02   -8.0519490593500961e+02   -3.6402867776917680e+02   4.6691060623422446e-06
1.0000000000000000e+03   0.0000000000000000e+00   0.0000000000000000e+00   9.9999842113425359e+02   1.0000000000000000e+03   0.0000000000000000e+00   0.0000000000000000e+00   -9.9999842113425359e+02   9.9999999999999943e+02   2.7810973621911108e+02   8.7347442119477591e+02   5.4866577735719755e+00   9.9999999999999977e+02   -2.7810973621911108e+02   -8.7347442119477603e+02   -5.4866577735722251e+00   5.1478670422356905e-09
1.0000000000000000e+03   0.0000000000000000e+00   0.0000000000000000e+00   9.9999842113425359e+02   1.0000000000000000e+03   0.0000000000000000e+00   0.0000000000000000e+00   -9.9999842113425359e+02   9.9999999999999955e+02   -2.1377712051734747e+01   3.1498737135957845e+02   -8.6061526978456084e+02   1.0000000000000002e+03   2.1377712051734640e+01   -3.1498737135957862e+02   8.6061526978456106e+02   1.6652377153933713e-04
1.0000000000000000e+03   0.0000000000000000e+00   0.0000000000000000e+00   9.9999842113425359e+02   1.0000000000000000e+03   0.0000000000000000e+00   0.0000000000000000e+00   -9.9999842113425359e+02   9.9999999999999704e+02   -2.6663682385389484e+02   -8.5717735222956810e+02   1.8569998455774370e+02   9.9999999999999409e+02   2.6663682385389200e+02   8.5717735222957310e+02   -1.8569998455774663e+02   1.0728183208249166e-06
1.0000000000000000e+03   0.0000000000000000e+00   0.0000000000000000e+00   9.9999842113425359e+02   1.0000000000000000e+03   0.0000000000000000e+00   0.0000000000000000e+00   -9.9999842113425359e+02   9.9999999999999966e+02   -8.5790104939499145e+02   -2.5911775550051419e+02   -1.9286386780909791e+02   9.9999999999999955e+02   8.5790104939499122e+02   2.5911775550051408e+02   1.9286386780909763e+02   1.1606850137530967e-06
1.0000000000000000e+03   0.0000000000000000e+00   0.0000000000000000e+00   9.9999842113425359e+02   1.0000000000000000e+03   0.0000000000000000e+00   0.0000000000000000e+00   -9.9999842113425359e+02   9.9999999999999920e+02   -8.1256324351140495e+02   -3.5755308639312682e+02   -2.2853765330869027e+02   9.9999999999999920e+02   8.1256324351145156e+02   3.5755308639311977e+02   2.2853765330868927e+02   1.6585350754703961e-06
1.0000000000000000e+03   0.0000000000000000e+00   0.0000000000000000e+00   9.9999842113425359e+02   1.0000000000000000e+03   0.0000000000000000e+00   0.0000000000000000e+00   -9.9999842113425359e+02   1.0000000000000010e+03   2.2876314282675065e+02   8.8001705328469586e+02   1.1649078799237735e+02   1.0000000000000005e+03   -2.2876314282675196e+02   -8.8001705328469563e+02   -1.1649078799237719e+02   4.1427316988806568e-07
1.0000000000000000e+03   0.0000000000000000e+00   0.0000000000000000e+00   9.9999842113425359e+02   1.0000000000000000e+03   0.0000000000000000e+00   0.0000000000000000e+00   -9.9999842113425359e+02   1.0000000000000001e+03   5.8349902090299543e+02   -5.9466147778119489e+02   -3.8241249028146092e+02   9.9999999999999989e+02   -5.8349902090299543e+02   5.9466147778119500e+02   3.8241249028146086e+02   5.2520860726775912e-06
1.0000000000000000e+03   0.0000000000000000e+00   0.0000000000000000e+00   9.9999842113425359e+02   1.0000000000000000e+03   0.0000000000000000e+00   0.0000000000000000e+00   -9.9999842113425359e+02   1.0000000000000005e+03   8.6439606820514803e+02   -3.0520135149922942e+02   -2.0653303518852568e+00   1.0000000000000002e+03   -8.6439606820514803e+02   3.0520135149922942e+02   2.0653303518852568e+00   4.3795638134156595e-09
1.0000000000000000e+03   0.0000000000000000e+00   0.0000000000000000e+00   9.9999842113425359e+02   1.0000000000000000e+03   0.0000000000000000e+00   0.0000000000000000e+00   -9.9999842113425359e+02   1.0000000000000001e+03   -4.9308088208322567e+02   -1.2063015638315498e+02   7.6331664620257106e+02   1.0000000000000001e+03   4.9308088208322556e+02   1.2063015638315505e+02   -7.6331664620257095e+02   5.4627400599278912e-05
1.0000000000000000e+03   0.0000000000000000e+00   0.0000000000000000e+00   9.9999842113425359e+02   1.0000000000000000e+03   0.0000000000000000e+00   0.0000000000000000e+00   -9.9999842113425359e+02   9.9999999999999966e+02   -6.9030279154329230e+02   -3.4464540154794821e+02   4.9500939026883941e+02   9.9999999999999977e+02   6.9030279154329230e+02   3.4464540154794821e+02   -4.9500939026883952e+02   1.0225764199426919e-05
1.0000000000000000e+03   0.0000000000000000e+00   0.0000000000000000e+00   9.9999842113425359e+02   1.0000000000000000e+03   0.0000000000000000e+00   0.0000000000000000e+00   -9.9999842113425359e+02   9.9999999999999989e+02   -3.9238993919530861e+02   5.6083048876414932e+02   6.0978028154885783e+02   9.9999999999999989e+02   3.9238993919530861e+02   -5.6083048876414921e+02   -6.0978028154885794e+02   1.9600477703313134e-05
1.0000000000000000e+03   0.0000000000000000e+00   0.0000000000000000e+00   9.9999842113425359e+02   1.0000000000000000e+03   0.0000000000000000e+00   0.0000000000000000e+00   -9.9999842113425359e+02   9.9999999999999977e+02   -7.0145057487262443e+02   3.8325048431749883e+02   4.4879711513801453e+02   9.9999999999999977e+02   7.0145057487262454e+02   -3.8325048431749883e+02   -4.4879711513801459e+02   7.8441290086611941e-06
1.0000000000000000e+03   0.0000000000000000e+00   0.0000000000000000e+00   9.9999842113425359e+02   1.0000000000000000e+03   0.0000000000000000e+00   0.0000000000000000e+00   -9.9999842113425359e+02   1.0000000000000002e+03   -8.8524218352614639e+02   -1.0353187829396255e+02   2.1438311490815221e+02   1.0000000000000005e+03   8.8524218352614639e+02   1.0353187829396238e+02   -2.1438311490815229e+02   1.4486582320166991e-06
1.0000000000000000e+03   0.0000000000000000e+00   0.0000000000000000e+00   9.9999842113425359e+02   1.0000000000000000e+03   0.0000000000000000e+00   0.0000000000000000e+00   -9.9999842113425359e+02   9.9999999999999864e+02   -5.7603794727465583e+02   -1.9444463242965173e+02   6.8607890325664187e+02   1.0000000000000009e+03   5.7603794727465595e+02   1.9444463242965222e+02   -6.8607890325664243e+02   3.1222276380925877e-05
1.0000000000000000e+03   0.0000000000000000e+00   0.0000000000000000e+00   9.9999842113425359e+02   1.0000000000000000e+03   0.0000000000000000e+00   0.0000000000000000e+00   -9.9999842113425359e+02   1.0000000000000000e+03   -5.8144643030519592e+02   -3.0928567095550738e+02   6.3764811275646673e+02   9.9999999999999989e+02   5.8144643030519592e+02   3.0928567095550738e+02   -6.3764811275646673e+02   2.3100266155909374e-05
1.0000000000000000e+03   0.0000000000000000e+00   0.0000000000000000e+00   9.9999842113425359e+02   1.0000000000000000e+03   0.0000000000000000e+00   0.0000000000000000e+00   -9.9999842113425359e+02   9.9999999999999989e+02   6.0208566069915278e+01   -9.0992572582956245e+02   9.3502916105782845e+01   9.9999999999999966e+02   -6.0208566069915356e+01   9.0992572582956268e+02   -9.3502916105783015e+01   2.6690601853278987e-07
1.0000000000000000e+03   0.0000000000000000e+00   0.0000000000000000e+00   9.9999842113425359e+02   1.0000000000000000e+03   0.0000000000000000e+00   0.0000000000000000e+00   -9.9999842113425359e+02   1.0000000000000005e+03   1.9799124620747101e+01   2.0419617572028747e+02   8.9344535913529637e+02   9.9999999999999977e+02   -1.9799124620747175e+01   -2.0419617572028804e+02   -8.9344535913529637e+02   3.6288052584125443e-04
1.0000000000000000e+03   0.0000000000000000e+00   0.0000000000000000e+00   9.9999842113425359e+02   1.0000000000000000e+03   0.0000000000000000e+00   0.0000000000000000e+00   -9.9999842113425359e+02   1.0000000000000005e+03   -4.0026238413341395e+02   4.2642999244664168e+02   7.0588963632052992e+02   1.0000000000000000e+03   4.0026238413341378e+02   -4.2642999244664168e+02   -7.0588963632052992e+02   3.5617954404603330e-05
1.0000000000000000e+03   0.0000000000000000e+00   0.0000000000000000e+00   9.9999842113425359e+02   1.0000000000000000e+03   0.0000000000000000e+00   0.0000000000000000e+00   -9.9999842113425359e+02   1.0000000000000000e+03   2.8303174363498681e+02   -8.2164022461932473e+02   -2.9177571293269415e+02   1.0000000000000005e+03   -2.8303174363498692e+02   8.2164022461932461e+02   2.9177571293269409e+02   2.8162191936166945e-06
1.0000000000000000e+03   0.0000000000000000e+00   0.0000000000000000e+00   9.9999842113425359e+02   1.0000000000000000e+03   0.0000000000000000e+00   0.0000000000000000e+00   -9.9999842113425359e+02   1.0000000000000000e+03   2.2405484674716671e+01   6.0830057303717609e+01   -9.1440165773026376e+02   1.0000000000000000e+03   -2.2405484674716714e+01   -6.0830057303717588e+01   9.1440165773026376e+02   7.9708311754912221e-04
1.0000000000000000e+03   0.0000000000000000e+00   0.0000000000000000e+00   9.9999842113425359e+02   1.0000000000000000e+03   0.0000000000000000e+00   0.0000000000000000e+00   -9.9999842113425359e+02   9.9999999999999977e+02   3.2656181478563514e+02   -8.4644272655936334e+02   1.3124322860094665e+02   9.9999999999999966e+02   -3.2656181478563508e+02   8.4644272655936334e+02   -1.3124322860094674e+02   5.2697462013006883e-07
1.0000000000000000e+03   0.0000000000000000e+00   0.0000000000000000e+00   9.9999842113425359e+02   1.0000000000000000e+03   0.0000000000000000e+00   0.0000000000000000e+00   -9.9999842113425359e+02   1.0000000000000000e+03   -1.1368869880343381e+02   -1.9510423305359998e+02   -8.8844916077617279e+02   1.0000000000000000e+03   1.1368869880343401e+02   1.9510423305360007e+02   8.8844916077617279e+02   3.1027027956238065e-04
1.0000000000000000e+03   0.0000000000000000e+00   0.0000000000000000e+00   9.9999842113425359e+02   1.0000000000000000e+03   0.0000000000000000e+00   0.0000000000000000e+00   -9.9999842113425359e+02   1.0000000000000002e+03   -8.7134111114754558e+02   2.8272261705599891e+02   -3.4136243262910746e+01   1.0000000000000003e+03   8.7134111114754558e+02   -2.8272261705599897e+02   3.4136243262910703e+01   3.8949114867604271e-08
1.0000000000000000e+03   0.0000000000000000e+00   0.0000000000000000e+00   9.9999842113425359e+02   1.0000000000000000e+03   0.0000000000000000e+00   0.0000000000000000e+00   -9.9999842113425359e+02   9.9999999999999943e+02   7.7079550163039357e+01   9.1058086234057703e+02   -7.2345900787058170e+01   1.0000000000000006e+03   -7.7079550163039443e+01   -9.1058086234057703e+02   7.2345900787058170e+01   1.6084110401462803e-07
1.0000000000000000e+03   0.0000000000000000e+00   0.0000000000000000e+00   9.9999842113425359e+02   1.0000000000000000e+03   0.0000000000000000e+00   0.0000000000000000e+00   -9.9999842113425359e+02   9.9999999999999943e+02   -8.3378363431738160e+02   -2.5597379686217988e+02   -2.8216123004302807e+02   1.0000000000000010e+03   8.3378363431738217e+02   2.5597379686218011e+02   2.8216123004302807e+02   2.6151964119953177e-06
1.0000000000000000e+03   0.0000000000000000e+00   0.0000000000000000e+00   9.9999842113425359e+02   1.0000000000000000e+03   0.0000000000000000e+00   0.0000000000000000e+00   -9.9999842113425359e+02   1.0000000000000014e+03   7.3892014602433392e+02   -2.3062743195103974e+02   -4.9106078921655205e+02   1.0000000000000005e+03   -7.3892014602433392e+02   2.3062743195103968e+02   4.9106078921655228e+02   9.9993556712430326e-06
1.0000000000000000e+03   0.0000000000000000e+00   0.0000000000000000e+00   9.9999842113425359e+02   1.0000000000000000e+03   0.0000000000000000e+00   0.0000000000000000e+00   -9.9999842113425359e+02   1.0000000000000001e+03   -5.6766924878410498e+02   -2.3783256872804455e+02   -6.7935262309940879e+02   1.0000000000000002e+03   5.6766924878410487e+02   2.3783256872804441e+02   6.7935262309940879e+02   2.9895615411778813e-05
1.0000000000000000e+03   0.0000000000000000e+00   0.0000000000000000e+00   9.9999842113425359e+02   1.0000000000000000e+03   0.0000000000000000e+00   0.0000000000000000e+00   -9.9999842113425359e+02   1.0000000000000002e+03   1.7644677774948795e+02   7.3994240555401541e+02   5.1155103788351062e+02   1.0000000000000002e+03   -1.7644677774948798e+02   -7.3994240555401541e+02   -5.1155103788351062e+02   1.1227577127354647e-05
1.0000000000000000e+03   0.0000000000000000e+00   0.0000000000000000e+00   9.9999842113425359e+02   1.0000000000000000e+03   0.0000000000000000e+00   0.0000000000000000e+00   -9.9999842113425359e+02   1.0000000000000002e+03   -3.9576723914010961e+02   3.0057352299287010e+02   7.7029639942947051e+02   1.0000000000000002e+03   3.9576723914010995e+02   -3.0057352299286958e+02   -7.7029639942947074e+02   5.7920580807029398e-05
1.0000000000000000e+03   0.0000000000000000e+00   0.0000000000000000e+00   9.9999842113425359e+02   1.0000000000000000e+03   0.0000000000000000e+00   0.0000000000000000e+00   -9.9999842113425359e+02   9.9999999999997988e+02   -1.0748506976197181e+02   1.6504281250194921e+02   8.9528795540578153e+02   1.0000000000000056e+03   1.0748506976197217e+02   -1.6504281250194703e+02   -8.9528795540577812e+02   3.8664753856990140e-04
1.0000000000000000e+03   0.0000000000000000e+00   0.0000000000000000e+00   9.9999842113425359e+02   1.0000000000000000e+03   0.0000000000000000e+00   0.0000000000000000e+00   -9.9999842113425359e+02   1.0000000000000000e+03   6.8479411109591103e+02   4.4557835217222947e+02   4.1575191010839478e+02   9.9999999999999977e+02   -6.8479411109591103e+02   -4.4557835217222947e+02   -4.1575191010839478e+02   6.4496100320756858e-06
1.0000000000000000e+03   0.0000000000000000e+00   0.0000000000000000e+00   9.9999842113425359e+02   1.0000000000000000e+03   0.0000000000000000e+00   0.0000000000000000e+00   -9.9999842113425359e+02   9.9999999999999829e+02   -3.9208489032358818e+02   -4.7203670250015148e+02   6.8101650754416914e+02   9.9999999999999750e+02   3.9208489032358824e+02   4.7203670250015284e+02   -6.8101650754417153e+02   3.0216767372008297e-05
1.0000000000000000e+03   0.0000000000000000e+00   0.0000000000000000e+00   9.9999842113425359e+02   1.0000000000000000e+03   0.0000000000000000e+00   0.0000000000000000e+00   -9.9999842113425359e+02   1.0000000000000028e+03   -2.7434866771971218e+02   6.6658180406909605e+02   -5.6633400063862507e+02   1.0000000000000035e+03   2.7434866771970979e+02   -6.6658180406909366e+02   5.6633400063862427e+02   1.5285565946081093e-05
1.0000000000000000e+03   0.0000000000000000e+00   0.0000000000000000e+00   9.9999842113425359e+02   1.0000000000000000e+03   0.0000000000000000e+00   0.0000000000000000e+00   -9.9999842113425359e+02   1.0000000000000002e+03   6.0993424669870717e+02   1.9252375459317707e+02   6.5669438241572016e+02   1.0000000000000000e+03   -6.0993424669870717e+02   -1.9252375459317707e+02   -6.5669438241572004e+02   2.5931533146591643e-05
1.0000000000000000e+03   0.0000000000000000e+00   0.0000000000000000e+00   9.9999842113425359e+02   1.0000000000000000e+03   0.0000000000000000e+00   0.0000000000000000e+00   -9.9999842113425359e+02   1.0000000000000003e+03   -3.5293215684822718e+02   8.4233325067813723e+02   7.9033415334262401e+01   1.0000000000000002e+03   3.5293215684822707e+02   -8.4233325067813735e+02   -7.9033415334262202e+01   1.9135194531563493e-07
1.0000000000000000e+03   0.0000000000000000e+00   0.0000000000000000e+00   9.9999842113425359e+02   1.0000000000000000e+03   0.0000000000000000e+00   0.0000000000000000e+00   -9.9999842113425359e+02   1.0000000000000019e+03   -7.2951554413932945e+02   5.5507085147871294e+02   -6.0094902225969475e+00   9.9999999999999898e+02   7.2951554413932786e+02   -5.5507085147871203e+02   6.0094902225975044e+00   5.3266013051626193e-09
1.0000000000000000e+03   0.0000000000000000e+00   0.0000000000000000e+00   9.9999842113425359e+02   1.0000000000000000e+03   0.0000000000000000e+00   0.0000000000000000e+00   -9.9999842113425359e+02   1.0000000000000000e+03   -3.1156516792471893e+02   3.7131094550232706e+02   -7.7806684877402847e+02   1.0000000000000001e+03   3.1156516792471893e+02   -3.7131094550232700e+02   7.7806684877402847e+02   6.1961209650466013e-05
1.0000000000000000e+03   0.0000000000000000e+00   0.0000000000000000e+00   9.9999842113425359e+02   1.0000000000000000e+03   0.0000000000000000e+00   0.0000000000000000e+00   -9.9999842113425359e+02   1.0000000000000009e+03   -3.0125187747926009e+02   -5.5800156485311345e+02   -6.6197753225591703e+02   9.9999999999999943e+02   3.0125187747925997e+02   5.5800156485311345e+02   6.6197753225591680e+02   2.6792589969814599e-05
