1.0000000000000000e+03   0.0000000000000000e+00   0.0000000000000000e+00   9.9999842113425359e+02   1.0000000000000000e+03   0.0000000000000000e+00   0.0000000000000000e+00   -9.9999842113425359e+02   9.6216196791717414e+02   2.1249346548624439e+02   8.5214555574776421e+02   -3.8227601684838919e+02   1.0378380320828260e+03   -2.1249346548624442e+02   -8.5214555574776432e+02   3.8227601684838908e+02   1.4679363953294859e-04
1.0000000000000000e+03   0.0000000000000000e+00   0.0000000000000000e+00   9.9999842113425359e+02   1.0000000000000000e+03   0.0000000000000000e+00   0.0000000000000000e+00   -9.9999842113425359e+02   9.6216196791717414e+02   -5.4005489513956036e+02   -7.4862350647704363e+02   2.5562478341957313e+02   1.0378380320828257e+03   5.4005489513956047e+02   7.4862350647704386e+02   -2.5562478341957313e+02   6.1791225248837220e-05
1.0000000000000000e+03   0.0000000000000000e+00   0.0000000000000000e+00   9.9999842113425359e+02   1.0000000000000000e+03   0.0000000000000000e+00   0.0000000000000000e+00   -9.9999842113425359e+02   9.6216196791717232e+02   -4.6094862452677154e+02   5.3728963701462123e+02   -6.4520282517675071e+02   1.0378380320828278e+03   4.6094862452677125e+02   -5.3728963701462123e+02   6.4520282517675071e+02   6.2981464887218908e-04
1.0000000000000000e+03   0.0000000000000000e+00   0.0000000000000000e+00   9.9999842113425359e+02   1.0000000000000000e+03   0.0000000000000000e+00   0.0000000000000000e+00   -9.9999842113425359e+02   9.6216196791717425e+02   8.6403113591614488e+02   1.1585865420584419e+02   -3.9682167597745541e+02   1.0378380320828255e+03   -8.6403113591614488e+02   -1.1585865420584419e+02   3.9682167597745524e+02   1.6016098234655925e-04
1.0000000000000000e+03   0.0000000000000000e+00   0.0000000000000000e+00   9.9999842113425359e+02   1.0000000000000000e+03   0.0000000000000000e+00   0.0000000000000000e+00   -9.9999842113425359e+02   9.6216196791717414e+02   8.7302281543692561e+02   -3.9020021578991469e+02   -5.4912925951686184e+01   1.0378380320828255e+03   -8.7302281543692584e+02   3.9020021578991498e+02   5.4912925951687370e+01   6.4701342033516497e-06
1.0000000000000000e+03   0.0000000000000000e+00   0.0000000000000000e+00   9.9999842113425359e+02   1.0000000000000000e+03   0.0000000000000000e+00   0.0000000000000000e+00   -9.9999842113425359e+02   9.6216196791717448e+02   -3.5887111022685059e+02   8.5159411703317642e+02   -2.5187191227193438e+02   1.0378380320828255e+03   3.5887111022685059e+02   -8.5159411703317664e+02   2.5187191227193438e+02   5.9981267341617885e-05
1.0000000000000000e+03   0.0000000000000000e+00   0.0000000000000000e+00   9.9999842113425359e+02   1.0000000000000000e+03   0.0000000000000000e+00   0.0000000000000000e+00   -9.9999842113425359e+02   9.6216196791717425e+02   2.2502919799454460e+02   -9.2648926901670859e+02   9.1760386656256756e+01   1.0378380320828255e+03   -2.2502919799454443e+02   9.2648926901670859e+02   -9.1760386656256756e+01   1.0966871383446566e-05
1.0000000000000000e+03   0.0000000000000000e+00   0.0000000000000000e+00   9.9999842113425359e+02   1.0000000000000000e+03   0.0000000000000000e+00   0.0000000000000000e+00   -9.9999842113425359e+02   9.6216196791717425e+02   -2.5999610573127245e+02   8.9405426944672809e+02   -2.2474310312252015e+02   1.0378380320828257e+03   2.5999610573127239e+02   -8.9405426944672809e+02   2.2474310312252015e+02   4.7903689548222671e-05
1.0000000000000000e+03   0.0000000000000000e+00   0.0000000000000000e+00   9.9999842113425359e+02   1.0000000000000000e+03   0.0000000000000000e+00   0.0000000000000000e+00   -9.9999842113425359e+02   9.6216196791717630e+02   -3.5559874903998394e+02   -2.7061895562198902e+02   -8.4720445268645301e+02   1.0378380320828237e+03   3.5559874903998360e+02   2.7061895562199032e+02   8.4720445268645028e+02   2.7068857434862804e-03
1.0000000000000000e+03   0.0000000000000000e+00   0.0000000000000000e+00   9.9999842113425359e+02   1.0000000000000000e+03   0.0000000000000000e+00   0.0000000000000000e+00   -9.9999842113425359e+02   9.6216196791717402e+02   -3.0506657574913180e+02   3.9691107728913204e+02   8.1660054812519570e+02   1.0378380320828260e+03   3.0506657574913174e+02   -3.9691107728913215e+02   -8.1660054812519536e+02   2.0062093305109091e-03
1.0000000000000000e+03   0.0000000000000000e+00   0.0000000000000000e+00   9.9999842113425359e+02   1.0000000000000000e+03   0.0000000000000000e+00   0.0000000000000000e+00   -9.9999842113425359e+02   9.6216196791717425e+02   7.2547052753373947e+01   -5.7394536763586200e+02   -7.6338988349245483e+02   1.0378380320828255e+03   -7.2547052753373862e+01   5.7394536763586200e+02   7.6338988349245483e+02   1.3150590108651620e-03
1.0000000000000000e+03   0.0000000000000000e+00   0.0000000000000000e+00   9.9999842113425359e+02   1.0000000000000000e+03   0.0000000000000000e+00   0.0000000000000000e+00   -9.9999842113425359e+02   9.6216196791717380e+02   4.1845735095486140e+02   6.9435423926594831e+02   -5.1010401876258135e+02   1.0378380320828260e+03   -4.1845735095486094e+02   -6.9435423926594740e+02   5.1010401876258277e+02   3.0236025992557580e-04
1.0000000000000000e+03   0.0000000000000000e+00   0.0000000000000000e+00   9.9999842113425359e+02   1.0000000000000000e+03   0.0000000000000000e+00   0.0000000000000000e+00   -9.9999842113425359e+02   9.6216196791717414e+02   -7.5730799918104566e+01   -2.5092581038991796e+02   -9.2127170679252777e+02   1.0378380320828260e+03   7.5730799918104566e+01   2.5092581038991807e+02   9.2127170679252754e+02   9.2378106015665630e-03
1.0000000000000000e+03   0.0000000000000000e+00   0.0000000000000000e+00   9.9999842113425359e+02   1.0000000000000000e+03   0.0000000000000000e+00   0.0000000000000000e+00   -9.9999842113425359e+02   9.6216196791717368e+02   -1.3594232567246601e+02   9.4779717801149434e+02   -2.5311411590435355e+01   1.0378380320828262e+03   1.3594232567246792e+02   -9.4779717801149388e+02   2.5311411590435235e+01   4.5110158727668186e-06
1.0000000000000000e+03   0.0000000000000000e+00   0.0000000000000000e+00   9.9999842113425359e+02   1.0000000000000000e+03   0.0000000000000000e+00   0.0000000000000000e+00   -9.9999842113425359e+02   9.6216196791717459e+02   -8.5374469173981345e+02   -7.9929177496478374e+01   -4.2681588773535287e+02   1.0378380320828255e+03   8.5374469173981288e+02   7.9929177496478630e+01   4.2681588773535270e+02   1.9072821306178144e-04
1.0000000000000000e+03   0.0000000000000000e+00   0.0000000000000000e+00   9.9999842113425359e+02   1.0000000000000000e+03   0.0000000000000000e+00   0.0000000000000000e+00   -9.9999842113425359e+02   9.6216196791717425e+02   4.5268948910408307e+02   -7.9113774612815507e+02   2.9430216991798795e+02   1.0378380320828257e+03   -4.5268948910408312e+02   7.9113774612815541e+02   -2.9430216991798795e+02   8.2567735275219044e-05
1.0000000000000000e+03   0.0000000000000000e+00   0.0000000000000000e+00   9.9999842113425359e+02   1.0000000000000000e+03   0.0000000000000000e+00   0.0000000000000000e+00   -9.9999842113425359e+02   9.6216196791717380e+02   6.5615110546829339e+02   -5.1081278366638730e+02   4.7536985700423116e+02   1.0378380320828262e+03   -6.5615110546829362e+02   5.1081278366638730e+02   -4.7536985700423094e+02   2.5029382698175322e-04
1.0000000000000000e+03   0.0000000000000000e+00   0.0000000000000000e+00   9.9999842113425359e+02   1.0000000000000000e+03   0.0000000000000000e+00   0.0000000000000000e+00   -9.9999842113425359e+02   9.6216196791717232e+02   -3.7293869387243495e+02   6.6075440959835521e+02   5.8460312599364227e+02   1.0378380320828278e+03   3.7293869387243296e+02   -6.6075440959835794e+02   -5.8460312599363976e+02   4.5133506433317770e-04
1.0000000000000000e+03   0.0000000000000000e+00   0.0000000000000000e+00   9.9999842113425359e+02   1.0000000000000000e+03   0.0000000000000000e+00   0.0000000000000000e+00   -9.9999842113425359e+02   9.6216196791717437e+02   2.1596726156992543e+02   9.3269540766238424e+02   -2.9629251896994386e+01   1.0378380320828255e+03   -2.1596726156992543e+02   -9.3269540766238424e+02   2.9629251896994376e+01   4.7062644024959814e-06
1.0000000000000000e+03   0.0000000000000000e+00   0.0000000000000000e+00   9.9999842113425359e+02   1.0000000000000000e+03   0.0000000000000000e+00   0.0000000000000000e+00   -9.9999842113425359e+02   9.6216196791717550e+02   5.1733539191355328e+02   -8.0331736576106505e+02   -6.6975937864617165e+01   1.0378380320828246e+03   -5.1733539191355328e+02   8.0331736576106482e+02   6.6975937864615474e+01   7.6882382735740823e-06
1.0000000000000000e+03   0.0000000000000000e+00   0.0000000000000000e+00   9.9999842113425359e+02   1.0000000000000000e+03   0.0000000000000000e+00   0.0000000000000000e+00   -9.9999842113425359e+02   9.6216196791717471e+02   -2.2151059148029447e+02   9.0519346099940174e+02   2.2135566434691754e+02   1.0378380320828255e+03   2.2151059148029472e+02   -9.0519346099940162e+02   -2.2135566434691739e+02   4.6515634235258128e-05
1.0000000000000000e+03   0.0000000000000000e+00   0.0000000000000000e+00   9.9999842113425359e+02   1.0000000000000000e+03   0.0000000000000000e+00   0.0000000000000000e+00   -9.9999842113425359e+02   9.6216196791717425e+02   4.5614303648061070e+02   -8.1980405806642250e+02   -1.9311993879598145e+02   1.0378380320828255e+03   -4.5614303648061070e+02   8.1980405806642250e+02   1.9311993879598145e+02   3.5927065511305836e-05
1.0000000000000000e+03   0.0000000000000000e+00   0.0000000000000000e+00   9.9999842113425359e+02   1.0000000000000000e+03   0.0000000000000000e+00   0.0000000000000000e+00   -9.9999842113425359e+02   9.6216196791717425e+02   8.7340786986466424e+02   3.8701019884295283e+02   -6.9442587527380255e+01   1.0378380320828257e+03   -8.7340786986466424e+02   -3.8701019884295289e+02   6.9442587527380084e+01   7.9675594199390987e-06
1.0000000000000000e+03   0.0000000000000000e+00   0.0000000000000000e+00   9.9999842113425359e+02   1.0000000000000000e+03   0.0000000000000000e+00   0.0000000000000000e+00   -9.9999842113425359e+02   9.6216196791717414e+02   -3.3377689348500741e+02   -3.3466432763655695e+02   -8.3308657851123724e+02   1.0378380320828260e+03   3.3377689348500707e+02   3.3466432763655695e+02   8.3308657851123724e+02   2.3408293042160903e-03
1.0000000000000000e+03   0.0000000000000000e+00   0.0000000000000000e+00   9.9999842113425359e+02   1.0000000000000000e+03   0.0000000000000000e+00   0.0000000000000000e+00   -9.9999842113425359e+02   9.6216196791717380e+02   4.2989730987299316e+02   -8.4531230103645680e+02   1.3444660945112787e+02   1.0378380320828262e+03   -4.2989730987299305e+02   8.4531230103645703e+02   -1.3444660945112821e+02   1.9135324970119362e-05
1.0000000000000000e+03   0.0000000000000000e+00   0.0000000000000000e+00   9.9999842113425359e+02   1.0000000000000000e+03   0.0000000000000000e+00   0.0000000000000000e+00   -9.9999842113425359e+02   9.6216196791717437e+02   6.1750169938343743e+02   2.7552927970288425e+02   -6.7839202633688592e+02   1.0378380320828255e+03   -6.1750169938343697e+02   -2.7552927970288425e+02   6.7839202633688592e+02   7.6223647964210176e-04
1.0000000000000000e+03   0.0000000000000000e+00   0.0000000000000000e+00   9.9999842113425359e+02   1.0000000000000000e+03   0.0000000000000000e+00   0.0000000000000000e+00   -9.9999842113425359e+02   9.6216196791717186e+02   -8.3278470360329527e+02   -1.7844395203516979e+02   -4.3825548204092883e+02   1.0378380320828280e+03   8.3278470360329686e+02   1.7844395203517129e+02   4.3825548204092894e+02   2.0355638173171140e-04
1.0000000000000000e+03   0.0000000000000000e+00   0.0000000000000000e+00   9.9999842113425359e+02   1.0000000000000000e+03   0.0000000000000000e+00   0.0000000000000000e+00   -9.9999842113425359e+02   9.6216196791717243e+02   2.8773628997333549e+02   8.7864352296779168e+02   -2.5026757898620340e+02   1.0378380320828278e+03   -2.8773628997333816e+02   -8.7864352296779009e+02   2.5026757898620889e+02   5.9218112809475372e-05
1.0000000000000000e+03   0.0000000000000000e+00   0.0000000000000000e+00   9.9999842113425359e+02   1.0000000000000000e+03   0.0000000000000000e+00   0.0000000000000000e+00   -9.9999842113425359e+02   9.6216196791717414e+02   -1.9256041151677991e+01   -9.3828608117745546e+02   -1.9154349078031771e+02   1.0378380320828260e+03   1.9256041151678176e+01   9.3828608117745500e+02   1.9154349078031859e+02   3.5386072288202445e-05
1.0000000000000000e+03   0.0000000000000000e+00   0.0000000000000000e+00   9.9999842113425359e+02   1.0000000000000000e+03   0.0000000000000000e+00   0.0000000000000000e+00   -9.9999842113425359e+02   9.6216196791717493e+02   -4.3659484103959124e+02   5.8751215063050893e+02   -6.1778223651349697e+02   1.0378380320828251e+03   4.3659484103959704e+02   -5.8751215063050813e+02   6.1778223651349583e+02   5.4070793509684953e-04
1.0000000000000000e+03   0.0000000000000000e+00   0.0000000000000000e+00   9.9999842113425359e+02   1.0000000000000000e+03   0.0000000000000000e+00   0.0000000000000000e+00   -9.9999842113425359e+02   9.6216196791717425e+02   -7.8461633153712523e+02   5.4578464352845242e+02   -6.2743998009637430e+01   1.0378380320828255e+03   7.8461633153712523e+02   -5.4578464352845242e+02   6.2743998009637465e+01   7.2329899733963504e-06
1.0000000000000000e+03   0.0000000000000000e+00   0.0000000000000000e+00   9.9999842113425359e+02   1.0000000000000000e+03   0.0000000000000000e+00   0.0000000000000000e+00   -9.9999842113425359e+02   9.6216196791717471e+02   2.3895316270239167e+02   -9.1373766559563740e+02   1.5945324900687842e+02   1.0378380320828255e+03   -2.3895316270239090e+02   9.1373766559563705e+02   -1.5945324900687839e+02   2.5471051608158052e-05
1.0000000000000000e+03   0.0000000000000000e+00   0.0000000000000000e+00   9.9999842113425359e+02   1.0000000000000000e+03   0.0000000000000000e+00   0.0000000000000000e+00   -9.9999842113425359e+02   9.6216196791717459e+02   5.7353159333737904e+02   -4.1567089807457137e+02   6.4476328218211643e+02   1.0378380320828255e+03   -5.7353159333737915e+02   4.1567089807457126e+02   -6.4476328218211643e+02   6.2825685908821289e-04
1.0000000000000000e+03   0.0000000000000000e+00   0.0000000000000000e+00   9.9999842113425359e+02   1.0000000000000000e+03   0.0000000000000000e+00   0.0000000000000000e+00   -9.9999842113425359e+02   9.6216196791717414e+02   7.5211523771182556e+02   2.1872772459264610e+02   5.5129060014542006e+02   1.0378380320828257e+03   -7.5211523771182556e+02   -2.1872772459264618e+02   -5.5129060014542051e+02   3.7729426353953939e-04
1.0000000000000000e+03   0.0000000000000000e+00   0.0000000000000000e+00   9.9999842113425359e+02   1.0000000000000000e+03   0.0000000000000000e+00   0.0000000000000000e+00   -9.9999842113425359e+02   9.6216196791717437e+02   2.8290140921833682e+02   3.2881609368702988e+02   -8.5398316336282130e+02   1.0378380320828255e+03   -2.8290140921833682e+02   -3.2881609368702982e+02   8.5398316336282130e+02   2.9180626296757975e-03
1.0000000000000000e+03   0.0000000000000000e+00   0.0000000000000000e+00   9.9999842113425359e+02   1.0000000000000000e+03   0.0000000000000000e+00   0.0000000000000000e+00   -9.9999842113425359e+02   9.6216196791717459e+02   2.2920303531500906e+02   -9.2835312269454460e+02   5.5379800452539570e+01   1.0378380320828255e+03   -2.2920303531500917e+02   9.2835312269454494e+02   -5.5379800452540252e+01   6.5127271494052676e-06
1.0000000000000000e+03   0.0000000000000000e+00   0.0000000000000000e+00   9.9999842113425359e+02   1.0000000000000000e+03   0.0000000000000000e+00   0.0000000000000000e+00   -9.9999842113425359e+02   9.6216196791717425e+02   6.3123670166751629e+02   -1.3059441720643289e+02   7.0846721785479747e+02   1.0378380320828257e+03   -6.3123670166751606e+02   1.3059441720643267e+02   -7.0846721785479747e+02   9.1384338730954643e-04
1.0000000000000000e+03   0.0000000000000000e+00   0.0000000000000000e+00   9.9999842113425359e+02   1.0000000000000000e+03   0.0000000000000000e+00   0.0000000000000000e+00   -9.9999842113425359e+02   9.6216196791717425e+02   8.6663770555235590e+02   -1.9605786926055632e+02   3.5768823481972100e+02   1.0378380320828255e+03   -8.6663770555235590e+02   1.9605786926055632e+02   -3.5768823481972089e+02   1.2613461622442497e-04
1.0000000000000000e+03   0.0000000000000000e+00   0.0000000000000000e+00   9.9999842113425359e+02   1.0000000000000000e+03   0.0000000000000000e+00   0.0000000000000000e+00   -9.9999842113425359e+02   9.6216196791717425e+02   -8.0619547906462742e+02   -1.8577946767701297e+02   -4.8267516306299734e+02   1.0378380320828257e+03   8.0619547906462753e+02   1.8577946767701297e+02   4.8267516306299746e+02   2.6051653465597197e-04
1.0000000000000000e+03   0.0000000000000000e+00   0.0000000000000000e+00   9.9999842113425359e+02   1.0000000000000000e+03   0.0000000000000000e+00   0.0000000000000000e+00   -9.9999842113425359e+02   9.6216196791717448e+02   -6.2077793789800569e+02   -6.0540920871025833e+02   -4.0688440120064547e+02   1.0378380320828255e+03   6.2077793789800523e+02   6.0540920871025867e+02   4.0688440120064581e+02   1.6994682046060058e-04
1.0000000000000000e+03   0.0000000000000000e+00   0.0000000000000000e+00   9.9999842113425359e+02   1.0000000000000000e+03   0.0000000000000000e+00   0.0000000000000000e+00   -9.9999842113425359e+02   9.6216196791717425e+02   8.3205006193470649e+02   -2.1201067178597455e+02   -4.2448161750045250e+02   1.0378380320828257e+03   -8.3205006193470649e+02   2.1201067178597447e+02   4.2448161750045256e+02   1.8819376324139610e-04
1.0000000000000000e+03   0.0000000000000000e+00   0.0000000000000000e+00   9.9999842113425359e+02   1.0000000000000000e+03   0.0000000000000000e+00   0.0000000000000000e+00   -9.9999842113425359e+02   9.6216196791717425e+02   6.0568535083252425e+02   -6.5990922625411872e+02   3.3927207813797639e+02   1.0378380320828255e+03   -6.0568535083252402e+02   6.5990922625411906e+02   -3.3927207813797639e+02   1.1212354296724457e-04
1.0000000000000000e+03   0.0000000000000000e+00   0.0000000000000000e+00   9.9999842113425359e+02   1.0000000000000000e+03   0.0000000000000000e+00   0.0000000000000000e+00   -9.9999842113425359e+02   9.6216196791717471e+02   4.2270495386751708e+02   -2.6738610220693225e+01   8.5909606145751548e+02   1.0378380320828253e+03   -4.2270495386751708e+02   2.6738610220693214e+01   -8.5909606145751536e+02   3.0965350819903022e-03
1.0000000000000000e+03   0.0000000000000000e+00   0.0000000000000000e+00   9.9999842113425359e+02   1.0000000000000000e+03   0.0000000000000000e+00   0.0000000000000000e+00   -9.9999842113425359e+02   9.6216196791717425e+02   4.7445046890138480e+02   -5.4432490586090921e+02   -6.2932314714402344e+02   1.0378380320828257e+03   -4.7445046890138480e+02   5.4432490586090921e+02   6.2932314714402366e+02   5.7630433856334178e-04
1.0000000000000000e+03   0.0000000000000000e+00   0.0000000000000000e+00   9.9999842113425359e+02   1.0000000000000000e+03   0.0000000000000000e+00   0.0000000000000000e+00   -9.9999842113425359e+02   9.6216196791717550e+02   3.6456819394738449e+02   1.2108031145913262e+02   8.7742239785145205e+02   1.0378380320828246e+03   -3.6456819394738483e+02   -1.2108031145913171e+02   -8.7742239785145193e+02   3.9225514503498267e-03
1.0000000000000000e+03   0.0000000000000000e+00   0.0000000000000000e+00   9.9999842113425359e+02   1.0000000000000000e+03   0.0000000000000000e+00   0.0000000000000000e+00   -9.9999842113425359e+02   9.6216196791717380e+02   -9.1911722284594293e+02   -1.1593590173927933e+02   2.4335749725116247e+02   1.0378380320828262e+03   9.1911722284594191e+02   1.1593590173928133e+02   -2.4335749725116588e+02   5.6002701911306933e-05
1.0000000000000000e+03   0.0000000000000000e+00   0.0000000000000000e+00   9.9999842113425359e+02   1.0000000000000000e+03   0.0000000000000000e+00   0.0000000000000000e+00   -9.9999842113425359e+02   9.6216196791717425e+02   4.5310812790192131e+01   -2.6867407148232839e+01   9.5638148601377361e+02   1.0378380320828257e+03   -4.5310812790190440e+01   2.6867407148233404e+01   -9.5638148601377327e+02   2.0014166520989846e-01
1.0000000000000000e+03   0.0000000000000000e+00   0.0000000000000000e+00   9.9999842113425359e+02   1.0000000000000000e+03   0.0000000000000000e+00   0.0000000000000000e+00   -9.9999842113425359e+02   9.6216196791717425e+02   2.1712506969786236e+02   9.2264775625823404e+02   -1.3790683845565610e+02   1.0378380320828260e+03   -2.1712506969786227e+02   -9.2264775625823404e+02   1.3790683845565604e+02   1.9941953202950915e-05
1.0000000000000000e+03   0.0000000000000000e+00   0.0000000000000000e+00   9.9999842113425359e+02   1.0000000000000000e+03   0.0000000000000000e+00   0.0000000000000000e+00   -9.9999842113425359e+02   9.6216196791717425e+02   2.6441842721698873e+02   -5.9088890271181401e+02   7.0595585847318512e+02   1.0378380320828257e+03   -2.6441842721698873e+02   5.9088890271181413e+02   -7.0595585847318512e+02   8.9975836381118524e-04
1.0000000000000000e+03   0.0000000000000000e+00   0.0000000000000000e+00   9.9999842113425359e+02   1.0000000000000000e+03   0.0000000000000000e+00   0.0000000000000000e+00   -9.9999842113425359e+02   9.6216196791717425e+02   -5.6924111563646409e+02   -4.0840929215630626e+02   -6.5315149579697629e+02   1.0378380320828257e+03   5.6924111563646409e+02   4.0840929215630626e+02   6.5315149579697675e+02   6.5879692258909747e-04
1.0000000000000000e+03   0.0000000000000000e+00   0.0000000000000000e+00   9.9999842113425359e+02   1.0000000000000000e+03   0.0000000000000000e+00   0.0000000000000000e+00   -9.9999842113425359e+02   9.6216196791717414e+02   5.4750147209228282e+02   -4.5093150276038011e+02   -6.4369510794128132e+02   1.0378380320828260e+03   -5.4750147209228328e+02   4.5093150276037983e+02   6.4369510794128132e+02   6.2449014161675359e-04
1.0000000000000000e+03   0.0000000000000000e+00   0.0000000000000000e+00   9.9999842113425359e+02   1.0000000000000000e+03   0.0000000000000000e+00   0.0000000000000000e+00   -9.9999842113425359e+02   9.6216196791717425e+02   4.0584401491518673e+02   2.1814703047069916e+01   8.6732648316592770e+02   1.0378380320828257e+03   -4.0584401491518804e+02   -2.1814703047071490e+01   -8.6732648316592770e+02   3.4261684884120585e-03
1.0000000000000000e+03   0.0000000000000000e+00   0.0000000000000000e+00   9.9999842113425359e+02   1.0000000000000000e+03   0.0000000000000000e+00   0.0000000000000000e+00   -9.9999842113425359e+02   9.6216196791717425e+02   -2.0387528423101736e+02   -1.0604702130357001e+02   -9.2985448961912937e+02   1.0378380320828255e+03   2.0387528423101784e+02   1.0604702130356996e+02   9.2985448961912925e+02   1.2206560510024330e-02
1.0000000000000000e+03   0.0000000000000000e+00   0.0000000000000000e+00   9.9999842113425359e+02   1.0000000000000000e+03   0.0000000000000000e+00   0.0000000000000000e+00   -9.9999842113425359e+02   9.6216196791717448e+02   4.7700159634567711e+02   5.3526035242013143e+02   -6.3514274484027760e+02   1.0378380320828255e+03   -4.7700159634567711e+02   -5.3526035242013120e+02   6.3514274484027760e+02   5.9527314829201387e-04
1.0000000000000000e+03   0.0000000000000000e+00   0.0000000000000000e+00   9.9999842113425359e+02   1.0000000000000000e+03   0.0000000000000000e+00   0.0000000000000000e+00   -9.9999842113425359e+02   9.6216196791717562e+02   9.3619999451991555e+02   5.9154346010720893e+01   -1.9357377849658229e+02   1.0378380320828242e+03   -9.3619999451991794e+02   -5.9154346010718982e+01   1.9357377849657985e+02   3.6083771759552302e-05
1.0000000000000000e+03   0.0000000000000000e+00   0.0000000000000000e+00   9.9999842113425359e+02   1.0000000000000000e+03   0.0000000000000000e+00   0.0000000000000000e+00   -9.9999842113425359e+02   9.6216196791717459e+02   -8.2889182493496946e+02   -2.8489912654335296e+02   3.8627879098301469e+02   1.0378380320828255e+03   8.2889182493496946e+02   2.8489912654335313e+02   -3.8627879098301491e+02   1.5038341268002532e-04
1.0000000000000000e+03   0.0000000000000000e+00   0.0000000000000000e+00   9.9999842113425359e+02   1.0000000000000000e+03   0.0000000000000000e+00   0.0000000000000000e+00   -9.9999842113425359e+02   9.6216196791717448e+02   -4.7886111342463414e+02   3.9529159175068924e+02   -7.2929902348310873e+02   1.0378380320828257e+03   4.7886111342463380e+02   -3.9529159175068895e+02   7.2929902348310884e+02   1.0429101628638008e-03
1.0000000000000000e+03   0.0000000000000000e+00   0.0000000000000000e+00   9.9999842113425359e+02   1.0000000000000000e+03   0.0000000000000000e+00   0.0000000000000000e+00   -9.9999842113425359e+02   9.6216196791717425e+02   -7.4915466814897229e+02   7.3549167902485081e+01   5.9228226142941719e+02   1.0378380320828257e+03   7.4915466814897275e+02   -7.3549167902485010e+01   -5.9228226142941730e+02   4.7048000890484307e-04
1.0000000000000000e+03   0.0000000000000000e+00   0.0000000000000000e+00   9.9999842113425359e+02   1.0000000000000000e+03   0.0000000000000000e+00   0.0000000000000000e+00   -9.9999842113425359e+02   9.6216196791717402e+02   6.8773397437662913e+02   -6.6184434706704246e+02   8.0153071407251957e+01   1.0378380320828260e+03   -6.8773397437662913e+02   6.6184434706704269e+02   -8.0153071407251986e+01   9.3003860832076768e-06
1.0000000000000000e+03   0.0000000000000000e+00   0.0000000000000000e+00   9.9999842113425359e+02   1.0000000000000000e+03   0.0000000000000000e+00   0.0000000000000000e+00   -9.9999842113425359e+02   9.6216196791717425e+02   -2.7248461640242732e+02   -4.7158031944849904e+02   7.8791154976010091e+02   1.0378380320828255e+03   2.7248461640242738e+02   4.7158031944849859e+02   -7.8791154976010102e+02   1.5793618021575392e-03
1.0000000000000000e+03   0.0000000000000000e+00   0.0000000000000000e+00   9.9999842113425359e+02   1.0000000000000000e+03   0.0000000000000000e+00   0.0000000000000000e+00   -9.9999842113425359e+02   9.6216196791717425e+02   -8.1693278472363318e+00   -8.2125043341379558e+02   -4.9287063395242706e+02   1.0378380320828257e+03   8.1693278472363868e+00   8.2125043341379558e+02   4.9287063395242620e+02   2.7540883664968463e-04
1.0000000000000000e+03   0.0000000000000000e+00   0.0000000000000000e+00   9.9999842113425359e+02   1.0000000000000000e+03   0.0000000000000000e+00   0.0000000000000000e+00   -9.9999842113425359e+02   9.6216196791717368e+02   2.5482249675066780e+02   8.4132605045194828e+02   3.8036357093335403e+02   1.0378380320828264e+03   -2.5482249675066785e+02   -8.4132605045194805e+02   -3.8036357093335403e+02   1.4510169703146222e-04
1.0000000000000000e+03   0.0000000000000000e+00   0.0000000000000000e+00   9.9999842113425359e+02   1.0000000000000000e+03   0.0000000000000000e+00   0.0000000000000000e+00   -9.9999842113425359e+02   9.6216196791717414e+02   2.9058922782646539e+02   9.1266944132147432e+02   5.7328580705071799e+00   1.0378380320828260e+03   -2.9058922782646539e+02   -9.1266944132147444e+02   -5.7328580705074410e+00   4.0112237455073294e-06
1.0000000000000000e+03   0.0000000000000000e+00   0.0000000000000000e+00   9.9999842113425359e+02   1.0000000000000000e+03   0.0000000000000000e+00   0.0000000000000000e+00   -9.9999842113425359e+02   9.6216196791717402e+02   -2.2336984394231489e+01   3.2912165630315712e+02   -8.9923326706307262e+02   1.0378380320828260e+03   2.2336984394231379e+01   -3.2912165630315729e+02   8.9923326706307284e+02   5.5768260238424436e-03
1.0000000000000000e+03   0.0000000000000000e+00   0.0000000000000000e+00   9.9999842113425359e+02   1.0000000000000000e+03   0.0000000000000000e+00   0.0000000000000000e+00   -9.9999842113425359e+02   9.6216196791717607e+02   -2.7860149668676200e+02   -8.9564108139846144e+02   1.9403281544054539e+02   1.0378380320828242e+03   2.7860149668675905e+02   8.9564108139846667e+02   -1.9403281544054846e+02   3.6242710515270611e-05
1.0000000000000000e+03   0.0000000000000000e+00   0.0000000000000000e+00   9.9999842113425359e+02   1.0000000000000000e+03   0.0000000000000000e+00   0.0000000000000000e+00   -9.9999842113425359e+02   9.6216196791717437e+02   -8.9639725269738233e+02   -2.7074502860158054e+02   -2.0151816036428292e+02   1.0378380320828257e+03   8.9639725269738210e+02   2.7074502860158043e+02   2.0151816036428261e+02   3.8897047226026858e-05
1.0000000000000000e+03   0.0000000000000000e+00   0.0000000000000000e+00   9.9999842113425359e+02   1.0000000000000000e+03   0.0000000000000000e+00   0.0000000000000000e+00   -9.9999842113425359e+02   9.6216196791717425e+02   -8.4902502408659495e+02   -3.7359740329295369e+02   -2.3879271940311591e+02   1.0378380320828255e+03   8.4902502408664373e+02   3.7359740329294630e+02   2.3879271940311486e+02   5.3941510420914320e-05
1.0000000000000000e+03   0.0000000000000000e+00   0.0000000000000000e+00   9.9999842113425359e+02   1.0000000000000000e+03   0.0000000000000000e+00   0.0000000000000000e+00   -9.9999842113425359e+02   9.6216196791717459e+02   2.3902832720968473e+02   9.1950565796318244e+02   1.2171802609935095e+02   1.0378380320828253e+03   -2.3902832720968610e+02   -9.1950565796318222e+02   -1.2171802609935079e+02   1.6357471110273730e-05
1.0000000000000000e+03   0.0000000000000000e+00   0.0000000000000000e+00   9.9999842113425359e+02   1.0000000000000000e+03   0.0000000000000000e+00   0.0000000000000000e+00   -9.9999842113425359e+02   9.6216196791717448e+02   6.0968210687924943e+02   -6.2134545160417701e+02   -3.9957231189682136e+02   1.0378380320828255e+03   -6.0968210687924943e+02   6.2134545160417713e+02   3.9957231189682130e+02   1.6279098582187287e-04
1.0000000000000000e+03   0.0000000000000000e+00   0.0000000000000000e+00   9.9999842113425359e+02   1.0000000000000000e+03   0.0000000000000000e+00   0.0000000000000000e+00   -9.9999842113425359e+02   9.6216196791717448e+02   9.0318371953029680e+02   -3.1889651282787480e+02   -2.1580069806979179e+00   1.0378380320828255e+03   -9.0318371953029680e+02   3.1889651282787480e+02   2.1580069806979179e+00   3.9880439839098004e-06
1.0000000000000000e+03   0.0000000000000000e+00   0.0000000000000000e+00   9.9999842113425359e+02   1.0000000000000000e+03   0.0000000000000000e+00   0.0000000000000000e+00   -9.9999842113425359e+02   9.6216196791717425e+02   -5.1520667607145322e+02   -1.2604313848382961e+02   7.9756860663208170e+02   1.0378380320828255e+03   5.1520667607145310e+02   1.2604313848382969e+02   -7.9756860663208158e+02   1.7058706601692630e-03
1.0000000000000000e+03   0.0000000000000000e+00   0.0000000000000000e+00   9.9999842113425359e+02   1.0000000000000000e+03   0.0000000000000000e+00   0.0000000000000000e+00   -9.9999842113425359e+02   9.6216196791717425e+02   -7.2127843450607804e+02   -3.6011051778085226e+02   5.1722172132708954e+02   1.0378380320828257e+03   7.2127843450607804e+02   3.6011051778085226e+02   -5.1722172132708965e+02   3.1419303027076966e-04
1.0000000000000000e+03   0.0000000000000000e+00   0.0000000000000000e+00   9.9999842113425359e+02   1.0000000000000000e+03   0.0000000000000000e+00   0.0000000000000000e+00   -9.9999842113425359e+02   9.6216196791717425e+02   -4.0999747433438785e+02   5.8599638001567450e+02   6.3714267457174583e+02   1.0378380320828255e+03   4.0999747433438785e+02   -5.8599638001567439e+02   -6.3714267457174583e+02   6.0195900656699803e-04
1.0000000000000000e+03   0.0000000000000000e+00   0.0000000000000000e+00   9.9999842113425359e+02   1.0000000000000000e+03   0.0000000000000000e+00   0.0000000000000000e+00   -9.9999842113425359e+02   9.6216196791717425e+02   -7.3292644724265881e+02   4.0044790885781231e+02   4.6893578380856053e+02   1.0378380320828255e+03   7.3292644724265892e+02   -4.0044790885781231e+02   -4.6893578380856059e+02   2.4158559063327064e-04
1.0000000000000000e+03   0.0000000000000000e+00   0.0000000000000000e+00   9.9999842113425359e+02   1.0000000000000000e+03   0.0000000000000000e+00   0.0000000000000000e+00   -9.9999842113425359e+02   9.6216196791717425e+02   -9.2496525309565811e+02   -1.0817761714449014e+02   2.2400303084359027e+02   1.0378380320828257e+03   9.2496525309565811e+02   1.0817761714448997e+02   -2.2400303084359038e+02   4.7598219431070848e-05
1.0000000000000000e+03   0.0000000000000000e+00   0.0000000000000000e+00   9.9999842113425359e+02   1.0000000000000000e+03   0.0000000000000000e+00   0.0000000000000000e+00   -9.9999842113425359e+02   9.6216196791717311e+02   -6.0188623589001008e+02   -2.0316985791614502e+02   7.1686500960290982e+02   1.0378380320828269e+03   6.0188623589001020e+02   2.0316985791614553e+02   -7.1686500960291039e+02   9.6312856814759294e-04
1.0000000000000000e+03   0.0000000000000000e+00   0.0000000000000000e+00   9.9999842113425359e+02   1.0000000000000000e+03   0.0000000000000000e+00   0.0000000000000000e+00   -9.9999842113425359e+02   9.6216196791717437e+02   -6.0753741131782351e+02   -3.2316410609207247e+02   6.6626100628465349e+02   1.0378380320828255e+03   6.0753741131782351e+02   3.2316410609207242e+02   -6.6626100628465349e+02   7.1020091150436940e-04
1.0000000000000000e+03   0.0000000000000000e+00   0.0000000000000000e+00   9.9999842113425359e+02   1.0000000000000000e+03   0.0000000000000000e+00   0.0000000000000000e+00   -9.9999842113425359e+02   9.6216196791717448e+02   6.2910277650297935e+01   -9.5075640875775468e+02   9.7698629900879666e+01   1.0378380320828257e+03   -6.2910277650298013e+01   9.5075640875775491e+02   -9.7698629900879837e+01   1.1909677062895286e-05
1.0000000000000000e+03   0.0000000000000000e+00   0.0000000000000000e+00   9.9999842113425359e+02   1.0000000000000000e+03   0.0000000000000000e+00   0.0000000000000000e+00   -9.9999842113425359e+02   9.6216196791717471e+02   2.0687561727971946e+01   2.1335897777029359e+02   9.3353652607011372e+02   1.0378380320828255e+03   -2.0687561727972021e+01   -2.1335897777029419e+02   -9.3353652607011372e+02   1.4114529425476894e-02
1.0000000000000000e+03   0.0000000000000000e+00   0.0000000000000000e+00   9.9999842113425359e+02   1.0000000000000000e+03   0.0000000000000000e+00   0.0000000000000000e+00   -9.9999842113425359e+02   9.6216196791717459e+02   -4.1822317591093400e+02   4.4556499140140403e+02   7.3756470067440762e+02   1.0378380320828255e+03   4.1822317591093378e+02   -4.4556499140140403e+02   -7.3756470067440750e+02   1.1010346514492566e-03
1.0000000000000000e+03   0.0000000000000000e+00   0.0000000000000000e+00   9.9999842113425359e+02   1.0000000000000000e+03   0.0000000000000000e+00   0.0000000000000000e+00   -9.9999842113425359e+02   9.6216196791717414e+02   2.9573209824078464e+02   -8.5850931243623938e+02   -3.0486843169283327e+02   1.0378380320828260e+03   -2.9573209824078481e+02   8.5850931243623927e+02   3.0486843169283321e+02   8.8958778817094337e-05
1.0000000000000000e+03   0.0000000000000000e+00   0.0000000000000000e+00   9.9999842113425359e+02   1.0000000000000000e+03   0.0000000000000000e+00   0.0000000000000000e+00   -9.9999842113425359e+02   9.6216196791717425e+02   2.3410875790317657e+01   6.3559656777353183e+01   -9.5543318711334530e+02   1.0378380320828255e+03   -2.3410875790317704e+01   -6.3559656777353155e+01   9.5543318711334530e+02   1.3123238784601771e-01
1.0000000000000000e+03   0.0000000000000000e+00   0.0000000000000000e+00   9.9999842113425359e+02   1.0000000000000000e+03   0.0000000000000000e+00   0.0000000000000000e+00   -9.9999842113425359e+02   9.6216196791717437e+02   3.4121547446078188e+02   -8.8442476575658623e+02   1.3713244626054410e+02   1.0378380320828257e+03   -3.4121547446078182e+02   8.8442476575658611e+02   -1.3713244626054421e+02   1.9759503350415417e-05
1.0000000000000000e+03   0.0000000000000000e+00   0.0000000000000000e+00   9.9999842113425359e+02   1.0000000000000000e+03   0.0000000000000000e+00   0.0000000000000000e+00   -9.9999842113425359e+02   9.6216196791717425e+02   -1.1879020003764687e+02   -2.0385905649866405e+02   -9.2831613557611922e+02   1.0378380320828255e+03   1.1879020003764707e+02   2.0385905649866413e+02   9.2831613557611922e+02   1.1548842872808817e-02
1.0000000000000000e+03   0.0000000000000000e+00   0.0000000000000000e+00   9.9999842113425359e+02   1.0000000000000000e+03   0.0000000000000000e+00   0.0000000000000000e+00   -9.9999842113425359e+02   9.6216196791717425e+02   -9.1044040422350338e+02   2.9540910036552162e+02   -3.5668023369201094e+01   1.0378380320828257e+03   9.1044040422350338e+02   -2.9540910036552168e+02   3.5668023369201052e+01   5.0310299937503471e-06
1.0000000000000000e+03   0.0000000000000000e+00   0.0000000000000000e+00   9.9999842113425359e+02   1.0000000000000000e+03   0.0000000000000000e+00   0.0000000000000000e+00   -9.9999842113425359e+02   9.6216196791717380e+02   8.0538305733539872e+01   9.5144094291123224e+02   -7.5592245463705012e+01   1.0378380320828264e+03   -8.0538305733539971e+01   -9.5144094291123224e+02   7.5592245463705012e+01   8.7089219193421219e-06
1.0000000000000000e+03   0.0000000000000000e+00   0.0000000000000000e+00   9.9999842113425359e+02   1.0000000000000000e+03   0.0000000000000000e+00   0.0000000000000000e+00   -9.9999842113425359e+02   9.6216196791717346e+02   -8.7119762783041381e+02   -2.6745999253829018e+02   -2.9482252248864182e+02   1.0378380320828264e+03   8.7119762783041438e+02   2.6745999253829041e+02   2.9482252248864182e+02   8.2874952465784336e-05
1.0000000000000000e+03   0.0000000000000000e+00   0.0000000000000000e+00   9.9999842113425359e+02   1.0000000000000000e+03   0.0000000000000000e+00   0.0000000000000000e+00   -9.9999842113425359e+02   9.6216196791717471e+02   7.7207737340579536e+02   -2.4097627173128754e+02   -5.1309593649704982e+02   1.0378380320828253e+03   -7.7207737340579536e+02   2.4097627173128748e+02   5.1309593649705005e+02   3.0728201590183701e-04
1.0000000000000000e+03   0.0000000000000000e+00   0.0000000000000000e+00   9.9999842113425359e+02   1.0000000000000000e+03   0.0000000000000000e+00   0.0000000000000000e+00   -9.9999842113425359e+02   9.6216196791717425e+02   -5.9314201260123673e+02   -2.4850472133135617e+02   -7.0983690413775264e+02   1.0378380320828257e+03   5.9314201260123662e+02   2.4850472133135600e+02   7.0983690413775264e+02   9.2164857101772373e-04
1.0000000000000000e+03   0.0000000000000000e+00   0.0000000000000000e+00   9.9999842113425359e+02   1.0000000000000000e+03   0.0000000000000000e+00   0.0000000000000000e+00   -9.9999842113425359e+02   9.6216196791717425e+02   1.8436439369492382e+02   7.7314550432205544e+02   5.3450563476598336e+02   1.0378380320828255e+03   -1.8436439369492385e+02   -7.7314550432205544e+02   -5.3450563476598336e+02   3.4479473619454629e-04
1.0000000000000000e+03   0.0000000000000000e+00   0.0000000000000000e+00   9.9999842113425359e+02   1.0000000000000000e+03   0.0000000000000000e+00   0.0000000000000000e+00   -9.9999842113425359e+02   9.6216196791717425e+02   -4.1352632232238074e+02   3.1406102187937830e+02   8.0486155914858762e+02   1.0378380320828255e+03   4.1352632232238113e+02   -3.1406102187937779e+02   -8.0486155914858784e+02   1.8120759531719296e-03
1.0000000000000000e+03   0.0000000000000000e+00   0.0000000000000000e+00   9.9999842113425359e+02   1.0000000000000000e+03   0.0000000000000000e+00   0.0000000000000000e+00   -9.9999842113425359e+02   9.6216196791716027e+02   -1.1230819837388741e+02   1.7244870350552750e+02   9.3546180432436654e+02   1.0378380320828398e+03   1.1230819837388778e+02   -1.7244870350552520e+02   -9.3546180432436302e+02   1.5358593804339843e-02
1.0000000000000000e+03   0.0000000000000000e+00   0.0000000000000000e+00   9.9999842113425359e+02   1.0000000000000000e+03   0.0000000000000000e+00   0.0000000000000000e+00   -9.9999842113425359e+02   9.6216196791717448e+02   7.1552256554834355e+02   4.6557258675728218e+02   4.3440775633468968e+02   1.0378380320828255e+03   -7.1552256554834355e+02   -4.6557258675728218e+02   -4.3440775633468968e+02   1.9916472195708794e-04
1.0000000000000000e+03   0.0000000000000000e+00   0.0000000000000000e+00   9.9999842113425359e+02   1.0000000000000000e+03   0.0000000000000000e+00   0.0000000000000000e+00   -9.9999842113425359e+02   9.6216196791717471e+02   -4.0967873714349548e+02   -4.9321819059653728e+02   7.1157545131186146e+02   1.0378380320828253e+03   4.0967873714349554e+02   4.9321819059653870e+02   -7.1157545131186396e+02   9.3168386366012735e-04
1.0000000000000000e+03   0.0000000000000000e+00   0.0000000000000000e+00   9.9999842113425359e+02   1.0000000000000000e+03   0.0000000000000000e+00   0.0000000000000000e+00   -9.9999842113425359e+02   9.6216196791717402e+02   -2.8665939061220098e+02   6.9649302595792858e+02   -5.9174684847348169e+02   1.0378380320828260e+03   2.8665939061219854e+02   -6.9649302595792608e+02   5.9174684847348078e+02   4.6911719017578860e-04
1.0000000000000000e+03   0.0000000000000000e+00   0.0000000000000000e+00   9.9999842113425359e+02   1.0000000000000000e+03   0.0000000000000000e+00   0.0000000000000000e+00   -9.9999842113425359e+02   9.6216196791717448e+02   6.3730354852968458e+02   2.0116278540283182e+02   6.8616193053311838e+02   1.0378380320828255e+03   -6.3730354852968458e+02   -2.0116278540283182e+02   -6.8616193053311827e+02   7.9809373917457327e-04
1.0000000000000000e+03   0.0000000000000000e+00   0.0000000000000000e+00   9.9999842113425359e+02   1.0000000000000000e+03   0.0000000000000000e+00   0.0000000000000000e+00   -9.9999842113425359e+02   9.6216196791717437e+02   -3.6876912087987387e+02   8.8013088723463375e+02   8.2579845807258835e+01   1.0378380320828255e+03   3.6876912087987375e+02   -8.8013088723463386e+02   -8.2579845807258607e+01   9.6296174316631856e-06
1.0000000000000000e+03   0.0000000000000000e+00   0.0000000000000000e+00   9.9999842113425359e+02   1.0000000000000000e+03   0.0000000000000000e+00   0.0000000000000000e+00   -9.9999842113425359e+02   9.6216196791717596e+02   -7.6225076310105749e+02   5.7997829314791761e+02   -6.2791513420418577e+00   1.0378380320828242e+03   7.6225076310105590e+02   -5.7997829314791670e+02   6.2791513420424403e+00   4.0166161735270712e-06
1.0000000000000000e+03   0.0000000000000000e+00   0.0000000000000000e+00   9.9999842113425359e+02   1.0000000000000000e+03   0.0000000000000000e+00   0.0000000000000000e+00   -9.9999842113425359e+02   9.6216196791717425e+02   -3.2554588989123459e+02   3.8797261255185549e+02   -8.1298068832974241e+02   1.0378380320828257e+03   3.2554588989123459e+02   -3.8797261255185543e+02   8.1298068832974241e+02   1.9429729236463480e-03
1.0000000000000000e+03   0.0000000000000000e+00   0.0000000000000000e+00   9.9999842113425359e+02   1.0000000000000000e+03   0.0000000000000000e+00   0.0000000000000000e+00   -9.9999842113425359e+02   9.6216196791717516e+02   -3.1476981585787246e+02   -5.8304051508960777e+02   -6.9168214875138585e+02   1.0378380320828251e+03   3.1476981585787235e+02   5.8304051508960777e+02   6.9168214875138563e+02   8.2488239644751033e-04
