1.0000000000000000e+03   0.0000000000000000e+00   0.0000000000000000e+00   8.1143721824575368e+02   1.0000000000000000e+03   0.0000000000000000e+00   0.0000000000000000e+00   -8.1143721824575368e+02   9.9999999999999955e+02   2.2184661217465882e+02   8.8965373212651139e+02   -3.9910233973254969e+02   1.0000000000000000e+03   -2.2184661217465884e+02   -8.8965373212651150e+02   3.9910233973254958e+02   1.1407085693943280e+00
1.0000000000000000e+03   0.0000000000000000e+00   0.0000000000000000e+00   8.1143721824575368e+02   1.0000000000000000e+03   0.0000000000000000e+00   0.0000000000000000e+00   -8.1143721824575368e+02   1.0000000000000000e+03   -5.6382603860732797e+02   -7.8157503961926307e+02   2.6687640516260615e+02   1.0000000000000003e+03   5.6382603860732809e+02   7.8157503961926329e+02   -2.6687640516260615e+02   2.3981909499940945e+00
1.0000000000000000e+03   0.0000000000000000e+00   0.0000000000000000e+00   8.1143721824575368e+02   1.0000000000000000e+03   0.0000000000000000e+00   0.0000000000000000e+00   -8.1143721824575368e+02   9.9999999999999795e+02   -4.8123781361386318e+02   5.6093906443425192e+02   -6.7360217691139621e+02   1.0000000000000024e+03   4.8123781361386290e+02   -5.6093906443425192e+02   6.7360217691139621e+02   1.1118632740460421e+00
1.0000000000000000e+03   0.0000000000000000e+00   0.0000000000000000e+00   8.1143721824575368e+02   1.0000000000000000e+03   0.0000000000000000e+00   0.0000000000000000e+00   -8.1143721824575368e+02   1.0000000000000001e+03   9.0206246991076262e+02   1.2095830743720299e+02   -4.1428824294254593e+02   1.0000000000000001e+03   -9.0206246991076262e+02   -1.2095830743720299e+02   4.1428824294254576e+02   1.1350788295328518e+00
1.0000000000000000e+03   0.0000000000000000e+00   0.0000000000000000e+00   8.1143721824575368e+02   1.0000000000000000e+03   0.0000000000000000e+00   0.0000000000000000e+00   -8.1143721824575368e+02   1.0000000000000014e+03   9.1144992864922835e+02   -4.0737533149421591e+02   -5.7329982167230987e+01   1.0000000000000014e+03   -9.1144992864922858e+02   4.0737533149421620e+02   5.7329982167232224e+01   1.4571658216785854e+00
1.0000000000000000e+03   0.0000000000000000e+00   0.0000000000000000e+00   8.1143721824575368e+02   1.0000000000000000e+03   0.0000000000000000e+00   0.0000000000000000e+00   -8.1143721824575368e+02   1.0000000000000003e+03   -3.7466723896193963e+02   8.8907802119642122e+02   -2.6295834703255235e+02   1.0000000000000000e+03   3.7466723896193963e+02   -8.8907802119642145e+02   2.6295834703255235e+02   1.2182757407922098e+00
1.0000000000000000e+03   0.0000000000000000e+00   0.0000000000000000e+00   8.1143721824575368e+02   1.0000000000000000e+03   0.0000000000000000e+00   0.0000000000000000e+00   -8.1143721824575368e+02   1.0000000000000001e+03   2.3493411950920409e+02   -9.6726977028306965e+02   9.5799326651977069e+01   1.0000000000000001e+03   -2.3493411950920390e+02   9.6726977028306965e+02   -9.5799326651977069e+01   1.7813044448652795e+00
1.0000000000000000e+03   0.0000000000000000e+00   0.0000000000000000e+00   8.1143721824575368e+02   1.0000000000000000e+03   0.0000000000000000e+00   0.0000000000000000e+00   -8.1143721824575368e+02   1.0000000000000000e+03   -2.7144013630301976e+02   9.3340710653469887e+02   -2.3463543183909650e+02   1.0000000000000002e+03   2.7144013630301970e+02   -9.3340710653469887e+02   2.3463543183909650e+02   1.2413652315027859e+00
1.0000000000000000e+03   0.0000000000000000e+00   0.0000000000000000e+00   8.1143721824575368e+02   1.0000000000000000e+03   0.0000000000000000e+00   0.0000000000000000e+00   -8.1143721824575368e+02   1.0000000000000010e+03   -3.7125084099667936e+02   -2.8253056326980999e+02   -8.8449514067500695e+02   9.9999999999999682e+02   3.7125084099667896e+02   2.8253056326981135e+02   8.8449514067500411e+02   1.1727435992722473e+00
1.0000000000000000e+03   0.0000000000000000e+00   0.0000000000000000e+00   8.1143721824575368e+02   1.0000000000000000e+03   0.0000000000000000e+00   0.0000000000000000e+00   -8.1143721824575368e+02   9.9999999999999977e+02   -3.1849443540676748e+02   4.1438157935679305e+02   8.5254416970893362e+02   1.0000000000000005e+03   3.1849443540676742e+02   -4.1438157935679317e+02   -8.5254416970893328e+02   1.5253282086453664e+01
1.0000000000000000e+03   0.0000000000000000e+00   0.0000000000000000e+00   8.1143721824575368e+02   1.0000000000000000e+03   0.0000000000000000e+00   0.0000000000000000e+00   -8.1143721824575368e+02   1.0000000000000001e+03   7.5740295541625144e+01   -5.9920823961336157e+02   -7.9699137586972904e+02   1.0000000000000001e+03   -7.5740295541625045e+01   5.9920823961336157e+02   7.9699137586972904e+02   1.1402079606865794e+00
1.0000000000000000e+03   0.0000000000000000e+00   0.0000000000000000e+00   8.1143721824575368e+02   1.0000000000000000e+03   0.0000000000000000e+00   0.0000000000000000e+00   -8.1143721824575368e+02   9.9999999999999898e+02   4.3687623728329521e+02   7.2491704757968057e+02   -5.3255683961953582e+02   9.9999999999999977e+02   -4.3687623728329470e+02   -7.2491704757967955e+02   5.3255683961953730e+02   1.1086735352967916e+00
1.0000000000000000e+03   0.0000000000000000e+00   0.0000000000000000e+00   8.1143721824575368e+02   1.0000000000000000e+03   0.0000000000000000e+00   0.0000000000000000e+00   -8.1143721824575368e+02   9.9999999999999955e+02   -7.9064179035641928e+01   -2.6197060137732882e+02   -9.6182255099754275e+02   1.0000000000000000e+03   7.9064179035641928e+01   2.6197060137732893e+02   9.6182255099754252e+02   1.2092259818611513e+00
1.0000000000000000e+03   0.0000000000000000e+00   0.0000000000000000e+00   8.1143721824575368e+02   1.0000000000000000e+03   0.0000000000000000e+00   0.0000000000000000e+00   -8.1143721824575368e+02   9.9999999999999920e+02   -1.4192598503003384e+02   9.8951557164078281e+02   -2.6425522770063612e+01   1.0000000000000005e+03   1.4192598503003583e+02   -9.8951557164078235e+02   2.6425522770063488e+01   1.5102114297987259e+00
1.0000000000000000e+03   0.0000000000000000e+00   0.0000000000000000e+00   8.1143721824575368e+02   1.0000000000000000e+03   0.0000000000000000e+00   0.0000000000000000e+00   -8.1143721824575368e+02   9.9999999999999989e+02   -8.9132325594660085e+02   -8.3447353079422442e+01   -4.4560268476837973e+02   9.9999999999999932e+02   8.9132325594660028e+02   8.3447353079422712e+01   4.4560268476837956e+02   1.1251638369125958e+00
1.0000000000000000e+03   0.0000000000000000e+00   0.0000000000000000e+00   8.1143721824575368e+02   1.0000000000000000e+03   0.0000000000000000e+00   0.0000000000000000e+00   -8.1143721824575368e+02   9.9999999999999989e+02   4.7261514275279717e+02   -8.2596059290768233e+02   3.0725622175041866e+02   1.0000000000000001e+03   -4.7261514275279723e+02   8.2596059290768267e+02   -3.0725622175041866e+02   2.6035702871029804e+00
1.0000000000000000e+03   0.0000000000000000e+00   0.0000000000000000e+00   8.1143721824575368e+02   1.0000000000000000e+03   0.0000000000000000e+00   0.0000000000000000e+00   -8.1143721824575368e+02   9.9999999999999943e+02   6.8503235847608323e+02   -5.3329680163379317e+02   4.9629381338866409e+02   1.0000000000000005e+03   -6.8503235847608346e+02   5.3329680163379317e+02   -4.9629381338866386e+02   4.0984127754101687e+00
1.0000000000000000e+03   0.0000000000000000e+00   0.0000000000000000e+00   8.1143721824575368e+02   1.0000000000000000e+03   0.0000000000000000e+00   0.0000000000000000e+00   -8.1143721824575368e+02   9.9999999999999864e+02   -3.8935402364077771e+02   6.8983828238403532e+02   6.1033511158393912e+02   1.0000000000000031e+03   3.8935402364077561e+02   -6.8983828238403817e+02   -6.1033511158393651e+02   5.7539563049890567e+00
1.0000000000000000e+03   0.0000000000000000e+00   0.0000000000000000e+00   8.1143721824575368e+02   1.0000000000000000e+03   0.0000000000000000e+00   0.0000000000000000e+00   -8.1143721824575368e+02   1.0000000000000000e+03   2.2547331142767720e+02   9.7374907932948565e+02   -3.0933417832762942e+01   9.9999999999999989e+02   -2.2547331142767720e+02   -9.7374907932948565e+02   3.0933417832762931e+01   1.5021323299679086e+00
1.0000000000000000e+03   0.0000000000000000e+00   0.0000000000000000e+00   8.1143721824575368e+02   1.0000000000000000e+03   0.0000000000000000e+00   0.0000000000000000e+00   -8.1143721824575368e+02   1.0000000000000008e+03   5.4010651005877946e+02   -8.3867631264501188e+02   -6.9923961560350278e+01   9.9999999999999841e+02   -5.4010651005877958e+02   8.3867631264501154e+02   6.9923961560348516e+01   1.4370641263923740e+00
1.0000000000000000e+03   0.0000000000000000e+00   0.0000000000000000e+00   8.1143721824575368e+02   1.0000000000000000e+03   0.0000000000000000e+00   0.0000000000000000e+00   -8.1143721824575368e+02   1.0000000000000003e+03   -2.3126063744246909e+02   9.4503660254141334e+02   2.3109889101137315e+02   9.9999999999999977e+02   2.3126063744246935e+02   -9.4503660254141323e+02   -2.3109889101137301e+02   2.2386070645592291e+00
1.0000000000000000e+03   0.0000000000000000e+00   0.0000000000000000e+00   8.1143721824575368e+02   1.0000000000000000e+03   0.0000000000000000e+00   0.0000000000000000e+00   -8.1143721824575368e+02   9.9999999999999989e+02   4.7622070202829843e+02   -8.5588868586100796e+02   -2.0162033720533100e+02   9.9999999999999989e+02   -4.7622070202829843e+02   8.5588868586100796e+02   2.0162033720533100e+02   1.2717735569131121e+00
1.0000000000000000e+03   0.0000000000000000e+00   0.0000000000000000e+00   8.1143721824575368e+02   1.0000000000000000e+03   0.0000000000000000e+00   0.0000000000000000e+00   -8.1143721824575368e+02   9.9999999999999966e+02   9.1185193169483193e+02   4.0404490224622003e+02   -7.2499183672962388e+01   9.9999999999999977e+02   -9.1185193169483193e+02   -4.0404490224622015e+02   7.2499183672962204e+01   1.4330571157400043e+00
1.0000000000000000e+03   0.0000000000000000e+00   0.0000000000000000e+00   8.1143721824575368e+02   1.0000000000000000e+03   0.0000000000000000e+00   0.0000000000000000e+00   -8.1143721824575368e+02   9.9999999999999966e+02   -3.4846847112399439e+02   -3.4939496672045357e+02   -8.6975585187046579e+02   1.0000000000000002e+03   3.4846847112399399e+02   3.4939496672045357e+02   8.6975585187046579e+02   1.1665925123550880e+00
1.0000000000000000e+03   0.0000000000000000e+00   0.0000000000000000e+00   8.1143721824575368e+02   1.0000000000000000e+03   0.0000000000000000e+00   0.0000000000000000e+00   -8.1143721824575368e+02   9.9999999999999966e+02   4.4881973928039156e+02   -8.8251970377245777e+02   1.4036443312198227e+02   1.0000000000000008e+03   -4.4881973928039145e+02   8.8251970377245800e+02   -1.4036443312198264e+02   1.9101339719049588e+00
1.0000000000000000e+03   0.0000000000000000e+00   0.0000000000000000e+00   8.1143721824575368e+02   1.0000000000000000e+03   0.0000000000000000e+00   0.0000000000000000e+00   -8.1143721824575368e+02   1.0000000000000005e+03   6.4468175389223109e+02   2.8765702096832615e+02   -7.0825223930889581e+02   1.0000000000000003e+03   -6.4468175389223063e+02   -2.8765702096832615e+02   7.0825223930889581e+02   1.1176026324987454e+00
1.0000000000000000e+03   0.0000000000000000e+00   0.0000000000000000e+00   8.1143721824575368e+02   1.0000000000000000e+03   0.0000000000000000e+00   0.0000000000000000e+00   -8.1143721824575368e+02   9.9999999999999693e+02   -8.6944068958783134e+02   -1.8629836984150631e+02   -4.5754580610407464e+02   1.0000000000000019e+03   8.6944068958783305e+02   1.8629836984150791e+02   4.5754580610407476e+02   1.1219618939637466e+00
1.0000000000000000e+03   0.0000000000000000e+00   0.0000000000000000e+00   8.1143721824575368e+02   1.0000000000000000e+03   0.0000000000000000e+00   0.0000000000000000e+00   -8.1143721824575368e+02   9.9999999999999670e+02   3.0040133697392150e+02   9.1731803815035289e+02   -2.6128339715386267e+02   1.0000000000000009e+03   -3.0040133697392434e+02   -9.1731803815035119e+02   2.6128339715386841e+02   1.2195677019563367e+00
1.0000000000000000e+03   0.0000000000000000e+00   0.0000000000000000e+00   8.1143721824575368e+02   1.0000000000000000e+03   0.0000000000000000e+00   0.0000000000000000e+00   -8.1143721824575368e+02   9.9999999999999886e+02   -2.0103618168306038e+01   -9.7958583283272799e+02   -1.9997449999925868e+02   9.9999999999999943e+02   2.0103618168306230e+01   9.7958583283272753e+02   1.9997449999925959e+02   1.2733928492798050e+00
1.0000000000000000e+03   0.0000000000000000e+00   0.0000000000000000e+00   8.1143721824575368e+02   1.0000000000000000e+03   0.0000000000000000e+00   0.0000000000000000e+00   -8.1143721824575368e+02   9.9999999999999829e+02   -4.5581207006027574e+02   6.1337218031894383e+02   -6.4497463918990411e+02   9.9999999999999704e+02   4.5581207006028177e+02   -6.1337218031894304e+02   6.4497463918990286e+02   1.1085178149581905e+00
1.0000000000000000e+03   0.0000000000000000e+00   0.0000000000000000e+00   8.1143721824575368e+02   1.0000000000000000e+03   0.0000000000000000e+00   0.0000000000000000e+00   -8.1143721824575368e+02   1.0000000000000000e+03   -8.1915213067899333e+02   5.6980798852649468e+02   -6.5505747957377423e+01   1.0000000000000000e+03   8.1915213067899333e+02   -5.6980798852649468e+02   6.5505747957377466e+01   1.4440199594332428e+00
1.0000000000000000e+03   0.0000000000000000e+00   0.0000000000000000e+00   8.1143721824575368e+02   1.0000000000000000e+03   0.0000000000000000e+00   0.0000000000000000e+00   -8.1143721824575368e+02   9.9999999999999909e+02   2.4947096369595047e+02   -9.5395689022679858e+02   1.6647176896227026e+02   9.9999999999999841e+02   -2.4947096369594968e+02   9.5395689022679824e+02   -1.6647176896227023e+02   1.9947806377068404e+00
1.0000000000000000e+03   0.0000000000000000e+00   0.0000000000000000e+00   8.1143721824575368e+02   1.0000000000000000e+03   0.0000000000000000e+00   0.0000000000000000e+00   -8.1143721824575368e+02   1.0000000000000005e+03   5.9877625255854400e+02   -4.3396713544309483e+02   6.7314328692133665e+02   1.0000000000000000e+03   -5.9877625255854412e+02   4.3396713544309472e+02   -6.7314328692133665e+02   7.1257481430927605e+00
1.0000000000000000e+03   0.0000000000000000e+00   0.0000000000000000e+00   8.1143721824575368e+02   1.0000000000000000e+03   0.0000000000000000e+00   0.0000000000000000e+00   -8.1143721824575368e+02   1.0000000000000000e+03   7.8522046345988906e+02   2.2835527943654122e+02   5.7555629621896821e+02   1.0000000000000003e+03   -7.8522046345988906e+02   -2.2835527943654131e+02   -5.7555629621896867e+02   5.1564411953536329e+00
1.0000000000000000e+03   0.0000000000000000e+00   0.0000000000000000e+00   8.1143721824575368e+02   1.0000000000000000e+03   0.0000000000000000e+00   0.0000000000000000e+00   -8.1143721824575368e+02   9.9999999999999989e+02   2.9535364332691728e+02   3.4328931596108288e+02   -8.9157222417507364e+02   9.9999999999999977e+02   -2.9535364332691728e+02   -3.4328931596108282e+02   8.9157222417507364e+02   1.1757904821929630e+00
1.0000000000000000e+03   0.0000000000000000e+00   0.0000000000000000e+00   8.1143721824575368e+02   1.0000000000000000e+03   0.0000000000000000e+00   0.0000000000000000e+00   -8.1143721824575368e+02   1.0000000000000008e+03   2.3929167312712065e+02   -9.6921566364534829e+02   5.7817406691500658e+01   1.0000000000000005e+03   -2.3929167312712076e+02   9.6921566364534863e+02   -5.7817406691501368e+01   1.6852916515457625e+00
1.0000000000000000e+03   0.0000000000000000e+00   0.0000000000000000e+00   8.1143721824575368e+02   1.0000000000000000e+03   0.0000000000000000e+00   0.0000000000000000e+00   -8.1143721824575368e+02   9.9999999999999966e+02   6.5902131825465256e+02   -1.3634268216142667e+02   7.3965122531293616e+02   9.9999999999999977e+02   -6.5902131825465233e+02   1.3634268216142644e+02   -7.3965122531293616e+02   9.1712724406718795e+00
1.0000000000000000e+03   0.0000000000000000e+00   0.0000000000000000e+00   8.1143721824575368e+02   1.0000000000000000e+03   0.0000000000000000e+00   0.0000000000000000e+00   -8.1143721824575368e+02   1.0000000000000003e+03   9.0478377073696720e+02   -2.0468758409162578e+02   3.7343229791988961e+02   1.0000000000000003e+03   -9.0478377073696720e+02   2.0468758409162578e+02   -3.7343229791988949e+02   3.0108145172310175e+00
1.0000000000000000e+03   0.0000000000000000e+00   0.0000000000000000e+00   8.1143721824575368e+02   1.0000000000000000e+03   0.0000000000000000e+00   0.0000000000000000e+00   -8.1143721824575368e+02   9.9999999999999989e+02   -8.4168110944847649e+02   -1.9395676672431540e+02   -5.0392067097850941e+02   1.0000000000000000e+03   8.4168110944847660e+02   1.9395676672431540e+02   5.0392067097850952e+02   1.1124039281280835e+00
1.0000000000000000e+03   0.0000000000000000e+00   0.0000000000000000e+00   8.1143721824575368e+02   1.0000000000000000e+03   0.0000000000000000e+00   0.0000000000000000e+00   -8.1143721824575368e+02   1.0000000000000009e+03   -6.4810219985027481e+02   -6.3205699819699271e+02   -4.2479389070400032e+02   1.0000000000000005e+03   6.4810219985027425e+02   6.3205699819699305e+02   4.2479389070400066e+02   1.1315022355627828e+00
1.0000000000000000e+03   0.0000000000000000e+00   0.0000000000000000e+00   8.1143721824575368e+02   1.0000000000000000e+03   0.0000000000000000e+00   0.0000000000000000e+00   -8.1143721824575368e+02   1.0000000000000000e+03   8.6867371181293527e+02   -2.2134256774892069e+02   -4.4316566891790279e+02   1.0000000000000001e+03   -8.6867371181293527e+02   2.2134256774892060e+02   4.4316566891790285e+02   1.1258558190571732e+00
1.0000000000000000e+03   0.0000000000000000e+00   0.0000000000000000e+00   8.1143721824575368e+02   1.0000000000000000e+03   0.0000000000000000e+00   0.0000000000000000e+00   -8.1143721824575368e+02   1.0000000000000006e+03   6.3234529503550118e+02   -6.8895589731324617e+02   3.5420553271196275e+02   1.0000000000000006e+03   -6.3234529503550095e+02   6.8895589731324651e+02   -3.5420553271196275e+02   2.8822751423659594e+00
1.0000000000000000e+03   0.0000000000000000e+00   0.0000000000000000e+00   8.1143721824575368e+02   1.0000000000000000e+03   0.0000000000000000e+00   0.0000000000000000e+00   -8.1143721824575368e+02   1.0000000000000000e+03   4.4131080337161995e+02   -2.7915541205682359e+01   8.9691017241788938e+02   9.9999999999999909e+02   -4.4131080337161995e+02   2.7915541205682349e+01   -8.9691017241788927e+02   1.9334023731110005e+01
1.0000000000000000e+03   0.0000000000000000e+00   0.0000000000000000e+00   8.1143721824575368e+02   1.0000000000000000e+03   0.0000000000000000e+00   0.0000000000000000e+00   -8.1143721824575368e+02   9.9999999999999966e+02   4.9533395735062811e+02   -5.6828399881007113e+02   -6.5702353640626973e+02   9.9999999999999966e+02   -4.9533395735062811e+02   5.6828399881007113e+02   6.5702353640626995e+02   1.1097682942022380e+00
1.0000000000000000e+03   0.0000000000000000e+00   0.0000000000000000e+00   8.1143721824575368e+02   1.0000000000000000e+03   0.0000000000000000e+00   0.0000000000000000e+00   -8.1143721824575368e+02   1.0000000000000017e+03   3.8061508643943148e+02   1.2640980199929939e+02   9.1604316379371744e+02   9.9999999999999920e+02   -3.8061508643943182e+02   -1.2640980199929844e+02   -9.1604316379371733e+02   2.1595956109987256e+01
1.0000000000000000e+03   0.0000000000000000e+00   0.0000000000000000e+00   8.1143721824575368e+02   1.0000000000000000e+03   0.0000000000000000e+00   0.0000000000000000e+00   -8.1143721824575368e+02   1.0000000000000007e+03   -9.5957323493767944e+02   -1.2103895511054318e+02   2.5406916014539374e+02   1.0000000000000019e+03   9.5957323493767842e+02   1.2103895511054527e+02   -2.5406916014539729e+02   2.3388165426710463e+00
1.0000000000000000e+03   0.0000000000000000e+00   0.0000000000000000e+00   8.1143721824575368e+02   1.0000000000000000e+03   0.0000000000000000e+00   0.0000000000000000e+00   -8.1143721824575368e+02   9.9999999999999864e+02   4.7305220842355858e+01   -2.8050007279581521e+01   9.9847772793020772e+02   9.9999999999999864e+02   -4.7305220842354089e+01   2.8050007279582111e+01   -9.9847772793020738e+02   3.7533628974468606e+01
1.0000000000000000e+03   0.0000000000000000e+00   0.0000000000000000e+00   8.1143721824575368e+02   1.0000000000000000e+03   0.0000000000000000e+00   0.0000000000000000e+00   -8.1143721824575368e+02   9.9999999999999977e+02   2.2668208182512603e+02   9.6325916887872415e+02   -1.4397696812510105e+02   1.0000000000000001e+03   -2.2668208182512595e+02   -9.6325916887872415e+02   1.4397696812510100e+02   1.3347897949674019e+00
1.0000000000000000e+03   0.0000000000000000e+00   0.0000000000000000e+00   8.1143721824575368e+02   1.0000000000000000e+03   0.0000000000000000e+00   0.0000000000000000e+00   -8.1143721824575368e+02   1.0000000000000001e+03   2.7605711140532890e+02   -6.1689756406510946e+02   7.3702932553127096e+02   1.0000000000000002e+03   -2.7605711140532890e+02   6.1689756406510958e+02   -7.3702932553127096e+02   9.0752668084596326e+00
1.0000000000000000e+03   0.0000000000000000e+00   0.0000000000000000e+00   8.1143721824575368e+02   1.0000000000000000e+03   0.0000000000000000e+00   0.0000000000000000e+00   -8.1143721824575368e+02   1.0000000000000001e+03   -5.9429692449835704e+02   -4.2638590150619126e+02   -6.8190071750112293e+02   1.0000000000000003e+03   5.9429692449835704e+02   4.2638590150619126e+02   6.8190071750112338e+02   1.1130720523511810e+00
1.0000000000000000e+03   0.0000000000000000e+00   0.0000000000000000e+00   8.1143721824575368e+02   1.0000000000000000e+03   0.0000000000000000e+00   0.0000000000000000e+00   -8.1143721824575368e+02   1.0000000000000000e+03   5.7160038529360907e+02   -4.7077977659832578e+02   -6.7202809575063770e+02   1.0000000000000005e+03   -5.7160038529360952e+02   4.7077977659832550e+02   6.7202809575063770e+02   1.1116459624837791e+00
1.0000000000000000e+03   0.0000000000000000e+00   0.0000000000000000e+00   8.1143721824575368e+02   1.0000000000000000e+03   0.0000000000000000e+00   0.0000000000000000e+00   -8.1143721824575368e+02   1.0000000000000016e+03   4.2370771060780885e+02   2.2774902538835761e+01   9.0550286569719685e+02   1.0000000000000016e+03   -4.2370771060781021e+02   -2.2774902538837406e+01   -9.0550286569719685e+02   2.0305081403188165e+01
1.0000000000000000e+03   0.0000000000000000e+00   0.0000000000000000e+00   8.1143721824575368e+02   1.0000000000000000e+03   0.0000000000000000e+00   0.0000000000000000e+00   -8.1143721824575368e+02   9.9999999999999989e+02   -2.1284909166171380e+02   -1.1071480411680626e+02   -9.7078311497891241e+02   9.9999999999999989e+02   2.1284909166171431e+02   1.1071480411680622e+02   9.7078311497891229e+02   1.2138965283025271e+00
1.0000000000000000e+03   0.0000000000000000e+00   0.0000000000000000e+00   8.1143721824575368e+02   1.0000000000000000e+03   0.0000000000000000e+00   0.0000000000000000e+00   -8.1143721824575368e+02   1.0000000000000002e+03   4.9799737563244213e+02   5.5882045852138015e+02   -6.6309929045441982e+02   1.0000000000000000e+03   -4.9799737563244213e+02   -5.5882045852137992e+02   6.6309929045441982e+02   1.1104861452920647e+00
1.0000000000000000e+03   0.0000000000000000e+00   0.0000000000000000e+00   8.1143721824575368e+02   1.0000000000000000e+03   0.0000000000000000e+00   0.0000000000000000e+00   -8.1143721824575368e+02   9.9999999999999864e+02   9.7740792464802530e+02   6.1758093256451048e+01   -2.0209415318747497e+02   9.9999999999999568e+02   -9.7740792464802780e+02   -6.1758093256449051e+01   2.0209415318747241e+02   1.2713092511949693e+00
1.0000000000000000e+03   0.0000000000000000e+00   0.0000000000000000e+00   8.1143721824575368e+02   1.0000000000000000e+03   0.0000000000000000e+00   0.0000000000000000e+00   -8.1143721824575368e+02   1.0000000000000006e+03   -8.6537646134345368e+02   -2.9743929250028526e+02   4.0328130061981778e+02   1.0000000000000002e+03   8.6537646134345368e+02   2.9743929250028543e+02   -4.0328130061981801e+02   3.2294736236118506e+00
1.0000000000000000e+03   0.0000000000000000e+00   0.0000000000000000e+00   8.1143721824575368e+02   1.0000000000000000e+03   0.0000000000000000e+00   0.0000000000000000e+00   -8.1143721824575368e+02   9.9999999999999966e+02   -4.9993874151540467e+02   4.1269081028138959e+02   -7.6139996706151942e+02   9.9999999999999943e+02   4.9993874151540427e+02   -4.1269081028138930e+02   7.6139996706151953e+02   1.1298246735226742e+00
1.0000000000000000e+03   0.0000000000000000e+00   0.0000000000000000e+00   8.1143721824575368e+02   1.0000000000000000e+03   0.0000000000000000e+00   0.0000000000000000e+00   -8.1143721824575368e+02   9.9999999999999943e+02   -7.8212958098911008e+02   7.6786519952952219e+01   6.1835225308501356e+02   9.9999999999999966e+02   7.8212958098911054e+02   -7.6786519952952148e+01   -6.1835225308501367e+02   5.9062162836912231e+00
1.0000000000000000e+03   0.0000000000000000e+00   0.0000000000000000e+00   8.1143721824575368e+02   1.0000000000000000e+03   0.0000000000000000e+00   0.0000000000000000e+00   -8.1143721824575368e+02   9.9999999999999989e+02   7.1800538404201166e+02   -6.9097619471633732e+02   8.3681101940725100e+01   1.0000000000000006e+03   -7.1800538404201166e+02   6.9097619471633766e+02   -8.3681101940725128e+01   1.7493789455447200e+00
1.0000000000000000e+03   0.0000000000000000e+00   0.0000000000000000e+00   8.1143721824575368e+02   1.0000000000000000e+03   0.0000000000000000e+00   0.0000000000000000e+00   -8.1143721824575368e+02   1.0000000000000002e+03   -2.8447834327641095e+02   -4.9233747493597792e+02   8.2259239175935431e+02   1.0000000000000002e+03   2.8447834327641101e+02   4.9233747493597747e+02   -8.2259239175935454e+02   1.3170750390557298e+01
1.0000000000000000e+03   0.0000000000000000e+00   0.0000000000000000e+00   8.1143721824575368e+02   1.0000000000000000e+03   0.0000000000000000e+00   0.0000000000000000e+00   -8.1143721824575368e+02   9.9999999999999966e+02   -8.5289103008713436e+00   -8.5739872509921861e+02   -5.1456490736088290e+02   9.9999999999999966e+02   8.5289103008714005e+00   8.5739872509921872e+02   5.1456490736088199e+02   1.1108299213033126e+00
1.0000000000000000e+03   0.0000000000000000e+00   0.0000000000000000e+00   8.1143721824575368e+02   1.0000000000000000e+03   0.0000000000000000e+00   0.0000000000000000e+00   -8.1143721824575368e+02   9.9999999999999898e+02   2.6603880491413594e+02   8.7835799373855639e+02   3.9710571528931342e+02   1.0000000000000003e+03   -2.6603880491413599e+02   -8.7835799373855616e+02   -3.9710571528931342e+02   3.1822001869655847e+00
1.0000000000000000e+03   0.0000000000000000e+00   0.0000000000000000e+00   8.1143721824575368e+02   1.0000000000000000e+03   0.0000000000000000e+00   0.0000000000000000e+00   -8.1143721824575368e+02   9.9999999999999932e+02   3.0337985020026230e+02   9.5284164682049720e+02   5.9851964770300148e+00   9.9999999999999977e+02   -3.0337985020026230e+02   -9.5284164682049732e+02   -5.9851964770302875e+00   1.5719527772924140e+00
1.0000000000000000e+03   0.0000000000000000e+00   0.0000000000000000e+00   8.1143721824575368e+02   1.0000000000000000e+03   0.0000000000000000e+00   0.0000000000000000e+00   -8.1143721824575368e+02   9.9999999999999955e+02   -2.3320172706107350e+01   3.4360832827066110e+02   -9.3881406374638311e+02   1.0000000000000002e+03   2.3320172706107233e+01   -3.4360832827066127e+02   9.3881406374638334e+02   1.1976476130201905e+00
1.0000000000000000e+03   0.0000000000000000e+00   0.0000000000000000e+00   8.1143721824575368e+02   1.0000000000000000e+03   0.0000000000000000e+00   0.0000000000000000e+00   -8.1143721824575368e+02   9.9999999999999648e+02   -2.9086446515103916e+02   -9.3506376385751901e+02   2.0257339517568425e+02   9.9999999999999295e+02   2.9086446515103609e+02   9.3506376385752446e+02   -2.0257339517568747e+02   2.1244959412566642e+00
1.0000000000000000e+03   0.0000000000000000e+00   0.0000000000000000e+00   8.1143721824575368e+02   1.0000000000000000e+03   0.0000000000000000e+00   0.0000000000000000e+00   -8.1143721824575368e+02   9.9999999999999966e+02   -9.3585321891443766e+02   -2.8266218549802858e+02   -2.1038821625025352e+02   9.9999999999999955e+02   9.3585321891443743e+02   2.8266218549802846e+02   2.1038821625025321e+02   1.2633158142039067e+00
1.0000000000000000e+03   0.0000000000000000e+00   0.0000000000000000e+00   8.1143721824575368e+02   1.0000000000000000e+03   0.0000000000000000e+00   0.0000000000000000e+00   -8.1143721824575368e+02   9.9999999999999909e+02   -8.8639584663986761e+02   -3.9004172692151189e+02   -2.4930345829850694e+02   9.9999999999999909e+02   8.8639584663991855e+02   3.9004172692150422e+02   2.4930345829850586e+02   1.2290746823576861e+00
1.0000000000000000e+03   0.0000000000000000e+00   0.0000000000000000e+00   8.1143721824575368e+02   1.0000000000000000e+03   0.0000000000000000e+00   0.0000000000000000e+00   -8.1143721824575368e+02   1.0000000000000011e+03   2.4954943665633397e+02   9.5997876747776013e+02   1.2707558639009416e+02   1.0000000000000005e+03   -2.4954943665633539e+02   -9.5997876747775990e+02   -1.2707558639009399e+02   1.8697450875447599e+00
1.0000000000000000e+03   0.0000000000000000e+00   0.0000000000000000e+00   8.1143721824575368e+02   1.0000000000000000e+03   0.0000000000000000e+00   0.0000000000000000e+00   -8.1143721824575368e+02   1.0000000000000001e+03   6.3651797294173946e+02   -6.4869469333137363e+02   -4.1715995129668704e+02   9.9999999999999989e+02   -6.3651797294173946e+02   6.4869469333137374e+02   4.1715995129668698e+02   1.1340756308754143e+00
1.0000000000000000e+03   0.0000000000000000e+00   0.0000000000000000e+00   8.1143721824575368e+02   1.0000000000000000e+03   0.0000000000000000e+00   0.0000000000000000e+00   -8.1143721824575368e+02   1.0000000000000005e+03   9.4293839996728934e+02   -3.3293311322910489e+02   -2.2529941644162652e+00   1.0000000000000002e+03   -9.4293839996728934e+02   3.3293311322910489e+02   2.2529941644162652e+00   1.5556335999400017e+00
1.0000000000000000e+03   0.0000000000000000e+00   0.0000000000000000e+00   8.1143721824575368e+02   1.0000000000000000e+03   0.0000000000000000e+00   0.0000000000000000e+00   -8.1143721824575368e+02   1.0000000000000001e+03   -5.3788409631644765e+02   -1.3159107361966898e+02   8.3267451520594864e+02   1.0000000000000001e+03   5.3788409631644754e+02   1.3159107361966906e+02   -8.3267451520594852e+02   1.3822978948563531e+01
1.0000000000000000e+03   0.0000000000000000e+00   0.0000000000000000e+00   8.1143721824575368e+02   1.0000000000000000e+03   0.0000000000000000e+00   0.0000000000000000e+00   -8.1143721824575368e+02   9.9999999999999966e+02   -7.5302634254498184e+02   -3.7596120047896670e+02   5.3998783612942748e+02   9.9999999999999977e+02   7.5302634254498184e+02   3.7596120047896670e+02   -5.3998783612942759e+02   4.6362010005155661e+00
1.0000000000000000e+03   0.0000000000000000e+00   0.0000000000000000e+00   8.1143721824575368e+02   1.0000000000000000e+03   0.0000000000000000e+00   0.0000000000000000e+00   -8.1143721824575368e+02   9.9999999999999989e+02   -4.2804398936746884e+02   6.1178969129997506e+02   6.6518724941587925e+02   9.9999999999999989e+02   4.2804398936746884e+02   -6.1178969129997495e+02   -6.6518724941587936e+02   6.9268758349057897e+00
1.0000000000000000e+03   0.0000000000000000e+00   0.0000000000000000e+00   8.1143721824575368e+02   1.0000000000000000e+03   0.0000000000000000e+00   0.0000000000000000e+00   -8.1143721824575368e+02   9.9999999999999977e+02   -7.6518705609099447e+02   4.1807408867489659e+02   4.8957653698829535e+02   9.9999999999999977e+02   7.6518705609099459e+02   -4.1807408867489659e+02   -4.8957653698829540e+02   4.0241860248840533e+00
1.0000000000000000e+03   0.0000000000000000e+00   0.0000000000000000e+00   8.1143721824575368e+02   1.0000000000000000e+03   0.0000000000000000e+00   0.0000000000000000e+00   -8.1143721824575368e+02   1.0000000000000002e+03   -9.6567867303115361e+02   -1.1293918060829023e+02   2.3386278441923693e+02   1.0000000000000005e+03   9.6567867303115361e+02   1.1293918060829004e+02   -2.3386278441923704e+02   2.2502560356186061e+00
1.0000000000000000e+03   0.0000000000000000e+00   0.0000000000000000e+00   8.1143721824575368e+02   1.0000000000000000e+03   0.0000000000000000e+00   0.0000000000000000e+00   -8.1143721824575368e+02   9.9999999999999829e+02   -6.2837895763622907e+02   -2.1211261518825995e+02   7.4841865561863472e+02   1.0000000000000010e+03   6.2837895763622919e+02   2.1211261518826049e+02   -7.4841865561863528e+02   9.5032810422889504e+00
1.0000000000000000e+03   0.0000000000000000e+00   0.0000000000000000e+00   8.1143721824575368e+02   1.0000000000000000e+03   0.0000000000000000e+00   0.0000000000000000e+00   -8.1143721824575368e+02   1.0000000000000000e+03   -6.3427887611417532e+02   -3.3738854956751271e+02   6.9558725831923380e+02   9.9999999999999989e+02   6.3427887611417532e+02   3.3738854956751265e+02   -6.9558725831923380e+02   7.7340648467124282e+00
1.0000000000000000e+03   0.0000000000000000e+00   0.0000000000000000e+00   8.1143721824575368e+02   1.0000000000000000e+03   0.0000000000000000e+00   0.0000000000000000e+00   -8.1143721824575368e+02   9.9999999999999989e+02   6.5679346589550590e+01   -9.9260505636540097e+02   1.0199894857011043e+02   9.9999999999999966e+02   -6.5679346589550676e+01   9.9260505636540120e+02   -1.0199894857011061e+02   1.7981288316250226e+00
1.0000000000000000e+03   0.0000000000000000e+00   0.0000000000000000e+00   8.1143721824575368e+02   1.0000000000000000e+03   0.0000000000000000e+00   0.0000000000000000e+00   -8.1143721824575368e+02   1.0000000000000005e+03   2.1598148785435495e+01   2.2275022098715809e+02   9.7462722054086623e+02   9.9999999999999977e+02   -2.1598148785435573e+01   -2.2275022098715871e+02   -9.7462722054086623e+02   3.1517361076208502e+01
1.0000000000000000e+03   0.0000000000000000e+00   0.0000000000000000e+00   8.1143721824575368e+02   1.0000000000000000e+03   0.0000000000000000e+00   0.0000000000000000e+00   -8.1143721824575368e+02   1.0000000000000005e+03   -4.3663175475282208e+02   4.6517705200883609e+02   7.7002946763473972e+02   1.0000000000000000e+03   4.3663175475282185e+02   -4.6517705200883609e+02   -7.7002946763473960e+02   1.0400311635881684e+01
1.0000000000000000e+03   0.0000000000000000e+00   0.0000000000000000e+00   8.1143721824575368e+02   1.0000000000000000e+03   0.0000000000000000e+00   0.0000000000000000e+00   -8.1143721824575368e+02   1.0000000000000000e+03   3.0874909002916377e+02   -8.9629759695695020e+02   -3.1828756980969246e+02   1.0000000000000005e+03   -3.0874909002916394e+02   8.9629759695695009e+02   3.1828756980969240e+02   1.1804769718481429e+00
1.0000000000000000e+03   0.0000000000000000e+00   0.0000000000000000e+00   8.1143721824575368e+02   1.0000000000000000e+03   0.0000000000000000e+00   0.0000000000000000e+00   -8.1143721824575368e+02   1.0000000000000000e+03   2.4441332679286170e+01   6.6357308893118343e+01   -9.9748768855225660e+02   1.0000000000000000e+03   -2.4441332679286216e+01   -6.6357308893118315e+01   9.9748768855225660e+02   1.2283432599655442e+00
1.0000000000000000e+03   0.0000000000000000e+00   0.0000000000000000e+00   8.1143721824575368e+02   1.0000000000000000e+03   0.0000000000000000e+00   0.0000000000000000e+00   -8.1143721824575368e+02   9.9999999999999977e+02   3.5623446988111505e+02   -9.2335374905524407e+02   1.4316849015808697e+02   9.9999999999999966e+02   -3.5623446988111499e+02   9.2335374905524395e+02   -1.4316849015808708e+02   1.9188824917074738e+00
1.0000000000000000e+03   0.0000000000000000e+00   0.0000000000000000e+00   8.1143721824575368e+02   1.0000000000000000e+03   0.0000000000000000e+00   0.0000000000000000e+00   -8.1143721824575368e+02   1.0000000000000000e+03   -1.2401888866369846e+02   -2.1283214964687295e+02   -9.6917704849594543e+02   1.0000000000000000e+03   1.2401888866369868e+02   2.1283214964687303e+02   9.6917704849594543e+02   1.2130527976571350e+00
1.0000000000000000e+03   0.0000000000000000e+00   0.0000000000000000e+00   8.1143721824575368e+02   1.0000000000000000e+03   0.0000000000000000e+00   0.0000000000000000e+00   -8.1143721824575368e+02   1.0000000000000002e+03   -9.5051449606569747e+02   3.0841187502726837e+02   -3.7237992845177907e+01   1.0000000000000003e+03   9.5051449606569747e+02   -3.0841187502726842e+02   3.7237992845177864e+01   1.4910326822429889e+00
1.0000000000000000e+03   0.0000000000000000e+00   0.0000000000000000e+00   8.1143721824575368e+02   1.0000000000000000e+03   0.0000000000000000e+00   0.0000000000000000e+00   -8.1143721824575368e+02   9.9999999999999943e+02   8.4083292803323133e+01   9.9331972108471075e+02   -7.8919525946004995e+01   1.0000000000000007e+03   -8.4083292803323232e+01   -9.9331972108471075e+02   7.8919525946004995e+01   1.4232169539009032e+00
1.0000000000000000e+03   0.0000000000000000e+00   0.0000000000000000e+00   8.1143721824575368e+02   1.0000000000000000e+03   0.0000000000000000e+00   0.0000000000000000e+00   -8.1143721824575368e+02   9.9999999999999943e+02   -9.0954440329031206e+02   -2.7923255475693793e+02   -3.0779947824384442e+02   1.0000000000000013e+03   9.0954440329031263e+02   2.7923255475693816e+02   3.0779947824384442e+02   1.1869390086853631e+00
1.0000000000000000e+03   0.0000000000000000e+00   0.0000000000000000e+00   8.1143721824575368e+02   1.0000000000000000e+03   0.0000000000000000e+00   0.0000000000000000e+00   -8.1143721824575368e+02   1.0000000000000016e+03   8.0606125574187513e+02   -2.5158312221853663e+02   -5.3568045008811407e+02   1.0000000000000006e+03   -8.0606125574187513e+02   2.5158312221853657e+02   5.3568045008811430e+02   1.1083625772909924e+00
1.0000000000000000e+03   0.0000000000000000e+00   0.0000000000000000e+00   8.1143721824575368e+02   1.0000000000000000e+03   0.0000000000000000e+00   0.0000000000000000e+00   -8.1143721824575368e+02   1.0000000000000001e+03   -6.1924984720323732e+02   -2.5944294527182933e+02   -7.4108119992848708e+02   1.0000000000000002e+03   6.1924984720323721e+02   2.5944294527182916e+02   7.4108119992848708e+02   1.1246772071483759e+00
1.0000000000000000e+03   0.0000000000000000e+00   0.0000000000000000e+00   8.1143721824575368e+02   1.0000000000000000e+03   0.0000000000000000e+00   0.0000000000000000e+00   -8.1143721824575368e+02   1.0000000000000002e+03   1.9247940661733699e+02   8.0717640168101707e+02   5.5803252109310199e+02   1.0000000000000002e+03   -1.9247940661733705e+02   -8.0717640168101707e+02   -5.5803252109310199e+02   4.8897860631378087e+00
1.0000000000000000e+03   0.0000000000000000e+00   0.0000000000000000e+00   8.1143721824575368e+02   1.0000000000000000e+03   0.0000000000000000e+00   0.0000000000000000e+00   -8.1143721824575368e+02   1.0000000000000002e+03   -4.3172816369830861e+02   3.2788478253022691e+02   8.4028847549802288e+02   1.0000000000000002e+03   4.3172816369830900e+02   -3.2788478253022635e+02   -8.4028847549802310e+02   1.4347084526045304e+01
1.0000000000000000e+03   0.0000000000000000e+00   0.0000000000000000e+00   8.1143721824575368e+02   1.0000000000000000e+03   0.0000000000000000e+00   0.0000000000000000e+00   -8.1143721824575368e+02   9.9999999999997601e+02   -1.1725157416804936e+02   1.8003923348452184e+02   9.7663724215362606e+02   1.0000000000000066e+03   1.1725157416804974e+02   -1.8003923348451946e+02   -9.7663724215362242e+02   3.1968012834594365e+01
1.0000000000000000e+03   0.0000000000000000e+00   0.0000000000000000e+00   8.1143721824575368e+02   1.0000000000000000e+03   0.0000000000000000e+00   0.0000000000000000e+00   -8.1143721824575368e+02   1.0000000000000000e+03   7.4701712232979685e+02   4.8606530491254853e+02   4.5352871828185306e+02   9.9999999999999977e+02   -7.4701712232979685e+02   -4.8606530491254853e+02   -4.5352871828185306e+02   3.6588986300643205e+00
1.0000000000000000e+03   0.0000000000000000e+00   0.0000000000000000e+00   8.1143721824575368e+02   1.0000000000000000e+03   0.0000000000000000e+00   0.0000000000000000e+00   -8.1143721824575368e+02   9.9999999999999795e+02   -4.2771122258891421e+02   -5.1492776211435955e+02   7.4289627127573488e+02   9.9999999999999704e+02   4.2771122258891432e+02   5.1492776211436103e+02   -7.4289627127573749e+02   9.2921582636054580e+00
1.0000000000000000e+03   0.0000000000000000e+00   0.0000000000000000e+00   8.1143721824575368e+02   1.0000000000000000e+03   0.0000000000000000e+00   0.0000000000000000e+00   -8.1143721824575368e+02   1.0000000000000034e+03   -2.9927703663662061e+02   7.2714997545205063e+02   -6.1779327330595845e+02   1.0000000000000042e+03   2.9927703663661805e+02   -7.2714997545204801e+02   6.1779327330595754e+02   1.1065602559431207e+00
1.0000000000000000e+03   0.0000000000000000e+00   0.0000000000000000e+00   8.1143721824575368e+02   1.0000000000000000e+03   0.0000000000000000e+00   0.0000000000000000e+00   -8.1143721824575368e+02   1.0000000000000002e+03   6.6535520442792722e+02   2.1001719904711646e+02   7.1636414486284502e+02   1.0000000000000000e+03   -6.6535520442792722e+02   -2.1001719904711646e+02   -7.1636414486284491e+02   8.3673726272972075e+00
1.0000000000000000e+03   0.0000000000000000e+00   0.0000000000000000e+00   8.1143721824575368e+02   1.0000000000000000e+03   0.0000000000000000e+00   0.0000000000000000e+00   -8.1143721824575368e+02   1.0000000000000003e+03   -3.8500092205010992e+02   9.1887087048293211e+02   8.6214693634576832e+01   1.0000000000000002e+03   3.8500092205010981e+02   -9.1887087048293222e+02   -8.6214693634576605e+01   1.7559504359907803e+00
1.0000000000000000e+03   0.0000000000000000e+00   0.0000000000000000e+00   8.1143721824575368e+02   1.0000000000000000e+03   0.0000000000000000e+00   0.0000000000000000e+00   -8.1143721824575368e+02   1.0000000000000023e+03   -7.9580211577124908e+02   6.0550671134889978e+02   -6.5555354814151920e+00   9.9999999999999875e+02   7.9580211577124737e+02   -6.0550671134889876e+02   6.5555354814157996e+00   1.5472835197608623e+00
1.0000000000000000e+03   0.0000000000000000e+00   0.0000000000000000e+00   8.1143721824575368e+02   1.0000000000000000e+03   0.0000000000000000e+00   0.0000000000000000e+00   -8.1143721824575368e+02   1.0000000000000000e+03   -3.3987517034696828e+02   4.0504967771233601e+02   -8.4876497758022060e+02   1.0000000000000001e+03   3.3987517034696828e+02   -4.0504967771233595e+02   8.4876497758022060e+02   1.1582929882605721e+00
1.0000000000000000e+03   0.0000000000000000e+00   0.0000000000000000e+00   8.1143721824575368e+02   1.0000000000000000e+03   0.0000000000000000e+00   0.0000000000000000e+00   -8.1143721824575368e+02   1.0000000000000010e+03   -3.2862477489892819e+02   -6.0870372054603570e+02   -7.2212734189756407e+02   9.9999999999999943e+02   3.2862477489892808e+02   6.0870372054603570e+02   7.2212734189756384e+02   1.1204023907000928e+00
