Welcome to Sherpa, Stephan Braeuer. Initialization of framework underway.
The local time is Tue Apr 19 12:08:28 2016.
Run_Parameter::Init(): Seed mode '*'
Run_Parameter::Init(): Setting memory limit to 7.47797 GB.
Random::SetSeed(): Seed set to 1234
-----------------------------------------------------------------------------
-----------    Event generation run with SHERPA started .......   -----------
-----------------------------------------------------------------------------
................................................ |       +                   
................................................ ||  |       +  +            
...................................        ....  | |         /   +           
................. ................   _,_ |  ....  ||         +|  +  +        
...............................  __.'  ,\|  ...  ||    /    +|          +    
.............................. (  \    \   ...  | |  |   + + \         +   
.............................  (    \   -/  .... ||       +    |          +  
........ ...................  <S   /()))))~~~~~~~~##     +     /\    +       
............................ (!H   (~~)))))~~~~~~#/     +  +    |  +         
................ ........... (!E   (~~~)))))     /|/    +         +          
............................ (!R   (~~~)))))   |||   + +            +        
..... ...................... (!P    (~~~~)))   /|  + +          +            
............................ (!A>    (~~~~~~~~~##        + +        +        
............................. ~~(!    '~~~~~~~ \       +     + +      +      
...............................  `~~~QQQQQDb //   |         + + +        +   
........................ ..........   IDDDDP||     \  + + + + +             +
....................................  IDDDI||       \                      + 
.................................... IHD HD||         \ + +  + + + + +      +
...................................  IHD ##|            :-) + +\          +  
......... ............... ......... IHI ## /      /   +  + + + +\       +    
................................... IHI/ /       /      + + + +        +     
................................... ## | | /    / + +      + + /      +      
....................... /TT\ .....  ##/ ///  / + + + + + + +/       +        
......................./TTT/T\ ... /TT\/\\\ / + + + + + + +/   \         +   
....................../TTT/TTTT\...|TT/T\\\/   +    ++  + /              
-----------------------------------------------------------------------------

     SHERPA version 2.2.0 (Cho Oyu)
                                                                             
     Authors:        Stefan Hoeche, Frank Krauss, Silvan Kuttimalai,         
                     Marek Schoenherr, Holger Schulz, Steffen Schumann,      
                     Frank Siegert, Korinna Zapp.
     Former Authors: Timo Fischer, Tanju Gleisberg, Hendrik Hoeth,           
                     Ralf Kuhn, Thomas Laubrich, Andreas Schaelicke,         
                     Jan Winter                                              
                                                                             
     This program uses a lot of genuine and original research work           
     by other people. Users are encouraged to refer to                       
     the various original publications.                                      
                                                                             
     Users are kindly asked to refer to the documentation                    
     published under JHEP 02(2009)007                                        
                                                                             
     Please visit also our homepage                                          
                                                                             
       http://sherpa.hepforge.org                                            
                                                                             
     for news, bugreports, updates and new releases.                         
                                                                             
-----------------------------------------------------------------------------

SVN branch branches/RecolaInterface, revision 27892.
===> AMEGIC++/DipoleSubtraction has revision 27892M, first seen was 27892 <===
===> PHASIC++/Process has revision 27892M, first seen was 27892 <===

Beam_Spectra_Handler : 
   type = Monochromatic*Monochromatic
   for    P+  ((1000,0,0,1000))
   and    P+  ((1000,0,0,-1000))
PDF set 'NNPDF30NNLO' loaded for beam 1 (P+).
PDF set 'NNPDF30NNLO' loaded for beam 2 (P+).
Initialized the ISR: (SF)*(SF)
Standard_Model::FixEWParameters() {
  Scheme:     3
              Gmu scheme, input: GF, m_W, m_Z, m_h, widths
  Parameters: sin^2(\theta_W) = 0.222897 + 0.0201562 i
              vev             = 246.218
}
Running_AlphaQED::PrintSummary() {
  Setting \alpha according to EW scheme
  1/\alpha(0)   = 137.036
  1/\alpha(def) = 131.65
}
One_Running_AlphaS::PrintSummary() {
  Setting \alpha_s according to PDF
  perturbative order 2
  \alpha_s(M_Z) = 0.118
}
One_Running_AlphaS::PrintSummary() {
  Setting \alpha_s according to PDF
  perturbative order 2
  \alpha_s(M_Z) = 0.118
}
 List of Particle Data 
  IDName     kfc  MASS[<kfc>]   WIDTH[<kfc>]  STABLE[<kfc>] MASSIVE[<kfc>]  ACTIVE[<kfc>]  YUKAWA[<kfc>]
       d       1         0.01              0              1              0              1              0
       u       2        0.005              0              1              0              1              0
       s       3          0.2              0              1              0              1              0
       c       4         1.42              0              1              0              1              0
       b       5          4.8              0              1              0              1              0
       t       6       173.21              2              0              1              1         173.21
      e-      11     0.000511              0              1              0              1              0
      ve      12            0              0              1              0              1              0
     mu-      13        0.105              0              1              0              1              0
     vmu      14            0              0              1              0              1              0
    tau-      15        1.777    2.26735e-12              0              0              1              0
    vtau      16            0              0              1              0              1              0
       G      21            0              0              1              0              1              0
       P      22            0              0              1              0              1              0
       Z      23      91.1876              0              0              1              1        91.1876
      W+      24       80.385          2.085              0              1              1         80.385
      h0      25          125              0              0              1              1            125

 List of Particle Containers 
    IDName     kfc     Constituents
         l      90     {e-,e+,mu-,mu+,tau-,tau+}
        nu      91     {ve,veb,vmu,vmub,vtau,vtaub}
         f      92     {d,db,u,ub,s,sb,c,cb,b,bb,e-,e+,mu-,mu+,tau-,tau+,ve,veb,vmu,vmub,vtau,vtaub}
         j      93     {d,db,u,ub,s,sb,c,cb,b,bb,G}
         Q      94     {d,db,u,ub,s,sb,c,cb,b,bb}
       ewj      98     {d,db,u,ub,s,sb,c,cb,b,bb,G,P}
         r      99     {d,db,u,ub,s,sb,c,cb,b,bb,G,d,db,u,ub,s,sb,c,cb,b,bb,G,P}

Shower_Handler::Shower_Handler(): No shower selected.
Shower_Handler::Shower_Handler(): No shower selected.
Initialized the Shower_Handler.
+-----------------------------------------+
|   X   X   X XXXX  XXX  XXX  XXX         |
|  X X  XX XX X    X      X  X     X   X  |
| X   X X X X XXX  X XXX  X  X    XXX XXX |
| XXXXX X   X X    X   X  X  X     X   X  |
| X   X X   X XXXX  XXX  XXX  XXX         |
+-----------------------------------------+
| please cite: JHEP 0202:044,2002         |
+-----------------------------------------+
ME_Generators::ME_Generators(): Try loading 'OpenLoops' from 'libSherpaOpenLoops'.
ME_Generator_Base::SetPSMasses(): Massive PS flavours for Amegic: (c,cb,b,bb,e-,e+,mu-,mu+,tau-,tau+)
Amegic::Initialize(): Set gauge 1.
Initialising OpenLoops generator from /work1/Stephan/programs/OpenLoops
 #########################################################
 #     ___                                 version 1.2.4 #
 #    /   \ ___  ____  _  _  |     __   __  ___   __     #
 #    |   | |__| |__   |\ |  |    /  \ /  \ |__| /__     #
 #    \___/ |    |___  | \|  |___ \__/ \__/ |    __/     #
 #                                                       #
 #########################################################
 #  You are using OpenLoops to evaluate loop amplitudes  #
 #                     Authors:                          #
 # F. Cascioli, J. Lindert, P. Maierhoefer, S. Pozzorini #
 #    Please cite Phys. Rev. Lett. 108 (2012) 111601     #
 #########################################################

Matrix_Element_Handler::BuildProcesses(): Looking for processes 
Momenta are:  ((1000,0,0,1000),(1000,-0,-0,-1000),(1001.82745540156,-889.293548346417,-206.456567189991,-393.14872647629),(998.17254459844,889.293548346417,206.456567189991,393.14872647629))
flavour:  (G,G,h0,Z)
    and born is:  7.25778438617327e-06
    and born*sym_factor is:  0.00185799280286036
mu:  1
AlphaQED():  0.00759588004468592
AlphaQCD():  0.118
. done ( 31 MB, 2s / 5s ).
Matrix_Element_Handler::InitializeProcesses(): Performing tests  done ( 31 MB, 0s / 0s ).
Initialized the Matrix_Element_Handler for the hard processes.
Beam_Remnant_Handler::Beam_Remnant_Handler(): Set remnants 0.
Initialized the Beam_Remnant_Handler.
Single_Process::CalculateTotalXSec(): Calculate xs for '2_2__G__G__h0__Z' (Amegic)
Starting the calculation at 12:08:31. Lean back and enjoy ... .

Momenta are:  ((278.259076632222,0,0,278.259076632222),(648.484218253737,0,0,-648.484218253737),(477.503069583649,304.450697782805,-274.473449889844,-210.614053156331),(449.24022530231,-304.450697782805,274.473449889844,-159.611088465183))
flavour:  (G,G,h0,Z)
    and born is:  2.18160348053542e-05
    and born*sym_factor is:  0.00558490491017068
mu:  120
AlphaQED():  0.00759588004468592
AlphaQCD():  0.113307297485655

Momenta are:  ((830.497551173371,0,0,830.497551173371),(18.6341067853391,0,0,-18.634106785339),(333.807013402664,-7.40454279837532,-42.4512743938569,306.504786659346),(515.324644556048,7.40454279837489,42.451274393857,505.358657728688))
flavour:  (G,G,h0,Z)
    and born is:  1.41641901784248e-06
    and born*sym_factor is:  0.000362603268567674
mu:  120
AlphaQED():  0.00759588004468592
AlphaQCD():  0.113307297485655

Momenta are:  ((493.284959304601,0,0,493.284959304601),(28.4347277621647,0,0,-28.4347277621647),(260.329770354062,-34.9174394611356,27.674154042553,223.967638180399),(261.389916712703,34.9174394611356,-27.674154042553,240.882593362037))
flavour:  (G,G,h0,Z)
    and born is:  7.66519843961117e-07
    and born*sym_factor is:  0.000196229080054046
mu:  120
AlphaQED():  0.00759588004468592
AlphaQCD():  0.113307297485655

Momenta are:  ((962.0993238816,0,0,962.099323881601),(155.262597346769,0,0,-155.262597346769),(256.424043289017,-155.10295018102,-160.260350757623,-19.6973296885893),(860.937877939356,155.102950181023,160.26035075762,826.534056223426))
flavour:  (G,G,h0,Z)
    and born is:  4.14056457550427e-05
    and born*sym_factor is:  0.0105998453132909
mu:  120
AlphaQED():  0.00759588004468592
AlphaQCD():  0.113307297485655

Momenta are:  ((841.769448444843,0,0,841.769448444843),(998.335981578089,0,0,-998.335981578089),(884.507019480596,622.880351091572,-497.097580743857,362.824655933264),(955.598410542336,-622.880351091572,497.097580743857,-519.39118906651))
flavour:  (G,G,h0,Z)
    and born is:  9.07682340370233e-06
    and born*sym_factor is:  0.0023236667913478
mu:  120
AlphaQED():  0.00759588004468592
AlphaQCD():  0.113307297485655

Momenta are:  ((367.636742790435,0,0,367.636742790435),(197.008275059866,0,0,-197.008275059866),(297.625974457623,-152.811696448385,-191.013727869478,114.536290606175),(267.019043392682,152.811696448386,191.013727869477,56.092177124398))
flavour:  (G,G,h0,Z)
    and born is:  4.24872586773426e-05
    and born*sym_factor is:  0.0108767382213997
mu:  120
AlphaQED():  0.00759588004468592
AlphaQCD():  0.113307297485655

Momenta are:  ((482.177641550306,0,0,482.177641550306),(556.720235011211,0,0,-556.720235011211),(492.596305016067,-267.80800627526,79.4086681081146,386.004216194133),(546.30157154545,267.80800627526,-79.4086681081146,-460.546809655039))
flavour:  (G,G,h0,Z)
    and born is:  3.39318605171807e-05
    and born*sym_factor is:  0.00868655629239825
mu:  120
AlphaQED():  0.00759588004468592
AlphaQCD():  0.113307297485655

Momenta are:  ((583.765328546835,0,0,583.765328546835),(271.226129813008,0,0,-271.226129813008),(512.034682270815,-312.055836830937,88.9831727070952,375.842607380932),(342.956776089028,312.055836830937,-88.9831727070951,-63.3034086471055))
flavour:  (G,G,h0,Z)
    and born is:  3.04774500838149e-05
    and born*sym_factor is:  0.00780222722145663
mu:  120
AlphaQED():  0.00759588004468592
AlphaQCD():  0.113307297485655

Momenta are:  ((839.261858443031,0,0,839.261858443031),(32.9162776638844,0,0,-32.9162776638842),(305.62599589081,101.457010410412,-34.1947070116296,257.525622832408),(566.552140216107,-101.457010410412,34.1947070116296,548.819957946741))
flavour:  (G,G,h0,Z)
    and born is:  1.90743438517071e-05
    and born*sym_factor is:  0.00488303202603701
mu:  120
AlphaQED():  0.00759588004468592
AlphaQCD():  0.113307297485655

Momenta are:  ((360.115811598053,0,0,360.115811598053),(508.689948802418,0,0,-508.689948802418),(415.212265860236,-313.0754604884,-234.200100236995,62.5323501057598),(453.593494540235,313.0754604884,234.200100236995,-211.106487310125))
flavour:  (G,G,h0,Z)
    and born is:  2.36213072211244e-05
    and born*sym_factor is:  0.00604705464860785
mu:  120
AlphaQED():  0.00759588004468592
AlphaQCD():  0.113307297485655

Momenta are:  ((72.5046725687913,0,0,72.5046725687914),(620.557621518467,0,0,-620.557621518467),(177.399452465841,-82.87353800501,78.2172146756796,-53.4753191864348),(515.662841621417,82.87353800501,-78.2172146756796,-494.577629763241))
flavour:  (G,G,h0,Z)
    and born is:  5.18012108143297e-05
    and born*sym_factor is:  0.0132611099684684
mu:  120
AlphaQED():  0.00759588004468592
AlphaQCD():  0.113307297485655

Momenta are:  ((565.12369669806,0,0,565.12369669806),(389.544362981445,0,0,-389.544362981445),(463.916574367677,444.756410763305,41.8276830866153,-5.98063421286388),(490.751485311828,-444.756410763305,-41.8276830866153,181.559967929479))
flavour:  (G,G,h0,Z)
    and born is:  1.86805557939137e-05
    and born*sym_factor is:  0.00478222228324192
mu:  120
AlphaQED():  0.00759588004468592
AlphaQCD():  0.113307297485655

Momenta are:  ((217.376290185103,0,0,217.376290185103),(342.619985007182,0,0,-342.619985007182),(320.368894687764,135.300573062327,151.431577936936,-213.947331873981),(239.627380504524,-135.300573062327,-151.431577936936,88.7036370519011))
flavour:  (G,G,h0,Z)
    and born is:  4.62549247568138e-05
    and born*sym_factor is:  0.0118412607377443
mu:  120
AlphaQED():  0.00759588004468592
AlphaQCD():  0.113307297485655

Momenta are:  ((657.884746793946,0,0,657.884746793946),(18.774528167133,0,0,-18.7745281671331),(458.791047926227,-7.14212189955221,1.10029616964396,441.375129680362),(217.868227034851,7.14212189955222,-1.10029616964395,197.73508894645))
flavour:  (G,G,h0,Z)
    and born is:  1.88886354767427e-07
    and born*sym_factor is:  4.83549068204614e-05
mu:  120
AlphaQED():  0.00759588004468592
AlphaQCD():  0.113307297485655

Momenta are:  ((556.993075637018,0,0,556.993075637018),(134.297572181775,0,0,-134.297572181775),(404.462634979024,-242.129061632414,1.25172357622152,298.892913591591),(286.828012839773,242.129061632414,-1.25172357622153,123.802589863654))
flavour:  (G,G,h0,Z)
    and born is:  4.25585474807038e-05
    and born*sym_factor is:  0.0108949881550602
mu:  120
AlphaQED():  0.00759588004468592
AlphaQCD():  0.113307297485655

Momenta are:  ((934.262010713351,0,0,934.262010713352),(304.952679296288,0,0,-304.952679296288),(706.462716509259,241.509446932909,-441.422025783397,479.879518226277),(532.751973500381,-241.509446932909,441.422025783397,149.429813190787))
flavour:  (G,G,h0,Z)
    and born is:  1.50057606180324e-05
    and born*sym_factor is:  0.0038414747182163
mu:  120
AlphaQED():  0.00759588004468592
AlphaQCD():  0.113307297485655

Momenta are:  ((156.381703415762,0,0,156.381703415762),(297.351773133137,0,0,-297.351773133137),(243.524675050787,-160.813225769997,-90.4443883579024,-98.1742654192243),(210.208801498112,160.813225769997,90.4443883579024,-42.7958042981501))
flavour:  (G,G,h0,Z)
    and born is:  4.8398191415433e-05
    and born*sym_factor is:  0.0123899370023509
mu:  120
AlphaQED():  0.00759588004468592
AlphaQCD():  0.113307297485655

Momenta are:  ((95.2390433795298,0,0,95.2390433795298),(131.226947784402,0,0,-131.226947784402),(125.809986500512,-12.6795683917606,-4.77914228535294,4.42052572372012),(100.656004663419,12.6795683917606,4.77914228535294,-40.4084301285918))
flavour:  (G,G,h0,Z)
    and born is:  2.3323287803034e-07
    and born*sym_factor is:  5.97076167757671e-05
mu:  120
AlphaQED():  0.00759588004468592
AlphaQCD():  0.113307297485655

Momenta are:  ((993.386624364993,0,0,993.386624364993),(930.215403068632,0,0,-930.215403068632),(991.124781962845,-360.252846499458,292.968324646139,866.654937540869),(932.47724547078,360.252846499458,-292.968324646139,-803.483716244508))
flavour:  (G,G,h0,Z)
    and born is:  2.34079713017042e-05
    and born*sym_factor is:  0.00599244065323626
mu:  120
AlphaQED():  0.00759588004468592
AlphaQCD():  0.113307297485655

Momenta are:  ((377.500986393836,0,0,377.500986393836),(412.443659186828,0,0,-412.443659186828),(406.247186855318,187.780262235998,-293.267419174534,-167.763436997302),(383.697458725346,-187.780262235998,293.267419174533,132.820764204309))
flavour:  (G,G,h0,Z)
    and born is:  2.80820360803571e-05
    and born*sym_factor is:  0.00718900123657143
mu:  120
AlphaQED():  0.00759588004468592
AlphaQCD():  0.113307297485655

Momenta are:  ((596.933164400434,0,0,596.933164400434),(773.509281507677,0,0,-773.509281507677),(662.598851236298,-616.076987579277,-179.443838489109,107.987461601791),(707.843594671814,616.076987579277,179.443838489109,-284.563578709034))
flavour:  (G,G,h0,Z)
    and born is:  9.47376356006548e-06
    and born*sym_factor is:  0.00242528347137676
mu:  120
AlphaQED():  0.00759588004468592
AlphaQCD():  0.113307297485655

Momenta are:  ((476.593007825861,0,0,476.593007825861),(234.263553981812,0,0,-234.263553981812),(462.17759401643,-138.058880787397,-56.3393155378392,419.223991884141),(248.678967791244,138.058880787397,56.3393155378391,-176.894538040092))
flavour:  (G,G,h0,Z)
    and born is:  4.98442396666897e-05
    and born*sym_factor is:  0.0127601253546726
mu:  120
AlphaQED():  0.00759588004468592
AlphaQCD():  0.113307297485655

Momenta are:  ((446.580261301934,0,0,446.580261301934),(906.293778281525,0,0,-906.293778281525),(551.75990385809,-496.535612454281,145.742864332723,145.001360566836),(801.114135725369,496.535612454281,-145.742864332723,-604.714877546427))
flavour:  (G,G,h0,Z)
    and born is:  1.60691291068414e-05
    and born*sym_factor is:  0.0041136970513514
mu:  120
AlphaQED():  0.00759588004468592
AlphaQCD():  0.113307297485655

Momenta are:  ((781.487089992522,0,0,781.487089992522),(555.385701523194,0,0,-555.385701523194),(618.982281076085,-401.897096998007,409.589840500454,-195.522250062596),(717.890510439631,401.897096998006,-409.589840500454,421.623638531923))
flavour:  (G,G,h0,Z)
    and born is:  1.303205705616e-05
    and born*sym_factor is:  0.00333620660637697
mu:  120
AlphaQED():  0.00759588004468592
AlphaQCD():  0.113307297485655

Momenta are:  ((631.923104011647,0,0,631.923104011647),(394.512103509575,0,0,-394.512103509575),(549.913620171296,191.154266498148,426.162921315016,261.964120722107),(476.521587349925,-191.154266498148,-426.162921315016,-24.5531202200349))
flavour:  (G,G,h0,Z)
    and born is:  1.73073847502143e-05
    and born*sym_factor is:  0.00443069049605487
mu:  120
AlphaQED():  0.00759588004468592
AlphaQCD():  0.113307297485655

Momenta are:  ((61.1193404011649,0,0,61.119340401165),(495.154685700905,0,0,-495.154685700905),(448.868015695757,49.8361803212464,26.3315604450243,-427.41139382352),(107.406010406313,-49.8361803212464,-26.3315604450243,-6.62395147621987))
flavour:  (G,G,h0,Z)
    and born is:  4.24139741921133e-05
    and born*sym_factor is:  0.010857977393181
mu:  120
AlphaQED():  0.00759588004468592
AlphaQCD():  0.113307297485655

Momenta are:  ((344.833616387586,0,0,344.833616387586),(132.82070662353,0,0,-132.82070662353),(175.130564389037,-89.818774340621,-63.1036542864971,-54.7378404292819),(302.523758622079,89.818774340621,63.1036542864971,266.750750193338))
flavour:  (G,G,h0,Z)
    and born is:  5.20935862778342e-05
    and born*sym_factor is:  0.0133359580871255
mu:  120
AlphaQED():  0.00759588004468592
AlphaQCD():  0.113307297485655

Momenta are:  ((317.343010054004,0,0,317.343010054004),(108.117198486052,0,0,-108.117198486052),(159.947300464083,-80.6196024087337,55.2358670503702,-20.1895424514594),(265.512908075973,80.6196024087337,-55.2358670503702,229.415354019411))
flavour:  (G,G,h0,Z)
    and born is:  4.89044981056932e-05
    and born*sym_factor is:  0.0125195515150575
mu:  120
AlphaQED():  0.00759588004468592
AlphaQCD():  0.113307297485655

Momenta are:  ((952.290001344914,0,0,952.290001344914),(857.875108247159,0,0,-857.875108247159),(874.943314379329,-414.111114487797,-504.238932971476,-569.346894880921),(935.221795212744,414.111114487797,504.238932971476,663.761787978677))
flavour:  (G,G,h0,Z)
    and born is:  1.5002138828593e-05
    and born*sym_factor is:  0.00384054754011982
mu:  120
AlphaQED():  0.00759588004468592
AlphaQCD():  0.113307297485655

Momenta are:  ((944.636269203322,0,0,944.636269203321),(902.50239213664,0,0,-902.50239213664),(927.832212344117,-16.4912503009953,-911.199702309709,121.205426601242),(919.306448995844,16.4912503009973,911.199702309709,-79.071549534561))
flavour:  (G,G,h0,Z)
    and born is:  3.94393982180372e-06
    and born*sym_factor is:  0.00100964859438175
mu:  120
AlphaQED():  0.00759588004468592
AlphaQCD():  0.113307297485655

Momenta are:  ((77.288564008066,0,0,77.288564008066),(303.626066603702,0,0,-303.626066603702),(135.641764699059,-37.4158888855177,36.7559160864828,-4.76888060501241),(245.272865912709,37.4158888855175,-36.7559160864829,-221.568621990623))
flavour:  (G,G,h0,Z)
    and born is:  8.84079795990143e-06
    and born*sym_factor is:  0.00226324427773477
mu:  120
AlphaQED():  0.00759588004468592
AlphaQCD():  0.113307297485655

Momenta are:  ((619.397346974437,0,0,619.397346974436),(894.257824586329,0,0,-894.257824586329),(700.347868606282,-218.742707305191,-626.164462530517,186.900591026426),(813.307302954484,218.742707305192,626.164462530516,-461.761068638318))
flavour:  (G,G,h0,Z)
    and born is:  1.02618420928086e-05
    and born*sym_factor is:  0.00262703157575901
mu:  120
AlphaQED():  0.00759588004468592
AlphaQCD():  0.113307297485655

Momenta are:  ((45.7361791395477,0,0,45.7361791395477),(851.171277839881,0,0,-851.171277839881),(755.730199377825,-57.5393488896653,63.7919784990921,-740.353254237578),(141.177257601603,57.5393488896653,-63.7919784990922,-65.0818444627549))
flavour:  (G,G,h0,Z)
    and born is:  5.12711991994207e-05
    and born*sym_factor is:  0.0131254269950517
mu:  120
AlphaQED():  0.00759588004468592
AlphaQCD():  0.113307297485655

Momenta are:  ((489.589088105864,0,0,489.589088105864),(409.02793207817,0,0,-409.02793207817),(470.285773674717,-164.424268287361,355.122412733069,228.902688699012),(428.331246509318,164.424268287361,-355.122412733069,-148.341532671318))
flavour:  (G,G,h0,Z)
    and born is:  2.35748813041837e-05
    and born*sym_factor is:  0.00603516961387104
mu:  120
AlphaQED():  0.00759588004468592
AlphaQCD():  0.113307297485655

Momenta are:  ((243.959355792462,0,0,243.959355792462),(245.420168938454,0,0,-245.420168938454),(251.769448207621,-73.5161515144351,-159.95399912209,129.510419202962),(237.610076523296,73.5161515144349,159.95399912209,-130.971232348954))
flavour:  (G,G,h0,Z)
    and born is:  4.9038637820235e-05
    and born*sym_factor is:  0.0125538912819802
mu:  120
AlphaQED():  0.00759588004468592
AlphaQCD():  0.113307297485655

Momenta are:  ((80.9975333892305,0,0,80.9975333892305),(307.623340108972,0,0,-307.623340108972),(285.641531660555,37.1786280205229,12.9929805375105,-253.801136098031),(102.979341837648,-37.1786280205228,-12.9929805375105,27.1753293782897))
flavour:  (G,G,h0,Z)
    and born is:  1.15564064545643e-05
    and born*sym_factor is:  0.00295844005236846
mu:  120
AlphaQED():  0.00759588004468592
AlphaQCD():  0.113307297485655

Momenta are:  ((246.207462030933,0,0,246.207462030933),(88.3102473601044,0,0,-88.3102473601045),(165.610886698948,89.6187905888897,32.1576982815104,52.3098519194231),(168.906822692089,-89.6187905888897,-32.1576982815104,105.587362751406))
flavour:  (G,G,h0,Z)
    and born is:  6.28763214941457e-06
    and born*sym_factor is:  0.00160963383025013
mu:  120
AlphaQED():  0.00759588004468592
AlphaQCD():  0.113307297485655

Momenta are:  ((382.544030914735,0,0,382.544030914735),(647.7461369771,0,0,-647.7461369771),(486.713038782036,109.990314352172,-457.271004399872,-8.36309776858232),(543.5771291098,-109.990314352171,457.271004399872,-256.839008293783))
flavour:  (G,G,h0,Z)
    and born is:  1.70171628867348e-05
    and born*sym_factor is:  0.00435639369900411
mu:  120
AlphaQED():  0.00759588004468592
AlphaQCD():  0.113307297485655

Momenta are:  ((776.806679460725,0,0,776.806679460725),(386.367568801309,0,0,-386.367568801309),(455.858637268342,334.772984058958,210.949468998375,-188.704710714157),(707.315610993692,-334.772984058958,-210.949468998375,579.143821373572))
flavour:  (G,G,h0,Z)
    and born is:  2.36078231987176e-05
    and born*sym_factor is:  0.0060436027388717
mu:  120
AlphaQED():  0.00759588004468592
AlphaQCD():  0.113307297485655

Momenta are:  ((720.555113635316,0,0,720.555113635316),(500.918776905357,0,0,-500.918776905357),(684.508121499266,-27.0515866607287,445.800597551989,503.444542407484),(536.965769041407,27.0515866607287,-445.800597551989,-283.808205677525))
flavour:  (G,G,h0,Z)
    and born is:  2.02681706812145e-05
    and born*sym_factor is:  0.00518865169439092
mu:  120
AlphaQED():  0.00759588004468592
AlphaQCD():  0.113307297485655

Momenta are:  ((999.342631610998,0,0,999.342631610998),(998.030563998149,0,0,-998.030563998149),(1000.92720369683,-643.850315316169,-424.129309413244,625.940386509991),(996.445991912313,643.850315316169,424.129309413244,-624.628318897142))
flavour:  (G,G,h0,Z)
    and born is:  1.25411207874763e-05
    and born*sym_factor is:  0.00321052692159393
mu:  120
AlphaQED():  0.00759588004468592
AlphaQCD():  0.113307297485655

Momenta are:  ((147.656465921222,0,0,147.656465921222),(291.293209252066,0,0,-291.293209252066),(188.439432098969,4.9951561588844,132.325678705372,48.4704316041535),(250.510243074319,-4.99515615888431,-132.325678705372,-192.107174934997))
flavour:  (G,G,h0,Z)
    and born is:  5.07093339705467e-05
    and born*sym_factor is:  0.01298158949646
mu:  120
AlphaQED():  0.00759588004468592
AlphaQCD():  0.113307297485655

Momenta are:  ((155.996436251684,0,0,155.996436251684),(619.921519612749,0,0,-619.921519612749),(509.057586158495,-181.024163599962,169.523018615217,-426.622578373476),(266.860369705938,181.024163599962,-169.523018615217,-37.3025049875896))
flavour:  (G,G,h0,Z)
    and born is:  4.06432035113884e-05
    and born*sym_factor is:  0.0104046600989154
mu:  120
AlphaQED():  0.00759588004468592
AlphaQCD():  0.113307297485655

Momenta are:  ((326.679064832692,0,0,326.679064832692),(335.134849200237,0,0,-335.134849200237),(334.840965593353,282.671636402996,-46.5305343164896,120.104652653275),(326.972948439576,-282.671636402996,46.5305343164896,-128.560437020819))
flavour:  (G,G,h0,Z)
    and born is:  3.5936478539066e-05
    and born*sym_factor is:  0.0091997385060009
mu:  120
AlphaQED():  0.00759588004468592
AlphaQCD():  0.113307297485655

Momenta are:  ((344.773407233045,0,0,344.773407233045),(315.218695831429,0,0,-315.218695831429),(325.373606574359,4.09899009507244,212.683164190264,-212.113304168842),(334.618496490115,-4.0989900950726,-212.683164190264,241.668015570458))
flavour:  (G,G,h0,Z)
    and born is:  4.37709111453404e-05
    and born*sym_factor is:  0.0112053532532071
mu:  120
AlphaQED():  0.00759588004468592
AlphaQCD():  0.113307297485655

Momenta are:  ((652.988577908473,0,0,652.988577908473),(427.551827656483,0,0,-427.551827656483),(462.971260964282,326.991410728793,129.30746152058,-273.995595190059),(617.569144600674,-326.991410728793,-129.30746152058,499.432345442049))
flavour:  (G,G,h0,Z)
    and born is:  2.72355055143433e-05
    and born*sym_factor is:  0.00697228941167188
mu:  120
AlphaQED():  0.00759588004468592
AlphaQCD():  0.113307297485655

Momenta are:  ((446.505415262761,0,0,446.505415262761),(318.979455596656,0,0,-318.979455596656),(408.926085141474,226.592147041417,251.560921085807,192.272319876661),(356.558785717943,-226.592147041417,-251.560921085807,-64.7463602105558))
flavour:  (G,G,h0,Z)
    and born is:  2.93200412106798e-05
    and born*sym_factor is:  0.00750593054993402
mu:  120
AlphaQED():  0.00759588004468592
AlphaQCD():  0.113307297485655

Momenta are:  ((765.042966976677,0,0,765.042966976677),(586.315861398239,0,0,-586.315861398239),(680.946842217426,20.8867808034656,-660.153572908078,108.740997283687),(670.41198615749,-20.8867808034654,660.153572908074,69.9861082947546))
flavour:  (G,G,h0,Z)
    and born is:  7.98990798267737e-06
    and born*sym_factor is:  0.00204541644356541
mu:  120
AlphaQED():  0.00759588004468592
AlphaQCD():  0.113307297485655

Momenta are:  ((252.430526081544,0,0,252.430526081544),(60.1275352092473,0,0,-60.1275352092472),(151.163859733199,47.902138174077,13.8963764876691,68.8315942594894),(161.394201557592,-47.9021381740769,-13.8963764876691,123.471396612807))
flavour:  (G,G,h0,Z)
    and born is:  1.26705565785093e-06
    and born*sym_factor is:  0.000324366248409839
mu:  120
AlphaQED():  0.00759588004468592
AlphaQCD():  0.113307297485655

Momenta are:  ((21.4701494275337,0,0,21.4701494275338),(736.923627194576,0,0,-736.923627194576),(276.215523131861,-13.0674218683667,-35.0484342811789,-243.456084251677),(482.178253490248,13.0674218683667,35.0484342811789,-471.997393515365))
flavour:  (G,G,h0,Z)
    and born is:  1.59704558893695e-06
    and born*sym_factor is:  0.000408843670767859
mu:  120
AlphaQED():  0.00759588004468592
AlphaQCD():  0.113307297485655

Momenta are:  ((130.831737057699,0,0,130.831737057699),(233.416010164516,0,0,-233.416010164516),(194.035106462502,-101.029886046463,91.9703736066888,-57.9571828507833),(170.212640759714,101.029886046463,-91.9703736066888,-44.6270902560334))
flavour:  (G,G,h0,Z)
    and born is:  4.27011205535295e-05
    and born*sym_factor is:  0.0109314868617035
mu:  120
AlphaQED():  0.00759588004468592
AlphaQCD():  0.113307297485655

Momenta are:  ((973.578912874174,0,0,973.578912874174),(698.109740415932,0,0,-698.109740415932),(768.258656595721,-610.764178108399,-346.34025946044,-285.67797753889),(903.429996694385,610.764178108399,346.34025946044,561.147149997131))
flavour:  (G,G,h0,Z)
    and born is:  1.06785918154608e-05
    and born*sym_factor is:  0.00273371950475797
mu:  120
AlphaQED():  0.00759588004468592
AlphaQCD():  0.113307297485655

Momenta are:  ((751.756285941055,0,0,751.756285941055),(422.1589490396,0,0,-422.1589490396),(566.311097556913,-334.809744269817,-431.923462516729,80.1736670338517),(607.604137423742,334.809744269823,431.92346251673,249.423669867606))
flavour:  (G,G,h0,Z)
    and born is:  1.24175155280856e-05
    and born*sym_factor is:  0.00317888397518992
mu:  120
AlphaQED():  0.00759588004468592
AlphaQCD():  0.113307297485655

Momenta are:  ((148.566468584172,0,0,148.566468584172),(88.4699384634018,0,0,-88.4699384634018),(137.765819035641,-19.5697460339596,30.545936348103,45.1485515531228),(99.2705880119328,19.5697460339596,-30.545936348103,14.9479785676476))
flavour:  (G,G,h0,Z)
    and born is:  4.40720563167218e-07
    and born*sym_factor is:  0.000112824464170808
mu:  120
AlphaQED():  0.00759588004468592
AlphaQCD():  0.113307297485655

Momenta are:  ((315.428441056684,0,0,315.428441056684),(313.327986220063,0,0,-313.327986220063),(320.134684486196,278.909508624476,93.9125192928436,-15.8474266049945),(308.621742790552,-278.909508624476,-93.9125192928437,17.9478814416156))
flavour:  (G,G,h0,Z)
    and born is:  3.56285296803875e-05
    and born*sym_factor is:  0.0091209035981792
mu:  120
AlphaQED():  0.00759588004468592
AlphaQCD():  0.113307297485655

Momenta are:  ((198.087643553227,0,0,198.087643553227),(125.242125366203,0,0,-125.242125366204),(169.293921869501,-29.4881374980932,-108.450066413569,20.1113108409826),(154.035847049929,29.4881374980932,108.450066413569,52.7342073460407))
flavour:  (G,G,h0,Z)
    and born is:  1.09354741609028e-05
    and born*sym_factor is:  0.00279948138519112
mu:  120
AlphaQED():  0.00759588004468592
AlphaQCD():  0.113307297485655

Momenta are:  ((775.034375986862,0,0,775.034375986862),(260.416546075109,0,0,-260.416546075109),(385.390043140528,263.828573577903,-251.071641459246,-16.0623774911302),(650.060878921443,-263.828573577903,251.071641459246,530.680207402883))
flavour:  (G,G,h0,Z)
    and born is:  2.61278083194829e-05
    and born*sym_factor is:  0.00668871892978762
mu:  120
AlphaQED():  0.00759588004468592
AlphaQCD():  0.113307297485655

Momenta are:  ((75.363721315233,0,0,75.363721315233),(163.734572175872,0,0,-163.734572175872),(129.823078805842,-12.0952784540977,12.0376165109306,-30.6240398785265),(109.275214685262,12.0952784540977,-12.0376165109305,-57.7468109821124))
flavour:  (G,G,h0,Z)
    and born is:  1.8454142284264e-07
    and born*sym_factor is:  4.72426042477158e-05
mu:  120
AlphaQED():  0.00759588004468592
AlphaQCD():  0.113307297485655

Momenta are:  ((47.1731193176769,0,0,47.173119317677),(502.810561217327,0,0,-502.810561217327),(212.693249663983,-91.545729127356,17.9997069410545,-144.59878450804),(337.29043087102,91.5457291273561,-17.9997069410545,-311.03865739161))
flavour:  (G,G,h0,Z)
    and born is:  9.07529437874509e-06
    and born*sym_factor is:  0.00232327536095874
mu:  120
AlphaQED():  0.00759588004468592
AlphaQCD():  0.113307297485655

Momenta are:  ((201.541598072625,0,0,201.541598072625),(452.40651461064,0,0,-452.40651461064),(219.349262334446,54.5059041294301,-26.8963443527766,169.690282462361),(434.59885034882,-54.5059041294301,26.8963443527767,-420.555199000376))
flavour:  (G,G,h0,Z)
    and born is:  5.60978547108426e-05
    and born*sym_factor is:  0.0143610508059757
mu:  120
AlphaQED():  0.00759588004468592
AlphaQCD():  0.113307297485655

Momenta are:  ((726.703996541813,0,0,726.703996541813),(955.641502117289,0,0,-955.641502117289),(884.780752559923,8.47829691375174,-769.165127951356,-418.957163115182),(797.564746099178,-8.47829691375123,769.165127951356,190.019657539706))
flavour:  (G,G,h0,Z)
    and born is:  7.6281773579919e-06
    and born*sym_factor is:  0.00195281340364593
mu:  120
AlphaQED():  0.00759588004468592
AlphaQCD():  0.113307297485655

Momenta are:  ((675.790230098025,0,0,675.790230098025),(519.649522592008,0,0,-519.649522592008),(574.684357107014,-317.801209267489,-445.901667450848,-121.701292746545),(620.755395583019,317.801209267489,445.901667450848,277.842000252561))
flavour:  (G,G,h0,Z)
    and born is:  1.30744810714351e-05
    and born*sym_factor is:  0.00334706715428737
mu:  120
AlphaQED():  0.00759588004468592
AlphaQCD():  0.113307297485655

Momenta are:  ((219.618647131176,0,0,219.618647131176),(65.0291222453057,0,0,-65.0291222453057),(188.069566942749,5.45560627153629,26.5205575617627,137.884220985784),(96.5782024337326,-5.45560627153629,-26.5205575617627,16.7053039000866))
flavour:  (G,G,h0,Z)
    and born is:  8.77380346353357e-07
    and born*sym_factor is:  0.000224609368666459
mu:  120
AlphaQED():  0.00759588004468592
AlphaQCD():  0.113307297485655

Momenta are:  ((711.190811393976,0,0,711.190811393976),(936.264810451978,0,0,-936.264810451978),(862.415921069901,323.183002421176,692.591902197481,-379.48046704851),(785.039700776053,-323.183002421176,-692.591902197481,154.406467990509))
flavour:  (G,G,h0,Z)
    and born is:  7.27213028868474e-06
    and born*sym_factor is:  0.00186166535390329
mu:  120
AlphaQED():  0.00759588004468592
AlphaQCD():  0.113307297485655

Momenta are:  ((804.125402684473,0,0,804.125402684473),(36.8333328235772,0,0,-36.8333328235775),(730.502645914161,-34.9495910259214,17.3167853080363,718.670836142184),(110.456089593889,34.9495910259214,-17.3167853080364,48.6212337187108))
flavour:  (G,G,h0,Z)
    and born is:  3.40781358336895e-05
    and born*sym_factor is:  0.00872400277342451
mu:  120
AlphaQED():  0.00759588004468592
AlphaQCD():  0.113307297485655

Momenta are:  ((103.596077172345,0,0,103.596077172345),(233.554933071115,0,0,-233.554933071115),(210.953341858276,-14.8320501808263,-84.3041268173131,-146.796242902121),(126.197668385184,14.8320501808264,84.3041268173131,16.8373870033508))
flavour:  (G,G,h0,Z)
    and born is:  9.94245722672282e-06
    and born*sym_factor is:  0.00254526905004104
mu:  120
AlphaQED():  0.00759588004468592
AlphaQCD():  0.113307297485655

Momenta are:  ((26.9717249758178,0,0,26.9717249758178),(465.076772581021,0,0,-465.076772581021),(322.892584937603,15.4978942628553,12.6439500305659,-297.043039320448),(169.155912619235,-15.4978942628553,-12.6439500305659,-141.062008284755))
flavour:  (G,G,h0,Z)
    and born is:  2.46796592485893e-07
    and born*sym_factor is:  6.31799276763886e-05
mu:  120
AlphaQED():  0.00759588004468592
AlphaQCD():  0.113307297485655

Momenta are:  ((970.894417609641,0,0,970.894417609641),(446.217947391425,0,0,-446.217947391425),(815.631950419995,-547.267113884423,231.443789735609,544.575942178278),(601.48041458107,547.267113884423,-231.443789735609,-19.899471960063))
flavour:  (G,G,h0,Z)
    and born is:  1.17522041173882e-05
    and born*sym_factor is:  0.00300856425405137
mu:  120
AlphaQED():  0.00759588004468592
AlphaQCD():  0.113307297485655

Momenta are:  ((656.013141953792,0,0,656.013141953792),(19.9356897752619,0,0,-19.935689775262),(321.80844850839,-28.9509854801724,-2.3651737823899,295.113408580639),(354.140383220663,28.9509854801724,2.3651737823899,340.96404359789))
flavour:  (G,G,h0,Z)
    and born is:  4.2003456854413e-07
    and born*sym_factor is:  0.000107528849547297
mu:  120
AlphaQED():  0.00759588004468592
AlphaQCD():  0.113307297485655

Momenta are:  ((620.167194792844,0,0,620.167194792844),(104.641821214216,0,0,-104.641821214215),(425.495779882453,-50.1131596304856,-218.480276158678,339.376927411476),(299.313236124608,50.1131596304853,218.480276158678,176.148446167154))
flavour:  (G,G,h0,Z)
    and born is:  4.49027487815184e-05
    and born*sym_factor is:  0.0114951036880687
mu:  120
AlphaQED():  0.00759588004468592
AlphaQCD():  0.113307297485655

Momenta are:  ((110.538764065733,0,0,110.538764065733),(330.593157487105,0,0,-330.593157487105),(200.231972563068,122.475424613942,-81.8230154901709,-52.6555537263387),(240.89994898977,-122.475424613942,81.8230154901709,-167.398839695034))
flavour:  (G,G,h0,Z)
    and born is:  4.85016860539951e-05
    and born*sym_factor is:  0.0124164316298227
mu:  120
AlphaQED():  0.00759588004468592
AlphaQCD():  0.113307297485655

Momenta are:  ((975.208903270183,0,0,975.208903270183),(20.041439027346,0,0,-20.0414390273458),(499.355700287165,45.5564629763567,-74.1485684329869,475.560420861227),(495.894642010362,-45.5564629763566,74.1485684329869,479.607043381608))
flavour:  (G,G,h0,Z)
    and born is:  4.07201553571709e-06
    and born*sym_factor is:  0.00104243597714357
mu:  120
AlphaQED():  0.00759588004468592
AlphaQCD():  0.113307297485655

Momenta are:  ((353.766454772171,0,0,353.766454772171),(126.740565338851,0,0,-126.740565338851),(247.953517545652,33.766388802287,-178.285033296879,113.711146124052),(232.55350256537,-33.766388802287,178.285033296879,113.314743309268))
flavour:  (G,G,h0,Z)
    and born is:  4.84819695236236e-05
    and born*sym_factor is:  0.0124113841980476
mu:  120
AlphaQED():  0.00759588004468592
AlphaQCD():  0.113307297485655

Momenta are:  ((90.4101286263351,0,0,90.4101286263349),(780.156860451622,0,0,-780.156860451622),(394.673027866298,-30.8618191774596,-236.774607524021,-288.317762675239),(475.893961211666,30.8618191774595,236.774607524021,-401.428969150054))
flavour:  (G,G,h0,Z)
    and born is:  4.31804120208307e-05
    and born*sym_factor is:  0.0110541854773327
mu:  120
AlphaQED():  0.00759588004468592
AlphaQCD():  0.113307297485655

Momenta are:  ((145.091459503964,0,0,145.091459503964),(111.827824472654,0,0,-111.827824472653),(150.887793686721,16.4613281193319,-21.766001387884,79.983699237888),(106.031490289896,-16.4613281193319,21.766001387884,-46.7200642065773))
flavour:  (G,G,h0,Z)
    and born is:  1.82069147387677e-06
    and born*sym_factor is:  0.000466097017312454
mu:  120
AlphaQED():  0.00759588004468592
AlphaQCD():  0.113307297485655

Momenta are:  ((322.060607988641,0,0,322.060607988641),(916.108478223687,0,0,-916.108478223687),(774.549041687506,124.460280784293,-436.695541613221,-614.904757195181),(463.620044524822,-124.460280784293,436.695541613221,20.8568869601358))
flavour:  (G,G,h0,Z)
    and born is:  1.89537520341183e-05
    and born*sym_factor is:  0.00485216052073429
mu:  120
AlphaQED():  0.00759588004468592
AlphaQCD():  0.113307297485655

Momenta are:  ((322.673766533324,0,0,322.673766533324),(50.4492573650111,0,0,-50.4492573650111),(236.163484877157,18.7853726585405,-58.644447405896,190.672835380029),(136.959539021179,-18.7853726585406,58.644447405896,81.5516737882835))
flavour:  (G,G,h0,Z)
    and born is:  1.82478163002481e-06
    and born*sym_factor is:  0.000467144097286352
mu:  120
AlphaQED():  0.00759588004468592
AlphaQCD():  0.113307297485655

Momenta are:  ((241.699697716402,0,0,241.699697716402),(184.455166089454,0,0,-184.455166089454),(241.009316740803,110.593997029863,-19.9932837805872,172.712846020487),(185.145547065052,-110.593997029863,19.9932837805872,-115.468314393539))
flavour:  (G,G,h0,Z)
    and born is:  5.17960395610578e-05
    and born*sym_factor is:  0.0132597861276308
mu:  120
AlphaQED():  0.00759588004468592
AlphaQCD():  0.113307297485655

Momenta are:  ((13.3096482136415,0,0,13.3096482136413),(886.725477736412,0,0,-886.725477736412),(514.378119940918,1.89786661360768,-10.465610730489,-498.845386235363),(385.657006009135,-1.89786661360768,10.465610730489,-374.570443287407))
flavour:  (G,G,h0,Z)
    and born is:  3.12814645942669e-08
    and born*sym_factor is:  8.00805493613234e-06
mu:  120
AlphaQED():  0.00759588004468592
AlphaQCD():  0.113307297485655

Momenta are:  ((182.75441977397,0,0,182.75441977397),(274.964851003439,0,0,-274.964851003439),(246.806509847508,184.854018188756,-44.5738148336377,-95.5542793063471),(210.912760929902,-184.854018188757,44.5738148336375,3.34384807687775))
flavour:  (G,G,h0,Z)
    and born is:  4.81283092638351e-05
    and born*sym_factor is:  0.0123208471715418
mu:  120
AlphaQED():  0.00759588004468592
AlphaQCD():  0.113307297485655

Momenta are:  ((644.287480491892,0,0,644.287480491892),(786.581964407274,0,0,-786.581964407274),(663.665925165757,-153.654458548344,418.913911369238,475.109358417262),(767.203519733408,153.654458548344,-418.913911369238,-617.403842332644))
flavour:  (G,G,h0,Z)
    and born is:  2.16744623975278e-05
    and born*sym_factor is:  0.00554866237376712
mu:  120
AlphaQED():  0.00759588004468592
AlphaQCD():  0.113307297485655

Momenta are:  ((819.373497473715,0,0,819.373497473715),(955.486397064496,0,0,-955.486397064496),(844.447291007433,563.748399402313,331.676957030443,519.272920183736),(930.412603530778,-563.748399402313,-331.676957030444,-655.385819774517))
flavour:  (G,G,h0,Z)
    and born is:  1.44968723323053e-05
    and born*sym_factor is:  0.00371119931707014
mu:  120
AlphaQED():  0.00759588004468592
AlphaQCD():  0.113307297485655

Momenta are:  ((602.121832435205,0,0,602.121832435205),(28.8160646412345,0,0,-28.8160646412345),(401.039202037285,-60.789236666785,36.0456958114775,374.450020816715),(229.898695039155,60.7892366667851,-36.0456958114775,198.855746977256))
flavour:  (G,G,h0,Z)
    and born is:  2.45666354142643e-06
    and born*sym_factor is:  0.000628905866605167
mu:  120
AlphaQED():  0.00759588004468592
AlphaQCD():  0.113307297485655

Momenta are:  ((733.722912832922,0,0,733.722912832922),(271.63500545143,0,0,-271.63500545143),(409.713159980294,359.207817029924,-150.910762030272,20.870063466065),(595.644758304058,-359.207817029924,150.910762030272,441.217843915428))
flavour:  (G,G,h0,Z)
    and born is:  2.37352571093109e-05
    and born*sym_factor is:  0.0060762258199836
mu:  120
AlphaQED():  0.00759588004468592
AlphaQCD():  0.113307297485655

Momenta are:  ((393.21893009272,0,0,393.21893009272),(80.4362254224415,0,0,-80.4362254224414),(366.416336413812,-38.4711009793211,30.1959325233578,340.945907204359),(107.238819101349,38.4711009793216,-30.195932523358,-28.1632025340805))
flavour:  (G,G,h0,Z)
    and born is:  4.71920145810432e-05
    and born*sym_factor is:  0.0120811557327471
mu:  120
AlphaQED():  0.00759588004468592
AlphaQCD():  0.113307297485655

Momenta are:  ((871.756866455461,0,0,871.756866455461),(487.452594440754,0,0,-487.452594440754),(847.749299819523,285.617872969367,-131.242387559535,777.336311832028),(511.460161076692,-285.617872969365,131.242387559534,-393.032039817321))
flavour:  (G,G,h0,Z)
    and born is:  3.0479248552927e-05
    and born*sym_factor is:  0.00780268762954931
mu:  120
AlphaQED():  0.00759588004468592
AlphaQCD():  0.113307297485655

Momenta are:  ((215.519599734819,0,0,215.519599734819),(403.964864120103,0,0,-403.964864120103),(302.613578782489,-82.3084731020483,-257.941913378709,-51.3932159111087),(316.870885072434,82.308473102048,257.941913378709,-137.052048474175))
flavour:  (G,G,h0,Z)
    and born is:  3.88299027504316e-05
    and born*sym_factor is:  0.00994045510411049
mu:  120
AlphaQED():  0.00759588004468592
AlphaQCD():  0.113307297485655

Momenta are:  ((156.123682555814,0,0,156.123682555814),(85.5119501625238,0,0,-85.5119501625238),(149.178064674518,10.859744754058,3.95299848511872,80.5948802771491),(92.4575680438202,-10.859744754058,-3.95299848511876,-9.98314788385869))
flavour:  (G,G,h0,Z)
    and born is:  5.18661735367359e-07
    and born*sym_factor is:  0.000132777404254044
mu:  120
AlphaQED():  0.00759588004468592
AlphaQCD():  0.113307297485655

Momenta are:  ((778.780542307585,0,0,778.780542307584),(495.440487351636,0,0,-495.440487351636),(737.275256558429,171.316521345473,403.853675885207,579.225916134102),(536.945773100791,-171.316521345473,-403.853675885207,-295.885861178154))
flavour:  (G,G,h0,Z)
    and born is:  2.10769950667022e-05
    and born*sym_factor is:  0.00539571073707577
mu:  120
AlphaQED():  0.00759588004468592
AlphaQCD():  0.113307297485655

Momenta are:  ((735.551903582255,0,0,735.551903582255),(807.074453818515,0,0,-807.074453818514),(744.481799666655,412.724334008228,-124.062319003244,594.049926484216),(798.144557734115,-412.724334008228,124.062319003244,-665.572476720475))
flavour:  (G,G,h0,Z)
    and born is:  2.31881205209706e-05
    and born*sym_factor is:  0.00593615885336848
mu:  120
AlphaQED():  0.00759588004468592
AlphaQCD():  0.113307297485655

Momenta are:  ((326.463319537994,0,0,326.463319537993),(906.262627262006,0,0,-906.262627262006),(655.611933609418,-391.165764549449,-355.626173477708,-367.044107530863),(577.114013190582,391.165764549449,355.626173477708,-212.75520019315))
flavour:  (G,G,h0,Z)
    and born is:  1.32742101091522e-05
    and born*sym_factor is:  0.00339819778794297
mu:  120
AlphaQED():  0.00759588004468592
AlphaQCD():  0.113307297485655

Momenta are:  ((76.885919797795,0,0,76.885919797795),(333.053128069326,0,0,-333.053128069326),(202.306841992699,-11.7263651794237,114.731320960896,-109.554893397353),(207.632205874422,11.7263651794237,-114.731320960896,-146.612314874178))
flavour:  (G,G,h0,Z)
    and born is:  1.2656705907507e-05
    and born*sym_factor is:  0.00324011671232179
mu:  120
AlphaQED():  0.00759588004468592
AlphaQCD():  0.113307297485655

Momenta are:  ((317.348478762695,0,0,317.348478762695),(174.060822817294,0,0,-174.060822817294),(234.327341851168,104.886954198902,168.024912342638,7.11750027472149),(257.081959728821,-104.886954198902,-168.024912342638,136.17015567068))
flavour:  (G,G,h0,Z)
    and born is:  4.75064944227627e-05
    and born*sym_factor is:  0.0121616625722272
mu:  120
AlphaQED():  0.00759588004468592
AlphaQCD():  0.113307297485655

Momenta are:  ((763.30985284574,0,0,763.30985284574),(886.441922069924,0,0,-886.441922069924),(781.892645589319,544.636345494827,56.1138431086879,544.016173476743),(867.859129326345,-544.636345494827,-56.1138431086871,-667.148242700927))
flavour:  (G,G,h0,Z)
    and born is:  1.79821295657735e-05
    and born*sym_factor is:  0.00460342516883802
mu:  120
AlphaQED():  0.00759588004468592
AlphaQCD():  0.113307297485655

Momenta are:  ((486.222612154637,0,0,486.222612154637),(795.627256797756,0,0,-795.627256797756),(707.017619858457,-517.401733474693,-207.118861336219,-416.708697133248),(574.832249093936,517.401733474693,207.118861336219,107.304052490129))
flavour:  (G,G,h0,Z)
    and born is:  1.31489623531444e-05
    and born*sym_factor is:  0.00336613436240496
mu:  120
AlphaQED():  0.00759588004468592
AlphaQCD():  0.113307297485655

Momenta are:  ((187.693791530842,0,0,187.693791530842),(782.250100586755,0,0,-782.250100586755),(686.953971937309,-242.704338685147,-110.373936167747,-620.63915261502),(282.989920180288,242.704338685147,110.373936167747,26.0828435591059))
flavour:  (G,G,h0,Z)
    and born is:  3.68164057251563e-05
    and born*sym_factor is:  0.00942499986564002
mu:  120
AlphaQED():  0.00759588004468592
AlphaQCD():  0.113307297485655

Momenta are:  ((124.442592859423,0,0,124.442592859423),(319.068851273346,0,0,-319.068851273346),(272.217311230324,-137.382761035854,46.3817427077547,-193.525128722407),(171.294132902445,137.382761035854,-46.3817427077547,-1.10112969151625))
flavour:  (G,G,h0,Z)
    and born is:  4.95206349070981e-05
    and born*sym_factor is:  0.0126772825362171
mu:  120
AlphaQED():  0.00759588004468592
AlphaQCD():  0.113307297485655

Momenta are:  ((134.376042030647,0,0,134.376042030647),(842.936061938912,0,0,-842.936061938912),(338.610740206645,278.122911182948,38.3263611534937,-142.165290064581),(638.701363762914,-278.122911182948,-38.3263611534937,-566.394729843684))
flavour:  (G,G,h0,Z)
    and born is:  3.63869937763254e-05
    and born*sym_factor is:  0.00931507040673929
mu:  120
AlphaQED():  0.00759588004468592
AlphaQCD():  0.113307297485655

Momenta are:  ((298.47675756054,0,0,298.47675756054),(64.6096884466904,0,0,-64.6096884466905),(240.532825898584,64.0952779523386,-30.2783900840666,192.888710848738),(122.553620108646,-64.0952779523386,30.2783900840666,40.9783582651106))
flavour:  (G,G,h0,Z)
    and born is:  3.8875164756608e-06
    and born*sym_factor is:  0.000995204217769164
mu:  120
AlphaQED():  0.00759588004468592
AlphaQCD():  0.113307297485655

Momenta are:  ((986.20379791356,0,0,986.203797913561),(939.4552381004,0,0,-939.455238100401),(983.995590167909,-418.457230923627,-331.551840955682,817.061346605336),(941.663445846051,418.457230923628,331.55184095568,-770.312786792177))
flavour:  (G,G,h0,Z)
    and born is:  2.07066279703621e-05
    and born*sym_factor is:  0.0053008967604127
mu:  120
AlphaQED():  0.00759588004468592
AlphaQCD():  0.113307297485655

Momenta are:  ((560.292306046481,0,0,560.292306046481),(21.6071187743898,0,0,-21.6071187743898),(353.514654506084,6.03095958368643,17.8235234826669,330.141727880192),(228.384770314787,-6.03095958368643,-17.8235234826669,208.543459391899))
flavour:  (G,G,h0,Z)
    and born is:  1.15665004513009e-07
    and born*sym_factor is:  2.96102411553302e-05
mu:  120
AlphaQED():  0.00759588004468592
AlphaQCD():  0.113307297485655

Momenta are:  ((551.478725781949,0,0,551.478725781949),(42.7200444752948,0,0,-42.7200444752948),(451.007394097807,54.1609458399793,50.6220649383309,426.950428056926),(143.191376159437,-54.1609458399795,-50.6220649383311,81.8082532497282))
flavour:  (G,G,h0,Z)
    and born is:  8.90872043509829e-06
    and born*sym_factor is:  0.00228063243138516
mu:  120
AlphaQED():  0.00759588004468592
AlphaQCD():  0.113307297485655

Momenta are:  ((845.758326732165,0,0,845.758326732165),(803.616874954542,0,0,-803.616874954542),(821.161387687849,-738.522261870703,-267.925092816166,-203.671397084281),(828.213813998857,738.522261870702,267.925092816167,245.812848861902))
flavour:  (G,G,h0,Z)
    and born is:  6.47110175265347e-06
    and born*sym_factor is:  0.00165660204867929
mu:  120
AlphaQED():  0.00759588004468592
AlphaQCD():  0.113307297485655

Momenta are:  ((92.4708637723411,0,0,92.4708637723411),(231.79496523471,0,0,-231.79496523471),(168.323849465659,93.1097654789256,26.3301720991537,-57.837806914043),(155.941979541393,-93.1097654789256,-26.3301720991537,-81.486294548326))
flavour:  (G,G,h0,Z)
    and born is:  5.92191154479585e-06
    and born*sym_factor is:  0.00151600935546774
mu:  120
AlphaQED():  0.00759588004468592
AlphaQCD():  0.113307297485655

Momenta are:  ((328.410860372667,0,0,328.410860372667),(324.826350384694,0,0,-324.826350384694),(332.905321240269,-171.720667500192,222.195545497693,127.83624221776),(320.331889517092,171.720667500191,-222.195545497691,-124.251732229787))
flavour:  (G,G,h0,Z)
    and born is:  3.66712627393731e-05
    and born*sym_factor is:  0.00938784326127952
mu:  120
AlphaQED():  0.00759588004468592
AlphaQCD():  0.113307297485655

Momenta are:  ((379.354620983505,0,0,379.354620983505),(853.629876204155,0,0,-853.629876204155),(437.055447029322,-272.174066891239,212.411845592717,237.054738281643),(795.929050158338,272.174066891239,-212.411845592717,-711.329993502294))
flavour:  (G,G,h0,Z)
    and born is:  2.78381783723989e-05
    and born*sym_factor is:  0.00712657366333411
mu:  120
AlphaQED():  0.00759588004468592
AlphaQCD():  0.113307297485655

Momenta are:  ((317.022749330493,0,0,317.022749330493),(664.923859171707,0,0,-664.923859171707),(583.210566765684,-353.169541529244,-142.085859626288,-423.783492620267),(398.736041736516,353.169541529244,142.085859626288,75.8823827790529))
flavour:  (G,G,h0,Z)
    and born is:  2.45696238429419e-05
    and born*sym_factor is:  0.00628982370379312
mu:  120
AlphaQED():  0.00759588004468592
AlphaQCD():  0.113307297485655

Momenta are:  ((628.24905525239,0,0,628.24905525239),(162.467401348388,0,0,-162.467401348388),(247.232869115883,-164.463830236591,-133.240265187985,-26.4153714306067),(543.483587484896,164.463830236591,133.240265187985,492.197025334609))
flavour:  (G,G,h0,Z)
    and born is:  4.41440889211429e-05
    and born*sym_factor is:  0.0113008867638126
mu:  120
AlphaQED():  0.00759588004468592
AlphaQCD():  0.113307297485655

Momenta are:  ((368.635102473851,0,0,368.635102473851),(65.6872916078124,0,0,-65.6872916078125),(228.576030232859,-24.7558676702869,108.367448902665,155.774338808522),(205.746363848805,24.7558676702869,-108.367448902665,147.173472057516))
flavour:  (G,G,h0,Z)
    and born is:  9.8161763921278e-06
    and born*sym_factor is:  0.00251294115638472
mu:  120
AlphaQED():  0.00759588004468592
AlphaQCD():  0.113307297485655

Momenta are:  ((981.599592919467,0,0,981.599592919467),(535.403508125547,0,0,-535.403508125547),(588.962384406371,436.913371067349,-98.3592192826199,-361.502227393299),(928.040716638642,-436.913371067349,98.3592192826199,807.698312187219))
flavour:  (G,G,h0,Z)
    and born is:  2.17305807870944e-05
    and born*sym_factor is:  0.00556302868149615
mu:  120
AlphaQED():  0.00759588004468592
AlphaQCD():  0.113307297485655

Momenta are:  ((438.979973939007,0,0,438.979973939007),(51.7996874221326,0,0,-51.7996874221325),(141.233526870179,-14.9533286404291,37.1664235998104,52.1245050965514),(349.54613449096,14.9533286404291,-37.1664235998104,335.055781420323))
flavour:  (G,G,h0,Z)
    and born is:  7.76961726819349e-06
    and born*sym_factor is:  0.00198902202065753
mu:  120
AlphaQED():  0.00759588004468592
AlphaQCD():  0.113307297485655

Momenta are:  ((92.8685030844296,0,0,92.8685030844296),(135.077629353704,0,0,-135.077629353704),(126.559135831804,-15.1693244630478,-12.4874757504643,-2.48382914252711),(101.38699660633,15.1693244630478,12.4874757504643,-39.7252971267478))
flavour:  (G,G,h0,Z)
    and born is:  2.47011936898496e-07
    and born*sym_factor is:  6.3235055846015e-05
mu:  120
AlphaQED():  0.00759588004468592
AlphaQCD():  0.113307297485655

Momenta are:  ((82.7676081678172,0,0,82.7676081678171),(743.030564013309,0,0,-743.030564013309),(567.328228414887,144.704464410886,-131.301097191779,-517.742173878242),(258.469943766239,-144.704464410886,131.301097191779,-142.52078196725))
flavour:  (G,G,h0,Z)
    and born is:  4.75030176870881e-05
    and born*sym_factor is:  0.0121607725278946
mu:  120
AlphaQED():  0.00759588004468592
AlphaQCD():  0.113307297485655

Momenta are:  ((769.700021204821,0,0,769.700021204821),(130.580239805115,0,0,-130.580239805115),(214.428444726459,125.635183404121,-119.329576444289,-18.1882045416058),(685.851816283478,-125.635183404121,119.329576444289,657.307985941312))
flavour:  (G,G,h0,Z)
    and born is:  4.79645082327664e-05
    and born*sym_factor is:  0.0122789141075882
mu:  120
AlphaQED():  0.00759588004468592
AlphaQCD():  0.113307297485655

Momenta are:  ((607.618964691613,0,0,607.618964691613),(784.969791565671,0,0,-784.969791565672),(673.608090919468,-526.005216403202,-386.427317852135,110.069525693532),(718.980665337816,526.005216403207,386.427317852131,-287.420352567587))
flavour:  (G,G,h0,Z)
    and born is:  9.16845652695793e-06
    and born*sym_factor is:  0.00234712487090123
mu:  120
AlphaQED():  0.00759588004468592
AlphaQCD():  0.113307297485655

Momenta are:  ((92.116113395429,0,0,92.116113395429),(194.519865630502,0,0,-194.519865630503),(146.98164877642,58.5472973732889,43.4390950668354,-25.7655597085167),(139.654330249511,-58.5472973732889,-43.4390950668354,-76.6381925265568))
flavour:  (G,G,h0,Z)
    and born is:  2.83396103226411e-06
    and born*sym_factor is:  0.000725494024259613
mu:  120
AlphaQED():  0.00759588004468592
AlphaQCD():  0.113307297485655

Momenta are:  ((287.242645834339,0,0,287.242645834339),(66.5591175260298,0,0,-66.5591175260299),(241.247886134449,-1.95494548582143,61.528036303443,196.941670301461),(112.55387722592,1.95494548582142,-61.5280363034422,23.7418580068483))
flavour:  (G,G,h0,Z)
    and born is:  3.76686615907552e-06
    and born*sym_factor is:  0.000964317736723334
mu:  120
AlphaQED():  0.00759588004468592
AlphaQCD():  0.113307297485655

Momenta are:  ((468.029514186306,0,0,468.029514186306),(77.3320797129187,0,0,-77.3320797129186),(329.415003734531,-15.232385507593,-149.442050778832,265.187278307589),(215.946590164693,15.232385507593,149.442050778832,125.510156165798))
flavour:  (G,G,h0,Z)
    and born is:  4.82630996407774e-05
    and born*sym_factor is:  0.012355353508039
mu:  120
AlphaQED():  0.00759588004468592
AlphaQCD():  0.113307297485655

Momenta are:  ((654.744956587083,0,0,654.744956587083),(36.4401810334029,0,0,-36.4401810334028),(351.569588594908,44.3578746947693,99.781991448672,309.922746438355),(339.615549025579,-44.3578746947693,-99.781991448672,308.382029115326))
flavour:  (G,G,h0,Z)
    and born is:  9.21212645986789e-06
    and born*sym_factor is:  0.00235830437372618
mu:  120
AlphaQED():  0.00759588004468592
AlphaQCD():  0.113307297485655

Momenta are:  ((39.9596173489886,0,0,39.9596173489885),(833.834686318881,0,0,-833.834686318881),(653.365697205264,9.91630069706136,116.252154078696,-630.594035760782),(220.428606462605,-9.91630069706136,-116.252154078696,-163.281033209111))
flavour:  (G,G,h0,Z)
    and born is:  4.77551081717356e-05
    and born*sym_factor is:  0.0122253076919643
mu:  120
AlphaQED():  0.00759588004468592
AlphaQCD():  0.113307297485655

Momenta are:  ((79.6056870559128,0,0,79.6056870559128),(174.873168131884,0,0,-174.873168131884),(161.022040600036,15.9649516472648,-12.0882358678418,-99.5092580190593),(93.4568145877603,-15.9649516472648,12.0882358678418,4.24177694308809))
flavour:  (G,G,h0,Z)
    and born is:  7.3259718486516e-07
    and born*sym_factor is:  0.000187544879325481
mu:  120
AlphaQED():  0.00759588004468592
AlphaQCD():  0.113307297485655

Momenta are:  ((449.912704964065,0,0,449.912704964065),(103.385023503762,0,0,-103.385023503762),(341.882909296707,-59.1808445494407,162.89310053171,266.875231347463),(211.41481917112,59.1808445494407,-162.89310053171,79.6524501128398))
flavour:  (G,G,h0,Z)
    and born is:  4.90567715404106e-05
    and born*sym_factor is:  0.0125585335143451
mu:  120
AlphaQED():  0.00759588004468592
AlphaQCD():  0.113307297485655

Momenta are:  ((883.758947219836,0,0,883.758947219836),(484.507957873582,0,0,-484.507957873582),(801.667274227408,-273.237811533313,447.68058842437,593.269422491753),(566.59963086601,273.237811533313,-447.68058842437,-194.018433145498))
flavour:  (G,G,h0,Z)
    and born is:  1.59960436442725e-05
    and born*sym_factor is:  0.00409498717293375
mu:  120
AlphaQED():  0.00759588004468592
AlphaQCD():  0.113307297485655

Momenta are:  ((642.285666496405,0,0,642.285666496405),(99.8651700850928,0,0,-99.8651700850928),(151.401358031457,-63.6090874540416,-44.1444727599392,-36.0904520861184),(590.749478550041,63.6090874540416,44.1444727599392,578.51094849743))
flavour:  (G,G,h0,Z)
    and born is:  5.49739222159048e-05
    and born*sym_factor is:  0.0140733240872716
mu:  120
AlphaQED():  0.00759588004468592
AlphaQCD():  0.113307297485655

Momenta are:  ((113.162409360692,0,0,113.162409360692),(145.812371424882,0,0,-145.812371424882),(150.789661749112,36.0176240651555,-20.8600149310745,-73.3492510131337),(108.185119036461,-36.0176240651559,20.8600149310758,40.6992889489445))
flavour:  (G,G,h0,Z)
    and born is:  1.96843549289737e-06
    and born*sym_factor is:  0.000503919486181727
mu:  120
AlphaQED():  0.00759588004468592
AlphaQCD():  0.113307297485655

Momenta are:  ((760.813609523247,0,0,760.813609523247),(127.820143169853,0,0,-127.820143169853),(670.371681428028,195.667972605869,-31.8272781892774,628.071859041633),(218.262071265073,-195.667972605869,31.8272781892772,4.92160731176142))
flavour:  (G,G,h0,Z)
    and born is:  4.56845384530624e-05
    and born*sym_factor is:  0.011695241843984
mu:  120
AlphaQED():  0.00759588004468592
AlphaQCD():  0.113307297485655

Momenta are:  ((473.379460045413,0,0,473.379460045414),(629.703877796985,0,0,-629.703877796985),(488.448356001137,-125.08774188096,234.255891910571,390.428009262295),(614.634981841261,125.08774188096,-234.255891910571,-546.752427013866))
flavour:  (G,G,h0,Z)
    and born is:  3.50967613523905e-05
    and born*sym_factor is:  0.00898477090621196
mu:  120
AlphaQED():  0.00759588004468592
AlphaQCD():  0.113307297485655

Momenta are:  ((290.449655711554,0,0,290.449655711554),(226.749862933098,0,0,-226.749862933098),(262.825732565378,-2.3328737610561,-231.018938682176,8.78483743184401),(254.373786079274,2.33287376105615,231.018938682176,54.9149553466111))
flavour:  (G,G,h0,Z)
    and born is:  4.42247603718261e-05
    and born*sym_factor is:  0.0113215386551875
mu:  120
AlphaQED():  0.00759588004468592
AlphaQCD():  0.113307297485655

Momenta are:  ((583.032432709081,0,0,583.032432709081),(39.4221484026124,0,0,-39.4221484026122),(341.651356087891,92.719232518049,50.5243603581797,299.918458999034),(280.803225023803,-92.719232518049,-50.5243603581797,243.691825307435))
flavour:  (G,G,h0,Z)
    and born is:  7.86979254431798e-06
    and born*sym_factor is:  0.0020146668913454
mu:  120
AlphaQED():  0.00759588004468592
AlphaQCD():  0.113307297485655

Momenta are:  ((377.864541083928,0,0,377.864541083928),(841.620422187024,0,0,-841.620422187024),(790.639041364872,-199.129426149783,-283.339310246004,-699.679498514098),(428.845921906081,199.129426149783,283.339310246005,235.923617411002))
flavour:  (G,G,h0,Z)
    and born is:  2.7740079204187e-05
    and born*sym_factor is:  0.00710146027627186
mu:  120
AlphaQED():  0.00759588004468592
AlphaQCD():  0.113307297485655

Momenta are:  ((72.1739858906531,0,0,72.173985890653),(406.376096342271,0,0,-406.376096342271),(236.59738391693,-102.599956811735,-81.3753463703733,-152.330640193189),(241.952698315994,102.599956811735,81.3753463703733,-181.871470258428))
flavour:  (G,G,h0,Z)
    and born is:  2.94971982535185e-05
    and born*sym_factor is:  0.00755128275290072
mu:  120
AlphaQED():  0.00759588004468592
AlphaQCD():  0.113307297485655

Momenta are:  ((161.732358273097,0,0,161.732358273097),(537.259521818326,0,0,-537.259521818326),(478.934920295823,-26.6996427133823,193.675740918957,-418.963595479651),(220.056959795602,26.6996427133822,-193.675740918957,43.4364319344216))
flavour:  (G,G,h0,Z)
    and born is:  4.63827948773383e-05
    and born*sym_factor is:  0.0118739954885986
mu:  120
AlphaQED():  0.00759588004468592
AlphaQCD():  0.113307297485655

Momenta are:  ((319.708756396527,0,0,319.708756396527),(411.641899280462,0,0,-411.641899280462),(376.557747362999,-312.277845215689,141.579147603051,-92.7827001683851),(354.79290831399,312.277845215689,-141.579147603051,0.849557284449695))
flavour:  (G,G,h0,Z)
    and born is:  2.91268501803368e-05
    and born*sym_factor is:  0.00745647364616623
mu:  120
AlphaQED():  0.00759588004468592
AlphaQCD():  0.113307297485655

Momenta are:  ((29.4481568873789,0,0,29.4481568873788),(574.14788360596,0,0,-574.14788360596),(256.964885231631,-7.88293501721037,60.8725142933724,-215.95913636895),(346.631155261708,7.88293501721042,-60.8725142933725,-328.740590349631))
flavour:  (G,G,h0,Z)
    and born is:  2.19119024485553e-06
    and born*sym_factor is:  0.000560944702683015
mu:  120
AlphaQED():  0.00759588004468592
AlphaQCD():  0.113307297485655

Momenta are:  ((336.22135842621,0,0,336.22135842621),(56.5798124505921,0,0,-56.5798124505921),(234.755306079075,82.2656599189962,9.57194976973353,180.626113029036),(158.045864797727,-82.2656599189962,-9.57194976973353,99.0154329465816))
flavour:  (G,G,h0,Z)
    and born is:  3.64517987627315e-06
    and born*sym_factor is:  0.000933166048325926
mu:  120
AlphaQED():  0.00759588004468592
AlphaQCD():  0.113307297485655

Momenta are:  ((117.043524092803,0,0,117.043524092803),(101.308527422063,0,0,-101.308527422063),(126.52272470053,10.8215059348086,0.126780101484665,16.3057904363727),(91.8293268143359,-10.8215059348086,-0.126780101484584,-0.57079376563235))
flavour:  (G,G,h0,Z)
    and born is:  4.64190485624332e-08
    and born*sym_factor is:  1.18832764319829e-05
mu:  120
AlphaQED():  0.00759588004468592
AlphaQCD():  0.113307297485655

Momenta are:  ((641.963384338919,0,0,641.963384338919),(217.855212469491,0,0,-217.855212469491),(633.703155626137,-56.8921595180538,50.2349192347632,616.599079244669),(226.115441182273,56.8921595180539,-50.2349192347632,-192.49090737524))
flavour:  (G,G,h0,Z)
    and born is:  5.47928870833791e-05
    and born*sym_factor is:  0.0140269790933451
mu:  120
AlphaQED():  0.00759588004468592
AlphaQCD():  0.113307297485655

Momenta are:  ((794.860811429013,0,0,794.860811429013),(254.689079769559,0,0,-254.689079769559),(788.296197887125,60.6574698279874,-30.9039382662622,775.339611755388),(261.253693311452,-60.6574698279764,30.9039382662558,-235.167880095924))
flavour:  (G,G,h0,Z)
    and born is:  5.42734589917143e-05
    and born*sym_factor is:  0.0138940055018789
mu:  120
AlphaQED():  0.00759588004468592
AlphaQCD():  0.113307297485655

Momenta are:  ((141.587539682596,0,0,141.587539682596),(473.628198345884,0,0,-473.628198345884),(430.929457542964,-135.735415089585,67.6265544464675,-383.507162387393),(184.286280485516,135.735415089585,-67.6265544464675,51.466503724105))
flavour:  (G,G,h0,Z)
    and born is:  5.07282706953969e-05
    and born*sym_factor is:  0.0129864372980216
mu:  120
AlphaQED():  0.00759588004468592
AlphaQCD():  0.113307297485655

Momenta are:  ((948.251919455256,0,0,948.251919455256),(994.244895584829,0,0,-994.244895584829),(980.617807561271,845.624840824366,-340.322039078391,-339.243014378436),(961.879007478814,-845.624840824366,340.322039078391,293.250038248862))
flavour:  (G,G,h0,Z)
    and born is:  5.72939841874249e-06
    and born*sym_factor is:  0.00146672599519808
mu:  120
AlphaQED():  0.00759588004468592
AlphaQCD():  0.113307297485655

Momenta are:  ((977.580243055862,0,0,977.580243055861),(982.733971435853,0,0,-982.733971435853),(979.667724408451,229.06409469565,307.663219024279,892.74679188923),(980.646490083264,-229.064094695649,-307.663219024276,-897.900520269221))
flavour:  (G,G,h0,Z)
    and born is:  2.71258606075881e-05
    and born*sym_factor is:  0.00694422031554256
mu:  120
AlphaQED():  0.00759588004468592
AlphaQCD():  0.113307297485655

Momenta are:  ((32.6263184970242,0,0,32.626318497024),(536.230585094281,0,0,-536.230585094281),(276.532938326481,-20.8753040338964,-69.9287984921074,-235.626082602117),(292.323965264824,20.8753040338965,69.9287984921074,-267.978183995139))
flavour:  (G,G,h0,Z)
    and born is:  2.54724899558156e-06
    and born*sym_factor is:  0.000652095742868878
mu:  120
AlphaQED():  0.00759588004468592
AlphaQCD():  0.113307297485655

Momenta are:  ((45.7134834441407,0,0,45.7134834441406),(601.576435078558,0,0,-601.576435078558),(404.412480379966,119.426610554128,-11.7710833525692,-365.408238242292),(242.877438142734,-119.426610554128,11.7710833525692,-190.454713392126))
flavour:  (G,G,h0,Z)
    and born is:  1.84040119738382e-05
    and born*sym_factor is:  0.00471142706530258
mu:  120
AlphaQED():  0.00759588004468592
AlphaQCD():  0.113307297485655

Momenta are:  ((46.2774108682118,0,0,46.2774108682118),(292.982117343209,0,0,-292.982117343209),(165.659114073621,32.9131130144499,10.4772716100616,-103.07713542277),(173.6004141378,-32.9131130144499,-10.4772716100617,-143.627571052227))
flavour:  (G,G,h0,Z)
    and born is:  5.90006509149083e-07
    and born*sym_factor is:  0.000151041666342165
mu:  120
AlphaQED():  0.00759588004468592
AlphaQCD():  0.113307297485655

Momenta are:  ((136.825165231043,0,0,136.825165231043),(436.087461274314,0,0,-436.087461274314),(195.733391603392,108.44344932004,98.0384996151282,36.2633627970896),(377.179234901965,-108.443449320041,-98.0384996151279,-335.52565884036))
flavour:  (G,G,h0,Z)
    and born is:  5.11194761486018e-05
    and born*sym_factor is:  0.0130865858940421
mu:  120
AlphaQED():  0.00759588004468592
AlphaQCD():  0.113307297485655

Momenta are:  ((650.066686462147,0,0,650.066686462147),(44.3615043459925,0,0,-44.3615043459926),(496.420243128061,15.4951762591841,107.963547172287,467.88014467596),(198.007947680079,-15.4951762591841,-107.963547172287,137.825037440195))
flavour:  (G,G,h0,Z)
    and born is:  2.56719673069706e-05
    and born*sym_factor is:  0.00657202363058448
mu:  120
AlphaQED():  0.00759588004468592
AlphaQCD():  0.113307297485655

Momenta are:  ((482.876289673152,0,0,482.876289673152),(329.57147715289,0,0,-329.57147715289),(414.988573210092,370.164031632375,-98.5720184539189,99.2605800836062),(397.45919361595,-370.164031632375,98.5720184539188,54.0442324366567))
flavour:  (G,G,h0,Z)
    and born is:  2.45242986995005e-05
    and born*sym_factor is:  0.00627822046707212
mu:  120
AlphaQED():  0.00759588004468592
AlphaQCD():  0.113307297485655

Momenta are:  ((255.702683134985,0,0,255.702683134985),(114.460648334391,0,0,-114.460648334391),(224.822952966895,-32.3856874269814,108.172160314568,148.896981713921),(145.340378502481,32.3856874269813,-108.172160314568,-7.65494691332666))
flavour:  (G,G,h0,Z)
    and born is:  2.92105807939238e-05
    and born*sym_factor is:  0.00747790868324449
mu:  120
AlphaQED():  0.00759588004468592
AlphaQCD():  0.113307297485655

Momenta are:  ((581.579579471963,0,0,581.579579471963),(675.910646473398,0,0,-675.910646473398),(646.782455333589,-281.079868968646,-511.62588190149,-248.868657641812),(610.707770611772,281.079868968646,511.62588190149,154.537590640377))
flavour:  (G,G,h0,Z)
    and born is:  1.15436054019275e-05
    and born*sym_factor is:  0.00295516298289343
mu:  120
AlphaQED():  0.00759588004468592
AlphaQCD():  0.113307297485655

Momenta are:  ((42.9182905769309,0,0,42.9182905769309),(274.672005986181,0,0,-274.672005986181),(188.978139428498,-5.2545755537078,-6.84424539759749,-141.46831066548),(128.612157134614,5.2545755537078,6.84424539759749,-90.2854047437703))
flavour:  (G,G,h0,Z)
    and born is:  2.77149378252246e-08
    and born*sym_factor is:  7.0950240832575e-06
mu:  120
AlphaQED():  0.00759588004468592
AlphaQCD():  0.113307297485655

Momenta are:  ((970.291576809523,0,0,970.291576809523),(991.99481032445,0,0,-991.994810324449),(992.189185559478,510.999238281881,-11.6325742568765,-841.165169055802),(970.097201574495,-510.99923828188,11.6325742568766,819.461935540877))
flavour:  (G,G,h0,Z)
    and born is:  2.178908209382e-05
    and born*sym_factor is:  0.00557800501601793
mu:  120
AlphaQED():  0.00759588004468592
AlphaQCD():  0.113307297485655

Momenta are:  ((771.532888223558,0,0,771.532888223558),(82.057859711015,0,0,-82.0578597110151),(213.972165022035,112.461591641383,-108.361967748781,75.9549982247101),(639.61858291254,-112.461591641385,108.361967748782,613.520030287835))
flavour:  (G,G,h0,Z)
    and born is:  5.04399893129103e-05
    and born*sym_factor is:  0.012912637264105
mu:  120
AlphaQED():  0.00759588004468592
AlphaQCD():  0.113307297485655

Momenta are:  ((680.921133118087,0,0,680.921133118087),(28.67768324254,0,0,-28.6776832425401),(220.289064780853,48.5407375685092,14.4067613107612,174.179545546724),(489.309751579728,-48.5407375685026,-14.4067613107354,478.063904328774))
flavour:  (G,G,h0,Z)
    and born is:  4.13425443927022e-06
    and born*sym_factor is:  0.00105836913645318
mu:  120
AlphaQED():  0.00759588004468592
AlphaQCD():  0.113307297485655

Momenta are:  ((482.950336629439,0,0,482.950336629439),(64.7339722271139,0,0,-64.7339722271139),(235.471781124707,127.614989082572,31.62777474339,150.120145657664),(312.212527731846,-127.614989082572,-31.62777474339,268.096218744661))
flavour:  (G,G,h0,Z)
    and born is:  4.50020783319961e-05
    and born*sym_factor is:  0.011520532052991
mu:  120
AlphaQED():  0.00759588004468592
AlphaQCD():  0.113307297485655

Momenta are:  ((267.514326651672,0,0,267.514326651672),(47.7234424662907,0,0,-47.7234424662907),(154.875785252812,-7.99937888373532,-17.8128631400516,89.3320810342132),(160.361983865151,7.9993788837353,17.8128631400516,130.458803151168))
flavour:  (G,G,h0,Z)
    and born is:  3.17852504820738e-07
    and born*sym_factor is:  8.1370241234109e-05
mu:  120
AlphaQED():  0.00759588004468592
AlphaQCD():  0.113307297485655

Momenta are:  ((852.312904332632,0,0,852.312904332632),(710.528893382905,0,0,-710.528893382905),(837.684304853306,-338.37727286821,-359.141036299253,665.28830731476),(725.157492862231,338.37727286821,359.141036299253,-523.504296365033))
flavour:  (G,G,h0,Z)
    and born is:  1.99238216920656e-05
    and born*sym_factor is:  0.0051004983531688
mu:  120
AlphaQED():  0.00759588004468592
AlphaQCD():  0.113307297485655

Momenta are:  ((727.876154132517,0,0,727.876154132517),(140.031199246635,0,0,-140.031199246635),(429.073501229915,-295.624780657425,49.0399691670338,280.499803819975),(438.833852149239,295.624780657425,-49.0399691670359,307.345151065909))
flavour:  (G,G,h0,Z)
    and born is:  3.48878418549461e-05
    and born*sym_factor is:  0.00893128751486619
mu:  120
AlphaQED():  0.00759588004468592
AlphaQCD():  0.113307297485655

Momenta are:  ((444.380332350644,0,0,444.380332350644),(300.298000229698,0,0,-300.298000229699),(350.027030837701,-110.401248520722,-299.989102152077,-68.6441929962991),(394.651301742642,110.401248520722,299.989102152077,212.726525117245))
flavour:  (G,G,h0,Z)
    and born is:  3.1527066591128e-05
    and born*sym_factor is:  0.00807092904732876
mu:  120
AlphaQED():  0.00759588004468592
AlphaQCD():  0.113307297485655

Momenta are:  ((269.973283205245,0,0,269.973283205245),(588.73774831391,0,0,-588.73774831391),(392.350998474457,306.223475799994,205.463549197862,-48.2308907640376),(466.360033044698,-306.223475799994,-205.463549197862,-270.533574344628))
flavour:  (G,G,h0,Z)
    and born is:  2.59585833629237e-05
    and born*sym_factor is:  0.00664539734090846
mu:  120
AlphaQED():  0.00759588004468592
AlphaQCD():  0.113307297485655

Momenta are:  ((15.3665316261774,0,0,15.3665316261773),(857.902400238161,0,0,-857.902400238161),(426.833114695066,-24.7132422422646,-22.0920415720003,-406.771072173708),(446.435817169272,24.7132422422646,22.0920415720003,-435.764796438275))
flavour:  (G,G,h0,Z)
    and born is:  4.55269205939295e-07
    and born*sym_factor is:  0.000116548916720459
mu:  120
AlphaQED():  0.00759588004468592
AlphaQCD():  0.113307297485655

Momenta are:  ((804.53095800595,0,0,804.53095800595),(39.0316332639934,0,0,-39.0316332639933),(419.548928751272,52.2399461095822,-129.056966944087,375.515100801554),(424.01366251867,-52.2399461095822,129.056966944086,389.984223940402))
flavour:  (G,G,h0,Z)
    and born is:  4.50487679742496e-05
    and born*sym_factor is:  0.0115324846014079
mu:  120
AlphaQED():  0.00759588004468592
AlphaQCD():  0.113307297485655

Momenta are:  ((262.030464385457,0,0,262.030464385458),(122.615989811328,0,0,-122.615989811328),(255.498890861083,46.6605234381409,-6.58945685322693,217.79361295066),(129.147563335702,-46.6605234381409,6.58945685322692,-78.3791383765306))
flavour:  (G,G,h0,Z)
    and born is:  4.78982313616916e-05
    and born*sym_factor is:  0.0122619472285931
mu:  120
AlphaQED():  0.00759588004468592
AlphaQCD():  0.113307297485655

Momenta are:  ((959.040350446668,0,0,959.040350446668),(20.5582124787275,0,0,-20.5582124787276),(427.542241375628,31.94945959376,-76.5304180264356,400.361955371464),(552.056321549766,-31.94945959376,76.5304180264356,538.120182596476))
flavour:  (G,G,h0,Z)
    and born is:  4.23392884768787e-06
    and born*sym_factor is:  0.00108388578500809
mu:  120
AlphaQED():  0.00759588004468592
AlphaQCD():  0.113307297485655

Momenta are:  ((324.044467569516,0,0,324.044467569516),(605.910448565025,0,0,-605.910448565025),(542.842776914126,224.662919896328,-283.651662277926,-384.865674435204),(387.112139220415,-224.662919896328,283.651662277926,102.999693439695))
flavour:  (G,G,h0,Z)
    and born is:  2.6372048984216e-05
    and born*sym_factor is:  0.00675124453995929
mu:  120
AlphaQED():  0.00759588004468592
AlphaQCD():  0.113307297485655

Momenta are:  ((503.544698973245,0,0,503.544698973245),(456.441140233775,0,0,-456.441140233775),(479.598824976449,267.327106774606,372.925169972303,-62.0730900103996),(480.387014230572,-267.327106774605,-372.925169972302,109.17664874987))
flavour:  (G,G,h0,Z)
    and born is:  1.77405432739556e-05
    and born*sym_factor is:  0.00454157907813264
mu:  120
AlphaQED():  0.00759588004468592
AlphaQCD():  0.113307297485655

Momenta are:  ((264.035076128289,0,0,264.035076128289),(186.648716555584,0,0,-186.648716555584),(250.575978249431,-6.46228309851058,167.214832587277,138.422395354305),(200.107814434442,6.46228309851069,-167.214832587276,-61.0360357815994))
flavour:  (G,G,h0,Z)
    and born is:  4.95487250867976e-05
    and born*sym_factor is:  0.0126844736222202
mu:  120
AlphaQED():  0.00759588004468592
AlphaQCD():  0.113307297485655

Momenta are:  ((882.751068467287,0,0,882.751068467287),(34.1797332188377,0,0,-34.1797332188376),(508.015596264032,-49.5374909768028,-125.615707575861,473.520408267098),(408.915205422092,49.5374909768028,125.615707575861,375.050926981351))
flavour:  (G,G,h0,Z)
    and born is:  4.01356191940985e-05
    and born*sym_factor is:  0.0102747185136892
mu:  120
AlphaQED():  0.00759588004468592
AlphaQCD():  0.113307297485655

Momenta are:  ((54.46286088893,0,0,54.4628608889299),(858.534815989499,0,0,-858.534815989499),(157.331297861901,72.9966139465397,21.4317844438341,-57.7954172474195),(755.666379016527,-72.9966139465395,-21.4317844438341,-746.276537853149))
flavour:  (G,G,h0,Z)
    and born is:  5.34154041457253e-05
    and born*sym_factor is:  0.0136743434613057
mu:  120
AlphaQED():  0.00759588004468592
AlphaQCD():  0.113307297485655

Momenta are:  ((66.6741121140152,0,0,66.6741121140152),(263.179567559401,0,0,-263.179567559401),(170.689729313295,-58.2914558351737,46.1824538733526,-89.326764320093),(159.163950360122,58.2914558351737,-46.1824538733526,-107.178691125293))
flavour:  (G,G,h0,Z)
    and born is:  2.5793813019026e-06
    and born*sym_factor is:  0.000660321613287066
mu:  120
AlphaQED():  0.00759588004468592
AlphaQCD():  0.113307297485655

Momenta are:  ((150.049370061668,0,0,150.049370061668),(255.624296035368,0,0,-255.624296035368),(208.181569473871,126.790340780911,-100.700805020265,-38.7055967727539),(197.492096623165,-126.790340780911,100.700805020265,-66.8693292009457))
flavour:  (G,G,h0,Z)
    and born is:  4.84850002245927e-05
    and born*sym_factor is:  0.0124121600574957
mu:  120
AlphaQED():  0.00759588004468592
AlphaQCD():  0.113307297485655

Momenta are:  ((15.223496129189,0,0,15.2234961291891),(931.085958505319,0,0,-931.085958505319),(711.04783222034,14.5438783095642,10.6469554249519,-699.74219370361),(235.261622414168,-14.5438783095642,-10.6469554249519,-216.12026867252))
flavour:  (G,G,h0,Z)
    and born is:  8.35142770816858e-07
    and born*sym_factor is:  0.000213796549329116
mu:  120
AlphaQED():  0.00759588004468592
AlphaQCD():  0.113307297485655

Momenta are:  ((439.999733115218,0,0,439.999733115218),(533.766183843405,0,0,-533.766183843405),(453.20090953695,-177.315387102137,-203.569419298465,341.884204707418),(520.565007421673,177.315387102137,203.569419298465,-435.650655435604))
flavour:  (G,G,h0,Z)
    and born is:  3.51093719136515e-05
    and born*sym_factor is:  0.00898799920989478
mu:  120
AlphaQED():  0.00759588004468592
AlphaQCD():  0.113307297485655

Momenta are:  ((907.438854089835,0,0,907.438854089835),(458.363263619681,0,0,-458.363263619681),(484.092513101078,-256.021565366312,49.3503014496635,-388.250005865715),(881.709604608439,256.021565366312,-49.3503014496636,837.32559633587))
flavour:  (G,G,h0,Z)
    and born is:  3.51022611671395e-05
    and born*sym_factor is:  0.0089861788587877
mu:  120
AlphaQED():  0.00759588004468592
AlphaQCD():  0.113307297485655

Momenta are:  ((30.8811370941094,0,0,30.8811370941096),(867.58747050249,0,0,-867.58747050249),(679.082485140488,11.1192145388465,-93.5322183388881,-660.79959808192),(219.38612245611,-11.1192145388465,93.532218338888,-175.90673532646))
flavour:  (G,G,h0,Z)
    and born is:  1.613805794689e-05
    and born*sym_factor is:  0.00413134283440383
mu:  120
AlphaQED():  0.00759588004468592
AlphaQCD():  0.113307297485655

Momenta are:  ((802.146061484744,0,0,802.146061484744),(376.444068818549,0,0,-376.444068818549),(444.227106793057,203.952436003852,-318.060425245259,-197.366897302034),(734.363023510235,-203.952436003851,318.060425245258,623.068889968227))
flavour:  (G,G,h0,Z)
    and born is:  2.50723644518994e-05
    and born*sym_factor is:  0.00641852529968625
mu:  120
AlphaQED():  0.00759588004468592
AlphaQCD():  0.113307297485655

Momenta are:  ((341.919457074929,0,0,341.919457074929),(161.230309939148,0,0,-161.230309939148),(324.328073503778,118.227270252226,-34.8872445417074,272.706604246516),(178.821693510298,-118.227270252205,34.8872445417414,-92.0174571107403))
flavour:  (G,G,h0,Z)
    and born is:  5.23467071447936e-05
    and born*sym_factor is:  0.0134007570290672
mu:  120
AlphaQED():  0.00759588004468592
AlphaQCD():  0.113307297485655

Momenta are:  ((290.374701614181,0,0,290.374701614181),(292.303495663659,0,0,-292.303495663659),(297.262314241784,222.925886177405,-110.027274371955,104.584566904864),(285.415883036058,-222.925886177405,110.027274371955,-106.513360954341))
flavour:  (G,G,h0,Z)
    and born is:  4.12511627962958e-05
    and born*sym_factor is:  0.0105602976758517
mu:  120
AlphaQED():  0.00759588004468592
AlphaQCD():  0.113307297485655

Momenta are:  ((324.433144869377,0,0,324.433144869377),(135.760903894392,0,0,-135.760903894392),(248.35151862814,5.67539102305989,-178.167292106909,119.489257947859),(211.842530135629,-5.67539102305989,178.167292106909,69.182983027126))
flavour:  (G,G,h0,Z)
    and born is:  4.85990854672758e-05
    and born*sym_factor is:  0.0124413658796226
mu:  120
AlphaQED():  0.00759588004468592
AlphaQCD():  0.113307297485655

Momenta are:  ((24.0498975720812,0,0,24.0498975720812),(507.258338758614,0,0,-507.258338758614),(304.308362056572,-18.9573997620465,-11.9797901349046,-276.542367170275),(226.999874274123,18.9573997620465,11.9797901349046,-206.666074016258))
flavour:  (G,G,h0,Z)
    and born is:  1.42267636429085e-07
    and born*sym_factor is:  3.64205149258459e-05
mu:  120
AlphaQED():  0.00759588004468592
AlphaQCD():  0.113307297485655

Momenta are:  ((867.331491170361,0,0,867.331491170361),(550.623428077046,0,0,-550.623428077046),(711.713439692633,214.468923570324,647.775434314875,159.063156513004),(706.241479554774,-214.468923570324,-647.775434314874,157.644906580311))
flavour:  (G,G,h0,Z)
    and born is:  7.39446049140248e-06
    and born*sym_factor is:  0.00189298188579903
mu:  120
AlphaQED():  0.00759588004468592
AlphaQCD():  0.113307297485655

Momenta are:  ((151.793345043164,0,0,151.793345043164),(378.257179556862,0,0,-378.257179556862),(178.784271294957,-67.9901130304081,27.2355077110785,104.758709959127),(351.266253305069,67.9901130304082,-27.2355077110785,-331.222544472826))
flavour:  (G,G,h0,Z)
    and born is:  5.47437220193734e-05
    and born*sym_factor is:  0.0140143928369596
mu:  120
AlphaQED():  0.00759588004468592
AlphaQCD():  0.113307297485655

Momenta are:  ((107.407542377483,0,0,107.407542377483),(321.1280212949,0,0,-321.1280212949),(278.344150657901,115.784738925419,-28.561375324511,-218.239795355964),(150.191413014482,-115.784738925419,28.561375324511,4.51931643854697))
flavour:  (G,G,h0,Z)
    and born is:  4.84573723156161e-05
    and born*sym_factor is:  0.0124050873127977
mu:  120
AlphaQED():  0.00759588004468592
AlphaQCD():  0.113307297485655

Momenta are:  ((75.574789116342,0,0,75.5747891163421),(199.395610409546,0,0,-199.395610409546),(141.573835019044,-39.9491070111667,33.2003551337836,-41.4723525978497),(133.396564506845,39.9491070111667,-33.2003551337836,-82.3484686953544))
flavour:  (G,G,h0,Z)
    and born is:  1.21432111555035e-06
    and born*sym_factor is:  0.000310866205580889
mu:  120
AlphaQED():  0.00759588004468592
AlphaQCD():  0.113307297485655

Momenta are:  ((33.4095266866205,0,0,33.4095266866204),(801.61719944382,0,0,-801.61719944382),(531.091024890309,-85.8873769485966,79.0275668945084,-502.802823053593),(303.93570124013,85.8873769485965,-79.0275668945083,-265.404849703606))
flavour:  (G,G,h0,Z)
    and born is:  1.58784176988791e-05
    and born*sym_factor is:  0.00406487493091304
mu:  120
AlphaQED():  0.00759588004468592
AlphaQCD():  0.113307297485655

Momenta are:  ((605.584162060563,0,0,605.584162060562),(510.604730012713,0,0,-510.604730012713),(593.309451380394,17.3591852834695,396.593034354883,422.851899469288),(522.879440692882,-17.3591852834695,-396.593034354883,-327.872467421438))
flavour:  (G,G,h0,Z)
    and born is:  2.35600023061656e-05
    and born*sym_factor is:  0.00603136059037839
mu:  120
AlphaQED():  0.00759588004468592
AlphaQCD():  0.113307297485655

Momenta are:  ((680.479976649772,0,0,680.479976649772),(192.11144332772,0,0,-192.11144332772),(547.766025489127,76.8739854048879,297.540956088235,435.869692107885),(324.825394488365,-76.8739854048879,-297.540956088235,52.498841214166))
flavour:  (G,G,h0,Z)
    and born is:  3.29171159623724e-05
    and born*sym_factor is:  0.00842678168636734
mu:  120
AlphaQED():  0.00759588004468592
AlphaQCD():  0.113307297485655

Momenta are:  ((317.234845531351,0,0,317.234845531351),(253.320395656715,0,0,-253.320395656715),(279.8991569534,-176.113903113011,-162.290901342493,-73.2399790754062),(290.656084234668,176.113903113011,162.290901342493,137.154428950043))
flavour:  (G,G,h0,Z)
    and born is:  4.24500616539358e-05
    and born*sym_factor is:  0.0108672157834076
mu:  120
AlphaQED():  0.00759588004468592
AlphaQCD():  0.113307297485655

Momenta are:  ((429.619382767585,0,0,429.619382767585),(700.28764207781,0,0,-700.28764207781),(485.926093412953,-359.893504120315,-218.363888836095,208.069810409756),(643.980931432442,359.893504120315,218.363888836095,-478.738069719981))
flavour:  (G,G,h0,Z)
    and born is:  2.15994542475376e-05
    and born*sym_factor is:  0.00552946028736963
mu:  120
AlphaQED():  0.00759588004468592
AlphaQCD():  0.113307297485655

Momenta are:  ((448.368579027746,0,0,448.368579027746),(606.682635929708,0,0,-606.682635929709),(532.332991803407,300.526855371448,-411.914961518037,-88.1083868908582),(522.718223154047,-300.52685537145,411.914961518036,-70.2056700111042))
flavour:  (G,G,h0,Z)
    and born is:  1.42352940991652e-05
    and born*sym_factor is:  0.00364423528938629
mu:  120
AlphaQED():  0.00759588004468592
AlphaQCD():  0.113307297485655

Momenta are:  ((22.4262089851188,0,0,22.4262089851187),(753.126227634901,0,0,-753.126227634901),(325.572721198549,-29.0106648317691,53.8792545705816,-294.326356348808),(449.979715421471,29.0106648317691,-53.8792545705816,-436.373662300974))
flavour:  (G,G,h0,Z)
    and born is:  2.18057313077011e-06
    and born*sym_factor is:  0.000558226721477148
mu:  120
AlphaQED():  0.00759588004468592
AlphaQCD():  0.113307297485655

Momenta are:  ((376.843709446614,0,0,376.843709446614),(41.1796757750691,0,0,-41.1796757750691),(295.79431224999,-18.8990073036073,35.7338469138515,265.019234900261),(122.229072971693,18.8990073036073,-35.7338469138515,70.6447987712827))
flavour:  (G,G,h0,Z)
    and born is:  1.43939476155427e-06
    and born*sym_factor is:  0.000368485058957894
mu:  120
AlphaQED():  0.00759588004468592
AlphaQCD():  0.113307297485655

Momenta are:  ((121.706711753343,0,0,121.706711753343),(399.894651302067,0,0,-399.894651302067),(275.238418928092,-82.611635130216,172.885590454301,-153.026395136314),(246.362944127318,82.6116351302159,-172.885590454302,-125.16154441241))
flavour:  (G,G,h0,Z)
    and born is:  4.80178259983492e-05
    and born*sym_factor is:  0.0122925634555774
mu:  120
AlphaQED():  0.00759588004468592
AlphaQCD():  0.113307297485655

Momenta are:  ((241.51691650949,0,0,241.51691650949),(601.717171746782,0,0,-601.717171746782),(406.219752689228,-321.404969749724,-167.800453126368,-133.907956543523),(437.014335567043,321.404969749724,167.800453126371,-226.292298693767))
flavour:  (G,G,h0,Z)
    and born is:  2.67800988010208e-05
    and born*sym_factor is:  0.00685570529306133
mu:  120
AlphaQED():  0.00759588004468592
AlphaQCD():  0.113307297485655

Momenta are:  ((128.953604519189,0,0,128.953604519189),(148.556359779283,0,0,-148.556359779283),(146.682983600395,-2.14439036667727,41.6801036221837,64.4132612892181),(130.826980698077,2.1443903666773,-41.6801036221837,-84.0160165493123))
flavour:  (G,G,h0,Z)
    and born is:  3.82858253887211e-06
    and born*sym_factor is:  0.00098011712995126
mu:  120
AlphaQED():  0.00759588004468592
AlphaQCD():  0.113307297485655

Momenta are:  ((657.224847476833,0,0,657.224847476833),(561.352973093082,0,0,-561.352973093082),(607.891008761286,-342.213194468065,486.552491605642,-7.95493413665664),(610.686811808629,342.213194468065,-486.552491605642,103.826808520408))
flavour:  (G,G,h0,Z)
    and born is:  1.02329736443353e-05
    and born*sym_factor is:  0.00261964125294982
mu:  120
AlphaQED():  0.00759588004468592
AlphaQCD():  0.113307297485655

Momenta are:  ((166.468395347975,0,0,166.468395347975),(132.834842928388,0,0,-132.834842928388),(154.636498160297,-52.2943021302248,57.422094980816,-47.4916364848222),(144.666740116065,52.2943021302248,-57.422094980816,81.125188904409))
flavour:  (G,G,h0,Z)
    and born is:  6.81327877892643e-06
    and born*sym_factor is:  0.00174419936740517
mu:  120
AlphaQED():  0.00759588004468592
AlphaQCD():  0.113307297485655

Momenta are:  ((20.1220721599839,0,0,20.1220721599838),(652.260097494246,0,0,-652.260097494246),(403.859673833533,3.0613007019526,36.6422176300145,-382.263799586221),(268.522495820696,-3.06130070195249,-36.6422176300144,-249.87422574804))
flavour:  (G,G,h0,Z)
    and born is:  4.34063772963646e-07
    and born*sym_factor is:  0.000111120325878693
mu:  120
AlphaQED():  0.00759588004468592
AlphaQCD():  0.113307297485655

Momenta are:  ((220.918234850883,0,0,220.918234850883),(744.390733644266,0,0,-744.390733644266),(459.496588021321,184.457408068644,341.353801065347,-212.049903348419),(505.812380473828,-184.457408068644,-341.353801065347,-311.422595444965))
flavour:  (G,G,h0,Z)
    and born is:  2.39916469798339e-05
    and born*sym_factor is:  0.00614186162683749
mu:  120
AlphaQED():  0.00759588004468592
AlphaQCD():  0.113307297485655

Momenta are:  ((332.661056073677,0,0,332.661056073676),(122.634075028503,0,0,-122.634075028504),(154.416333649185,-54.4720612349933,13.8372518917044,-71.1388016665522),(300.878797452995,54.4720612349933,-13.8372518917043,281.165782711725))
flavour:  (G,G,h0,Z)
    and born is:  5.25184472101402e-05
    and born*sym_factor is:  0.0134447224857959
mu:  120
AlphaQED():  0.00759588004468592
AlphaQCD():  0.113307297485655

Momenta are:  ((24.6001237694973,0,0,24.600123769497),(999.96678748867,0,0,-999.96678748867),(749.608706374431,91.6696928481574,-15.9579811460756,-733.232720848718),(274.958204883737,-91.6696928481573,15.9579811460756,-242.133942870456))
flavour:  (G,G,h0,Z)
    and born is:  1.06571884305148e-05
    and born*sym_factor is:  0.00272824023821178
mu:  120
AlphaQED():  0.00759588004468592
AlphaQCD():  0.113307297485655
  
------------------------------------------------------------------------
|              You are using CutTools - Version 1.9.5                  |
|              Authors: G. Ossola, C. Papadopoulos, R. Pittau          |
|              Published in JHEP 0803:042,2008                         |
|              http://www.ugr.es/~pittau/CutTools                      |
|                                                                      |
|              Compiler with  34  significant digits detetected        |
 ---------------------------------------------------------------------- 
   
########################################################################
#                                                                      #
#                     You are using OneLOop-3.6.1                      #
#                                                                      #
# for the evaluation of 1-loop scalar 1-, 2-, 3- and 4-point functions #
#                                                                      #
# author: Andreas van Hameren <hamerenREMOVETHIS@ifj.edu.pl>           #
#   date: 11-12-2015                                                   #
#                                                                      #
# Please cite                                                          #
#    A. van Hameren,                                                   #
#      Comput.Phys.Commun. 182 (2011) 2427-2438, arXiv:1007.4716       #
#    A. van Hameren, C.G. Papadopoulos and R. Pittau,                  #
#      JHEP 0909:106,2009, arXiv:0903.4665                             #
# in publications with results obtained with the help of this program. #
#                                                                      #
########################################################################
[OpenLoops] Library for 21 21 -> 25 23 not installed but available in: pphz2
[OpenLoops] Note: this library can be downloaded and installed via
[OpenLoops] $ cd /work1/Stephan/programs/OpenLoops
[OpenLoops] $ ./openloops libinstall pphz2
