1.0000000000000000e+03   0.0000000000000000e+00   0.0000000000000000e+00   9.8509694954354620e+02   1.0000000000000000e+03   0.0000000000000000e+00   0.0000000000000000e+00   -9.8509694954354620e+02   1.0039062499999998e+03   2.2098197291544815e+02   8.8618633843336693e+02   -3.9754685259667264e+02   9.9609375000000023e+02   -2.2098197291544818e+02   -8.8618633843336704e+02   3.9754685259667252e+02   1.4480115567085887e+00
1.0000000000000000e+03   0.0000000000000000e+00   0.0000000000000000e+00   9.8509694954354620e+02   1.0000000000000000e+03   0.0000000000000000e+00   0.0000000000000000e+00   -9.8509694954354620e+02   1.0039062499999998e+03   -5.6162854672964556e+02   -7.7852887877574301e+02   2.6583626389112732e+02   9.9609375000000011e+02   5.6162854672964568e+02   7.7852887877574324e+02   -2.6583626389112732e+02   1.3164103039349599e+00
1.0000000000000000e+03   0.0000000000000000e+00   0.0000000000000000e+00   9.8509694954354620e+02   1.0000000000000000e+03   0.0000000000000000e+00   0.0000000000000000e+00   -9.8509694954354620e+02   1.0039062499999978e+03   -4.7936220639773995e+02   5.5875282443545063e+02   -6.7097683644963217e+02   9.9609375000000227e+02   4.7936220639773967e+02   -5.5875282443545063e+02   6.7097683644963217e+02   2.1806096030067339e+00
1.0000000000000000e+03   0.0000000000000000e+00   0.0000000000000000e+00   9.8509694954354620e+02   1.0000000000000000e+03   0.0000000000000000e+00   0.0000000000000000e+00   -9.8509694954354620e+02   1.0039062500000000e+03   8.9854671360463794e+02   1.2048687674771585e+02   -4.1267356929048429e+02   9.9609375000000000e+02   -8.9854671360463794e+02   -1.2048687674771585e+02   4.1267356929048412e+02   1.4686323585038841e+00
1.0000000000000000e+03   0.0000000000000000e+00   0.0000000000000000e+00   9.8509694954354620e+02   1.0000000000000000e+03   0.0000000000000000e+00   0.0000000000000000e+00   -9.8509694954354620e+02   1.0039062500000000e+03   9.0789758505745544e+02   -4.0578760066798776e+02   -5.7106540606299561e+01   9.9609375000000000e+02   -9.0789758505745567e+02   4.0578760066798804e+02   5.7106540606300797e+01   1.2303174685538807e+00
1.0000000000000000e+03   0.0000000000000000e+00   0.0000000000000000e+00   9.8509694954354620e+02   1.0000000000000000e+03   0.0000000000000000e+00   0.0000000000000000e+00   -9.8509694954354620e+02   1.0039062500000001e+03   -3.7320698675988416e+02   8.8561287131609481e+02   -2.6193347625290528e+02   9.9609374999999977e+02   3.7320698675988416e+02   -8.8561287131609504e+02   2.6193347625290528e+02   1.3135991508862226e+00
1.0000000000000000e+03   0.0000000000000000e+00   0.0000000000000000e+00   9.8509694954354620e+02   1.0000000000000000e+03   0.0000000000000000e+00   0.0000000000000000e+00   -9.8509694954354620e+02   1.0039062500000000e+03   2.3401847215689818e+02   -9.6349987084923896e+02   9.5425952192852847e+01   9.9609375000000000e+02   -2.3401847215689799e+02   9.6349987084923896e+02   -9.5425952192852847e+01   1.2373286611652761e+00
1.0000000000000000e+03   0.0000000000000000e+00   0.0000000000000000e+00   9.8509694954354620e+02   1.0000000000000000e+03   0.0000000000000000e+00   0.0000000000000000e+00   -9.8509694954354620e+02   1.0039062499999999e+03   -2.7038220805217804e+02   9.2976918562517960e+02   -2.3372094861133272e+02   9.9609375000000011e+02   2.7038220805217799e+02   -9.2976918562517960e+02   2.3372094861133272e+02   1.2948311209683816e+00
1.0000000000000000e+03   0.0000000000000000e+00   0.0000000000000000e+00   9.8509694954354620e+02   1.0000000000000000e+03   0.0000000000000000e+00   0.0000000000000000e+00   -9.8509694954354620e+02   1.0039062500000022e+03   -3.6980390408385460e+02   -2.8142941047538460e+02   -8.8104785240807416e+02   9.9609374999999795e+02   3.6980390408385421e+02   2.8142941047538596e+02   8.8104785240807132e+02   5.0640264887338171e+00
1.0000000000000000e+03   0.0000000000000000e+00   0.0000000000000000e+00   9.8509694954354620e+02   1.0000000000000000e+03   0.0000000000000000e+00   0.0000000000000000e+00   -9.8509694954354620e+02   1.0039062499999997e+03   -3.1725311470327154e+02   4.1276654192938554e+02   8.4922140921186906e+02   9.9609375000000034e+02   3.1725311470327148e+02   -4.1276654192938565e+02   -8.4922140921186872e+02   4.1366166714293549e+00
1.0000000000000000e+03   0.0000000000000000e+00   0.0000000000000000e+00   9.8509694954354620e+02   1.0000000000000000e+03   0.0000000000000000e+00   0.0000000000000000e+00   -9.8509694954354620e+02   1.0039062500000000e+03   7.5445100440886108e+01   -5.9687284686909754e+02   -7.9388513040546741e+02   9.9609375000000000e+02   -7.5445100440886009e+01   5.9687284686909754e+02   7.9388513040546741e+02   3.1777347783165779e+00
1.0000000000000000e+03   0.0000000000000000e+00   0.0000000000000000e+00   9.8509694954354620e+02   1.0000000000000000e+03   0.0000000000000000e+00   0.0000000000000000e+00   -9.8509694954354620e+02   1.0039062499999997e+03   4.3517352772884897e+02   7.2209170923953536e+02   -5.3048121832975198e+02   9.9609375000000045e+02   -4.3517352772884846e+02   -7.2209170923953434e+02   5.3048121832975346e+02   1.6867532479129232e+00
1.0000000000000000e+03   0.0000000000000000e+00   0.0000000000000000e+00   9.8509694954354620e+02   1.0000000000000000e+03   0.0000000000000000e+00   0.0000000000000000e+00   -9.8509694954354620e+02   1.0039062499999998e+03   -7.8756029217525011e+01   -2.6094958030114697e+02   -9.5807388190661311e+02   9.9609375000000023e+02   7.8756029217525011e+01   2.6094958030114708e+02   9.5807388190661288e+02   1.2009845693112144e+01
1.0000000000000000e+03   0.0000000000000000e+00   0.0000000000000000e+00   9.8509694954354620e+02   1.0000000000000000e+03   0.0000000000000000e+00   0.0000000000000000e+00   -9.8509694954354620e+02   1.0039062499999994e+03   -1.4137283356490127e+02   9.8565896998951530e+02   -2.6322530237483605e+01   9.9609375000000068e+02   1.4137283356490326e+02   -9.8565896998951484e+02   2.6322530237483480e+01   1.2272621304627636e+00
1.0000000000000000e+03   0.0000000000000000e+00   0.0000000000000000e+00   9.8509694954354620e+02   1.0000000000000000e+03   0.0000000000000000e+00   0.0000000000000000e+00   -9.8509694954354620e+02   1.0039062500000003e+03   -8.8784935534390831e+02   -8.3122119996787532e+01   -4.4386596419607247e+02   9.9609374999999977e+02   8.8784935534390775e+02   8.3122119996787802e+01   4.4386596419607230e+02   1.5157104855645513e+00
1.0000000000000000e+03   0.0000000000000000e+00   0.0000000000000000e+00   9.8509694954354620e+02   1.0000000000000000e+03   0.0000000000000000e+00   0.0000000000000000e+00   -9.8509694954354620e+02   1.0039062499999999e+03   4.7077314208884377e+02   -8.2274144095314773e+02   3.0605870158385869e+02   9.9609375000000011e+02   -4.7077314208884383e+02   8.2274144095314807e+02   -3.0605870158385869e+02   1.3486526579740012e+00
1.0000000000000000e+03   0.0000000000000000e+00   0.0000000000000000e+00   9.8509694954354620e+02   1.0000000000000000e+03   0.0000000000000000e+00   0.0000000000000000e+00   -9.8509694954354620e+02   1.0039062499999995e+03   6.8236246928930677e+02   -5.3121829636844780e+02   4.9435952595036247e+02   9.9609375000000057e+02   -6.8236246928930700e+02   5.3121829636844780e+02   -4.9435952595036224e+02   1.6071496026633270e+00
1.0000000000000000e+03   0.0000000000000000e+00   0.0000000000000000e+00   9.8509694954354620e+02   1.0000000000000000e+03   0.0000000000000000e+00   0.0000000000000000e+00   -9.8509694954354620e+02   1.0039062499999978e+03   -3.8783653021921259e+02   6.8714966228022115e+02   6.0795635225298815e+02   9.9609375000000216e+02   3.8783653021921049e+02   -6.8714966228022399e+02   -6.0795635225298554e+02   1.9128714828165405e+00
1.0000000000000000e+03   0.0000000000000000e+00   0.0000000000000000e+00   9.8509694954354620e+02   1.0000000000000000e+03   0.0000000000000000e+00   0.0000000000000000e+00   -9.8509694954354620e+02   1.0039062500000001e+03   2.2459453723746725e+02   9.6995392701971923e+02   -3.0812855939941620e+01   9.9609375000000000e+02   -2.2459453723746725e+02   -9.6995392701971923e+02   3.0812855939941610e+01   1.2275666497887647e+00
1.0000000000000000e+03   0.0000000000000000e+00   0.0000000000000000e+00   9.8509694954354620e+02   1.0000000000000000e+03   0.0000000000000000e+00   0.0000000000000000e+00   -9.8509694954354620e+02   1.0039062500000013e+03   5.3800146419770317e+02   -8.3540760162628351e+02   -6.9651435413874736e+01   9.9609374999999886e+02   -5.3800146419770329e+02   8.3540760162628317e+02   6.9651435413872989e+01   1.2322169353398860e+00
1.0000000000000000e+03   0.0000000000000000e+00   0.0000000000000000e+00   9.8509694954354620e+02   1.0000000000000000e+03   0.0000000000000000e+00   0.0000000000000000e+00   -9.8509694954354620e+02   1.0039062500000002e+03   -2.3035930735551048e+02   9.4135335608595199e+02   2.3019819132536136e+02   9.9609374999999966e+02   2.3035930735551074e+02   -9.4135335608595187e+02   -2.3019819132536122e+02   1.2926730696236681e+00
1.0000000000000000e+03   0.0000000000000000e+00   0.0000000000000000e+00   9.8509694954354620e+02   1.0000000000000000e+03   0.0000000000000000e+00   0.0000000000000000e+00   -9.8509694954354620e+02   1.0039062500000000e+03   4.7436464882565429e+02   -8.5255289023151670e+02   -2.0083452913148139e+02   9.9609375000000000e+02   -4.7436464882565429e+02   8.5255289023151670e+02   2.0083452913148139e+02   1.2762034063596055e+00
1.0000000000000000e+03   0.0000000000000000e+00   0.0000000000000000e+00   9.8509694954354620e+02   1.0000000000000000e+03   0.0000000000000000e+00   0.0000000000000000e+00   -9.8509694954354620e+02   1.0039062500000000e+03   9.0829802131052691e+02   4.0247015164921311e+02   -7.2216620690143372e+01   9.9609375000000011e+02   -9.0829802131052691e+02   -4.0247015164921322e+02   7.2216620690143188e+01   1.2326524742428373e+00
1.0000000000000000e+03   0.0000000000000000e+00   0.0000000000000000e+00   9.8509694954354620e+02   1.0000000000000000e+03   0.0000000000000000e+00   0.0000000000000000e+00   -9.8509694954354620e+02   1.0039062499999998e+03   -3.4711032768525791e+02   -3.4803321229817163e+02   -8.6636600945599901e+02   9.9609375000000034e+02   3.4711032768525752e+02   3.4803321229817163e+02   8.6636600945599901e+02   4.5849368945422775e+00
1.0000000000000000e+03   0.0000000000000000e+00   0.0000000000000000e+00   9.8509694954354620e+02   1.0000000000000000e+03   0.0000000000000000e+00   0.0000000000000000e+00   -9.8509694954354620e+02   1.0039062499999994e+03   4.4707048035285362e+02   -8.7908011470040128e+02   1.3981736774972146e+02   9.9609375000000057e+02   -4.4707048035285351e+02   8.7908011470040151e+02   -1.3981736774972183e+02   1.2500587058120631e+00
1.0000000000000000e+03   0.0000000000000000e+00   0.0000000000000000e+00   9.8509694954354620e+02   1.0000000000000000e+03   0.0000000000000000e+00   0.0000000000000000e+00   -9.8509694954354620e+02   1.0039062500000000e+03   6.4216912974779177e+02   2.8653588798784585e+02   -7.0549185146466630e+02   9.9609374999999989e+02   -6.4216912974779132e+02   -2.8653588798784585e+02   7.0549185146466630e+02   2.3770684413788228e+00
1.0000000000000000e+03   0.0000000000000000e+00   0.0000000000000000e+00   9.8509694954354620e+02   1.0000000000000000e+03   0.0000000000000000e+00   0.0000000000000000e+00   -9.8509694954354620e+02   1.0039062499999975e+03   -8.6605207550712180e+02   -1.8557227858902831e+02   -4.5576253764229045e+02   9.9609375000000250e+02   8.6605207550712350e+02   1.8557227858902991e+02   4.5576253764229057e+02   1.5354365222517512e+00
1.0000000000000000e+03   0.0000000000000000e+00   0.0000000000000000e+00   9.8509694954354620e+02   1.0000000000000000e+03   0.0000000000000000e+00   0.0000000000000000e+00   -9.8509694954354620e+02   1.0039062499999980e+03   2.9923053347631179e+02   9.1374282381107662e+02   -2.6026505443163421e+02   9.9609375000000216e+02   -2.9923053347631463e+02   -9.1374282381107491e+02   2.6026505443163995e+02   1.3124137376590628e+00
1.0000000000000000e+03   0.0000000000000000e+00   0.0000000000000000e+00   9.8509694954354620e+02   1.0000000000000000e+03   0.0000000000000000e+00   0.0000000000000000e+00   -9.8509694954354620e+02   1.0039062499999997e+03   -2.0025265033452619e+01   -9.7576793198434018e+02   -1.9919510651722425e+02   9.9609375000000034e+02   2.0025265033452811e+01   9.7576793198433973e+02   1.9919510651722516e+02   1.2753615883729246e+00
1.0000000000000000e+03   0.0000000000000000e+00   0.0000000000000000e+00   9.8509694954354620e+02   1.0000000000000000e+03   0.0000000000000000e+00   0.0000000000000000e+00   -9.8509694954354620e+02   1.0039062500000007e+03   -4.5403555877289267e+02   6.1098158412091141e+02   -6.4246087353546420e+02   9.9609374999999932e+02   4.5403555877289870e+02   -6.1098158412091061e+02   6.4246087353546295e+02   2.0473670412071741e+00
1.0000000000000000e+03   0.0000000000000000e+00   0.0000000000000000e+00   9.8509694954354620e+02   1.0000000000000000e+03   0.0000000000000000e+00   0.0000000000000000e+00   -9.8509694954354620e+02   1.0039062500000000e+03   -8.1595951446318406e+02   5.6758718221233744e+02   -6.5250441640852216e+01   9.9609375000000000e+02   8.1595951446318406e+02   -5.6758718221233744e+02   6.5250441640852259e+01   1.2315070579767429e+00
1.0000000000000000e+03   0.0000000000000000e+00   0.0000000000000000e+00   9.8509694954354620e+02   1.0000000000000000e+03   0.0000000000000000e+00   0.0000000000000000e+00   -9.8509694954354620e+02   1.0039062500000003e+03   2.4849865951185612e+02   -9.5023887726820988e+02   1.6582295117964094e+02   9.9609374999999966e+02   -2.4849865951185532e+02   9.5023887726820954e+02   -1.6582295117964091e+02   1.2599272416149279e+00
1.0000000000000000e+03   0.0000000000000000e+00   0.0000000000000000e+00   9.8509694954354620e+02   1.0000000000000000e+03   0.0000000000000000e+00   0.0000000000000000e+00   -9.8509694954354620e+02   1.0039062500000002e+03   5.9644254346842001e+02   -4.3227576400932276e+02   6.7051973496694336e+02   9.9609374999999977e+02   -5.9644254346842013e+02   4.3227576400932264e+02   -6.7051973496694336e+02   2.1782874767894103e+00
1.0000000000000000e+03   0.0000000000000000e+00   0.0000000000000000e+00   9.8509694954354620e+02   1.0000000000000000e+03   0.0000000000000000e+00   0.0000000000000000e+00   -9.8509694954354620e+02   1.0039062499999998e+03   7.8216009470695735e+02   2.2746527287879661e+02   5.7331308608058191e+02   9.9609375000000011e+02   -7.8216009470695735e+02   -2.2746527287879670e+02   -5.7331308608058237e+02   1.8007936858522580e+00
1.0000000000000000e+03   0.0000000000000000e+00   0.0000000000000000e+00   9.8509694954354620e+02   1.0000000000000000e+03   0.0000000000000000e+00   0.0000000000000000e+00   -9.8509694954354620e+02   1.0039062500000001e+03   2.9420251303527999e+02   3.4195135809488909e+02   -8.8809735322758934e+02   9.9609375000000000e+02   -2.9420251303527999e+02   -3.4195135809488903e+02   8.8809735322758934e+02   5.3351796313356523e+00
1.0000000000000000e+03   0.0000000000000000e+00   0.0000000000000000e+00   9.8509694954354620e+02   1.0000000000000000e+03   0.0000000000000000e+00   0.0000000000000000e+00   -9.8509694954354620e+02   1.0039062500000001e+03   2.3835904236499269e+02   -9.6543818016153421e+02   5.7592065410869004e+01   9.9609374999999977e+02   -2.3835904236499280e+02   9.6543818016153455e+02   -5.7592065410869708e+01   1.2303838893331613e+00
1.0000000000000000e+03   0.0000000000000000e+00   0.0000000000000000e+00   9.8509694954354620e+02   1.0000000000000000e+03   0.0000000000000000e+00   0.0000000000000000e+00   -9.8509694954354620e+02   1.0039062500000000e+03   6.5645280616950481e+02   -1.3581129142010656e+02   7.3676846104054187e+02   9.9609375000000011e+02   -6.5645280616950458e+02   1.3581129142010633e+02   -7.3676846104054187e+02   2.5997416633780381e+00
1.0000000000000000e+03   0.0000000000000000e+00   0.0000000000000000e+00   9.8509694954354620e+02   1.0000000000000000e+03   0.0000000000000000e+00   0.0000000000000000e+00   -9.8509694954354620e+02   1.0039062500000000e+03   9.0125740825792229e+02   -2.0388982153242432e+02   3.7197685885650361e+02   9.9609375000000000e+02   -9.0125740825792229e+02   2.0388982153242432e+02   -3.7197685885650350e+02   1.4161026864066208e+00
1.0000000000000000e+03   0.0000000000000000e+00   0.0000000000000000e+00   9.8509694954354620e+02   1.0000000000000000e+03   0.0000000000000000e+00   0.0000000000000000e+00   -9.8509694954354620e+02   1.0039062500000000e+03   -8.3840068734136673e+02   -1.9320082714310882e+02   -5.0195665813474881e+02   9.9609375000000011e+02   8.3840068734136685e+02   1.9320082714310882e+02   5.0195665813474892e+02   1.6228026867158918e+00
1.0000000000000000e+03   0.0000000000000000e+00   0.0000000000000000e+00   9.8509694954354620e+02   1.0000000000000000e+03   0.0000000000000000e+00   0.0000000000000000e+00   -9.8509694954354620e+02   1.0039062500000002e+03   -6.4557624463969773e+02   -6.2959357858763747e+02   -4.2313827166445225e+02   9.9609374999999977e+02   6.4557624463969717e+02   6.2959357858763769e+02   4.2313827166445259e+02   1.4837154622007014e+00
1.0000000000000000e+03   0.0000000000000000e+00   0.0000000000000000e+00   9.8509694954354620e+02   1.0000000000000000e+03   0.0000000000000000e+00   0.0000000000000000e+00   -9.8509694954354620e+02   1.0039062500000000e+03   8.6528808700075001e+02   -2.2047989298488352e+02   -4.4143844652796105e+02   9.9609375000000011e+02   -8.6528808700075001e+02   2.2047989298488343e+02   4.4143844652796110e+02   1.5118110461346250e+00
1.0000000000000000e+03   0.0000000000000000e+00   0.0000000000000000e+00   9.8509694954354620e+02   1.0000000000000000e+03   0.0000000000000000e+00   0.0000000000000000e+00   -9.8509694954354620e+02   1.0039062500000000e+03   6.2988075179949942e+02   -6.8627071627377700e+02   3.5282502928028839e+02   9.9609375000000000e+02   -6.2988075179949919e+02   6.8627071627377734e+02   -3.5282502928028839e+02   1.3944343677372388e+00
1.0000000000000000e+03   0.0000000000000000e+00   0.0000000000000000e+00   9.8509694954354620e+02   1.0000000000000000e+03   0.0000000000000000e+00   0.0000000000000000e+00   -9.8509694954354620e+02   1.0039062500000005e+03   4.3959081025399473e+02   -2.7806741379388228e+01   8.9341449700749672e+02   9.9609374999999955e+02   -4.3959081025399473e+02   2.7806741379388217e+01   -8.9341449700749661e+02   5.5614285802060763e+00
1.0000000000000000e+03   0.0000000000000000e+00   0.0000000000000000e+00   9.8509694954354620e+02   1.0000000000000000e+03   0.0000000000000000e+00   0.0000000000000000e+00   -9.8509694954354620e+02   1.0039062500000000e+03   4.9340341091700338e+02   -5.6606913219148362e+02   -6.5446281060462888e+02   9.9609375000000000e+02   -4.9340341091700338e+02   5.6606913219148362e+02   6.5446281060462911e+02   2.1006964535806789e+00
1.0000000000000000e+03   0.0000000000000000e+00   0.0000000000000000e+00   9.8509694954354620e+02   1.0000000000000000e+03   0.0000000000000000e+00   0.0000000000000000e+00   -9.8509694954354620e+02   1.0039062500000013e+03   3.7913165271395115e+02   1.2591712430417368e+02   9.1247291823177864e+02   9.9609374999999875e+02   -3.7913165271395150e+02   -1.2591712430417273e+02   -9.1247291823177852e+02   6.5751699740466716e+00
1.0000000000000000e+03   0.0000000000000000e+00   0.0000000000000000e+00   9.8509694954354620e+02   1.0000000000000000e+03   0.0000000000000000e+00   0.0000000000000000e+00   -9.8509694954354620e+02   1.0039062499999993e+03   -9.5583333247587393e+02   -1.2056721009962520e+02   2.5307893465462300e+02   9.9609375000000057e+02   9.5583333247587291e+02   1.2056721009962727e+02   -2.5307893465462655e+02   1.3074184836068836e+00
1.0000000000000000e+03   0.0000000000000000e+00   0.0000000000000000e+00   9.8509694954354620e+02   1.0000000000000000e+03   0.0000000000000000e+00   0.0000000000000000e+00   -9.8509694954354620e+02   1.0039062500000000e+03   4.7120850431174112e+01   -2.7940683376559871e+01   9.9458619659442161e+02   9.9609375000000000e+02   -4.7120850431172350e+01   2.7940683376560461e+01   -9.9458619659442127e+02   3.8997474153296629e+01
1.0000000000000000e+03   0.0000000000000000e+00   0.0000000000000000e+00   9.8509694954354620e+02   1.0000000000000000e+03   0.0000000000000000e+00   0.0000000000000000e+00   -9.8509694954354620e+02   1.0039062499999999e+03   2.2579859649540055e+02   9.5950490062083657e+02   -1.4341582302649988e+02   9.9609375000000023e+02   -2.2579859649540046e+02   -9.5950490062083657e+02   1.4341582302649982e+02   1.2513153687071106e+00
1.0000000000000000e+03   0.0000000000000000e+00   0.0000000000000000e+00   9.8509694954354620e+02   1.0000000000000000e+03   0.0000000000000000e+00   0.0000000000000000e+00   -9.8509694954354620e+02   1.0039062499999999e+03   2.7498118865868156e+02   -6.1449322780965099e+02   7.3415678001977028e+02   9.9609375000000000e+02   -2.7498118865868156e+02   6.1449322780965110e+02   -7.3415678001977028e+02   2.5791543534181636e+00
1.0000000000000000e+03   0.0000000000000000e+00   0.0000000000000000e+00   9.8509694954354620e+02   1.0000000000000000e+03   0.0000000000000000e+00   0.0000000000000000e+00   -9.8509694954354620e+02   1.0039062499999999e+03   -5.9198067342960098e+02   -4.2472407766131789e+02   -6.7924303377336219e+02   9.9609375000000011e+02   5.9198067342960098e+02   4.2472407766131789e+02   6.7924303377336264e+02   2.2237652590717509e+00
1.0000000000000000e+03   0.0000000000000000e+00   0.0000000000000000e+00   9.8509694954354620e+02   1.0000000000000000e+03   0.0000000000000000e+00   0.0000000000000000e+00   -9.8509694954354620e+02   1.0039062499999998e+03   5.6937259317697431e+02   -4.6894492920850445e+02   -6.6940889021406099e+02   9.9609375000000023e+02   -5.6937259317697476e+02   4.6894492920850416e+02   6.6940889021406099e+02   2.1726715386945465e+00
1.0000000000000000e+03   0.0000000000000000e+00   0.0000000000000000e+00   9.8509694954354620e+02   1.0000000000000000e+03   0.0000000000000000e+00   0.0000000000000000e+00   -9.8509694954354620e+02   1.0039062499999999e+03   4.2205632491644866e+02   2.2686138168414452e+01   9.0197370057118837e+02   9.9609374999999989e+02   -4.2205632491645002e+02   -2.2686138168416093e+01   -9.0197370057118837e+02   5.9724544154432220e+00
1.0000000000000000e+03   0.0000000000000000e+00   0.0000000000000000e+00   9.8509694954354620e+02   1.0000000000000000e+03   0.0000000000000000e+00   0.0000000000000000e+00   -9.8509694954354620e+02   1.0039062500000000e+03   -2.1201951991782278e+02   -1.1028329711619521e+02   -9.6699952240942673e+02   9.9609375000000000e+02   2.1201951991782329e+02   1.1028329711619517e+02   9.6699952240942662e+02   1.4412811096846923e+01
1.0000000000000000e+03   0.0000000000000000e+00   0.0000000000000000e+00   9.8509694954354620e+02   1.0000000000000000e+03   0.0000000000000000e+00   0.0000000000000000e+00   -9.8509694954354620e+02   1.0039062500000001e+03   4.9605644862104958e+02   5.5664247571356816e+02   -6.6051488461805616e+02   9.9609374999999989e+02   -4.9605644862104958e+02   -5.5664247571356793e+02   6.6051488461805616e+02   2.1290596481157364e+00
1.0000000000000000e+03   0.0000000000000000e+00   0.0000000000000000e+00   9.8509694954354620e+02   1.0000000000000000e+03   0.0000000000000000e+00   0.0000000000000000e+00   -9.8509694954354620e+02   1.0039062500000016e+03   9.7359851211911825e+02   6.1517393290469847e+01   -2.0130649843273329e+02   9.9609374999999864e+02   -9.7359851211912076e+02   -6.1517393290467858e+01   2.0130649843273073e+02   1.2764472444046204e+00
1.0000000000000000e+03   0.0000000000000000e+00   0.0000000000000000e+00   9.8509694954354620e+02   1.0000000000000000e+03   0.0000000000000000e+00   0.0000000000000000e+00   -9.8509694954354620e+02   1.0039062500000001e+03   -8.6200368744738273e+02   -2.9628003346537531e+02   4.0170952613291706e+02   9.9609374999999977e+02   8.6200368744738273e+02   2.9628003346537548e+02   -4.0170952613291729e+02   1.4535512132995758e+00
1.0000000000000000e+03   0.0000000000000000e+00   0.0000000000000000e+00   9.8509694954354620e+02   1.0000000000000000e+03   0.0000000000000000e+00   0.0000000000000000e+00   -9.8509694954354620e+02   1.0039062500000001e+03   -4.9799024809971871e+02   4.1108236256615567e+02   -7.5843243784378785e+02   9.9609374999999989e+02   4.9799024809971831e+02   -4.1108236256615538e+02   7.5843243784378797e+02   2.7874462740310140e+00
1.0000000000000000e+03   0.0000000000000000e+00   0.0000000000000000e+00   9.8509694954354620e+02   1.0000000000000000e+03   0.0000000000000000e+00   0.0000000000000000e+00   -9.8509694954354620e+02   1.0039062499999999e+03   -7.7908125884037827e+02   7.6487247229881689e+01   6.1594224723097909e+02   9.9609375000000011e+02   7.7908125884037872e+02   -7.6487247229881618e+01   -6.1594224723097921e+02   1.9417548787977954e+00
1.0000000000000000e+03   0.0000000000000000e+00   0.0000000000000000e+00   9.8509694954354620e+02   1.0000000000000000e+03   0.0000000000000000e+00   0.0000000000000000e+00   -9.8509694954354620e+02   1.0039062499999997e+03   7.1520698366401245e+02   -6.8828313963978997e+02   8.3354957830239414e+01   9.9609375000000034e+02   -7.1520698366401245e+02   6.8828313963979031e+02   -8.3354957830239442e+01   1.2347305950399294e+00
1.0000000000000000e+03   0.0000000000000000e+00   0.0000000000000000e+00   9.8509694954354620e+02   1.0000000000000000e+03   0.0000000000000000e+00   0.0000000000000000e+00   -9.8509694954354620e+02   1.0039062500000000e+03   -2.8336959907887336e+02   -4.9041860718570018e+02   8.1938636724867467e+02   9.9609375000000000e+02   2.8336959907887342e+02   4.9041860718569973e+02   -8.1938636724867490e+02   3.5497914950486211e+00
1.0000000000000000e+03   0.0000000000000000e+00   0.0000000000000000e+00   9.8509694954354620e+02   1.0000000000000000e+03   0.0000000000000000e+00   0.0000000000000000e+00   -9.8509694954354620e+02   1.0039062500000000e+03   -8.4956691771411617e+00   -8.5405704414564934e+02   -5.1255940898542872e+02   9.9609375000000000e+02   8.4956691771412185e+00   8.5405704414564946e+02   5.1255940898542781e+02   1.6455851138740600e+00
1.0000000000000000e+03   0.0000000000000000e+00   0.0000000000000000e+00   9.8509694954354620e+02   1.0000000000000000e+03   0.0000000000000000e+00   0.0000000000000000e+00   -9.8509694954354620e+02   1.0039062499999994e+03   2.6500192815975424e+02   8.7493462478293804e+02   3.9555800992599814e+02   9.9609375000000080e+02   -2.6500192815975430e+02   -8.7493462478293782e+02   -3.9555800992599814e+02   1.4454000844583759e+00
1.0000000000000000e+03   0.0000000000000000e+00   0.0000000000000000e+00   9.8509694954354620e+02   1.0000000000000000e+03   0.0000000000000000e+00   0.0000000000000000e+00   -9.8509694954354620e+02   1.0039062499999998e+03   3.0219743805357569e+02   9.4912798048331081e+02   5.9618693872115101e+00   9.9609375000000023e+02   -3.0219743805357569e+02   -9.4912798048331092e+02   -5.9618693872117818e+00   1.2264826096361672e+00
1.0000000000000000e+03   0.0000000000000000e+00   0.0000000000000000e+00   9.8509694954354620e+02   1.0000000000000000e+03   0.0000000000000000e+00   0.0000000000000000e+00   -9.8509694954354620e+02   1.0039062499999997e+03   -2.3229283164655172e+01   3.4226912706536768e+02   -9.3515506941396052e+02   9.9609375000000034e+02   2.3229283164655055e+01   -3.4226912706536785e+02   9.3515506941396075e+02   8.4534833325717660e+00
1.0000000000000000e+03   0.0000000000000000e+00   0.0000000000000000e+00   9.8509694954354620e+02   1.0000000000000000e+03   0.0000000000000000e+00   0.0000000000000000e+00   -9.8509694954354620e+02   1.0039062500000017e+03   -2.8973083127124573e+02   -9.3141938618517065e+02   2.0178387259238525e+02   9.9609374999999829e+02   2.8973083127124272e+02   9.3141938618517611e+02   -2.0178387259238846e+02   1.2766945533849183e+00
1.0000000000000000e+03   0.0000000000000000e+00   0.0000000000000000e+00   9.8509694954354620e+02   1.0000000000000000e+03   0.0000000000000000e+00   0.0000000000000000e+00   -9.8509694954354620e+02   1.0039062500000001e+03   -9.3220576436915496e+02   -2.8156051971066262e+02   -2.0956823568051627e+02   9.9609375000000000e+02   9.3220576436915474e+02   2.8156051971066250e+02   2.0956823568051595e+02   1.2808242757149915e+00
1.0000000000000000e+03   0.0000000000000000e+00   0.0000000000000000e+00   9.8509694954354620e+02   1.0000000000000000e+03   0.0000000000000000e+00   0.0000000000000000e+00   -9.8509694954354620e+02   1.0039062499999999e+03   -8.8294115043922170e+02   -3.8852155320093647e+02   -2.4833180696072526e+02   9.9609374999999989e+02   8.8294115043927241e+02   3.8852155320092885e+02   2.4833180696072418e+02   1.3042157257763318e+00
1.0000000000000000e+03   0.0000000000000000e+00   0.0000000000000000e+00   9.8509694954354620e+02   1.0000000000000000e+03   0.0000000000000000e+00   0.0000000000000000e+00   -9.8509694954354620e+02   1.0039062500000003e+03   2.4857682662667457e+02   9.5623728446734253e+02   1.2658031382404920e+02   9.9609374999999955e+02   -2.4857682662667600e+02   -9.5623728446734231e+02   -1.2658031382404903e+02   1.2457304537401745e+00
1.0000000000000000e+03   0.0000000000000000e+00   0.0000000000000000e+00   9.8509694954354620e+02   1.0000000000000000e+03   0.0000000000000000e+00   0.0000000000000000e+00   -9.8509694954354620e+02   1.0039062500000001e+03   6.3403716684240919e+02   -6.4616642889858451e+02   -4.1553408526372925e+02   9.9609374999999989e+02   -6.3403716684240919e+02   6.4616642889858463e+02   4.1553408526372920e+02   1.4726870948058903e+00
1.0000000000000000e+03   0.0000000000000000e+00   0.0000000000000000e+00   9.8509694954354620e+02   1.0000000000000000e+03   0.0000000000000000e+00   0.0000000000000000e+00   -9.8509694954354620e+02   1.0039062500000001e+03   9.3926333118153195e+02   -3.3163551829372443e+02   -2.2442132000092299e+00   9.9609374999999989e+02   -9.3926333118153195e+02   3.3163551829372443e+02   2.2442132000092299e+00   1.2264464556886940e+00
1.0000000000000000e+03   0.0000000000000000e+00   0.0000000000000000e+00   9.8509694954354620e+02   1.0000000000000000e+03   0.0000000000000000e+00   0.0000000000000000e+00   -9.8509694954354620e+02   1.0039062500000000e+03   -5.3578771223367357e+02   -1.3107820210318317e+02   8.2942919597869582e+02   9.9609375000000000e+02   5.3578771223367346e+02   1.3107820210318326e+02   -8.2942919597869570e+02   3.7254988986919773e+00
1.0000000000000000e+03   0.0000000000000000e+00   0.0000000000000000e+00   9.8509694954354620e+02   1.0000000000000000e+03   0.0000000000000000e+00   0.0000000000000000e+00   -9.8509694954354620e+02   1.0039062500000000e+03   -7.5009144923017391e+02   -3.7449590510804552e+02   5.3788325279575849e+02   9.9609375000000011e+02   7.5009144923017391e+02   3.7449590510804552e+02   -5.3788325279575861e+02   1.7048023667248886e+00
1.0000000000000000e+03   0.0000000000000000e+00   0.0000000000000000e+00   9.8509694954354620e+02   1.0000000000000000e+03   0.0000000000000000e+00   0.0000000000000000e+00   -9.8509694954354620e+02   1.0039062500000000e+03   -4.2637570318428885e+02   6.0940526279645633e+02   6.6259470583392670e+02   9.9609375000000000e+02   4.2637570318428885e+02   -6.0940526279645621e+02   -6.6259470583392681e+02   2.1390475676995115e+00
1.0000000000000000e+03   0.0000000000000000e+00   0.0000000000000000e+00   9.8509694954354620e+02   1.0000000000000000e+03   0.0000000000000000e+00   0.0000000000000000e+00   -9.8509694954354620e+02   1.0039062500000000e+03   -7.6220476682882975e+02   4.1644465982410833e+02   4.8766842989520524e+02   9.9609375000000000e+02   7.6220476682882986e+02   -4.1644465982410833e+02   -4.8766842989520529e+02   1.5938063172486128e+00
1.0000000000000000e+03   0.0000000000000000e+00   0.0000000000000000e+00   9.8509694954354620e+02   1.0000000000000000e+03   0.0000000000000000e+00   0.0000000000000000e+00   -9.8509694954354620e+02   1.0039062499999999e+03   -9.6191497484211857e+02   -1.1249900417963175e+02   2.3295131255723697e+02   9.9609375000000011e+02   9.6191497484211857e+02   1.1249900417963157e+02   -2.3295131255723709e+02   1.2943562164035312e+00
1.0000000000000000e+03   0.0000000000000000e+00   0.0000000000000000e+00   9.8509694954354620e+02   1.0000000000000000e+03   0.0000000000000000e+00   0.0000000000000000e+00   -9.8509694954354620e+02   1.0039062499999986e+03   -6.2592987305878967e+02   -2.1128591383515922e+02   7.4550172059929787e+02   9.9609375000000136e+02   6.2592987305878978e+02   2.1128591383515976e+02   -7.4550172059929844e+02   2.6716188729889709e+00
1.0000000000000000e+03   0.0000000000000000e+00   0.0000000000000000e+00   9.8509694954354620e+02   1.0000000000000000e+03   0.0000000000000000e+00   0.0000000000000000e+00   -9.8509694954354620e+02   1.0039062500000001e+03   -6.3180679681487743e+02   -3.3607358972789814e+02   6.9287623178673925e+02   9.9609375000000000e+02   6.3180679681487743e+02   3.3607358972789808e+02   -6.9287623178673925e+02   2.3000894047087077e+00
1.0000000000000000e+03   0.0000000000000000e+00   0.0000000000000000e+00   9.8509694954354620e+02   1.0000000000000000e+03   0.0000000000000000e+00   0.0000000000000000e+00   -9.8509694954354620e+02   1.0039062500000001e+03   6.5423363678547560e+01   -9.8873641355759992e+02   1.0160141130565812e+02   9.9609374999999989e+02   -6.5423363678547645e+01   9.8873641355760014e+02   -1.0160141130565830e+02   1.2387983615284672e+00
1.0000000000000000e+03   0.0000000000000000e+00   0.0000000000000000e+00   9.8509694954354620e+02   1.0000000000000000e+03   0.0000000000000000e+00   0.0000000000000000e+00   -9.8509694954354620e+02   1.0039062500000003e+03   2.1513970770801404e+01   2.2188205994482615e+02   9.7082864570704544e+02   9.9609374999999966e+02   -2.1513970770801482e+01   -2.2188205994482678e+02   -9.7082864570704544e+02   1.5776339169256962e+01
1.0000000000000000e+03   0.0000000000000000e+00   0.0000000000000000e+00   9.8509694954354620e+02   1.0000000000000000e+03   0.0000000000000000e+00   0.0000000000000000e+00   -9.8509694954354620e+02   1.0039062500000002e+03   -4.3492999806031895e+02   4.6336404103829170e+02   7.6702830524627836e+02   9.9609374999999977e+02   4.3492999806031872e+02   -4.6336404103829170e+02   -7.6702830524627825e+02   2.8714253737406237e+00
1.0000000000000000e+03   0.0000000000000000e+00   0.0000000000000000e+00   9.8509694954354620e+02   1.0000000000000000e+03   0.0000000000000000e+00   0.0000000000000000e+00   -9.8509694954354620e+02   1.0039062499999998e+03   3.0754575146172766e+02   -8.9280430903756962e+02   -3.1704705535748354e+02   9.9609375000000023e+02   -3.0754575146172783e+02   8.9280430903756951e+02   3.1704705535748349e+02   1.3585607725080586e+00
1.0000000000000000e+03   0.0000000000000000e+00   0.0000000000000000e+00   9.8509694954354620e+02   1.0000000000000000e+03   0.0000000000000000e+00   0.0000000000000000e+00   -9.8509694954354620e+02   1.0039062500000000e+03   2.4346073456822573e+01   6.6098683648215399e+01   -9.9360001585963687e+02   9.9609375000000000e+02   -2.4346073456822619e+01   -6.6098683648215371e+01   9.9360001585963687e+02   3.6728599831966605e+01
1.0000000000000000e+03   0.0000000000000000e+00   0.0000000000000000e+00   9.8509694954354620e+02   1.0000000000000000e+03   0.0000000000000000e+00   0.0000000000000000e+00   -9.8509694954354620e+02   1.0039062500000001e+03   3.5484605873918241e+02   -9.1975501074796739e+02   1.4261049607352942e+02   9.9609375000000000e+02   -3.5484605873918235e+02   9.1975501074796728e+02   -1.4261049607352953e+02   1.2510311328722370e+00
1.0000000000000000e+03   0.0000000000000000e+00   0.0000000000000000e+00   9.8509694954354620e+02   1.0000000000000000e+03   0.0000000000000000e+00   0.0000000000000000e+00   -9.8509694954354620e+02   1.0039062500000000e+03   -1.2353552946803090e+02   -2.1200264393388053e+02   -9.6539971551329972e+02   9.9609375000000000e+02   1.2353552946803111e+02   2.1200264393388062e+02   9.6539971551329972e+02   1.3911916987809693e+01
1.0000000000000000e+03   0.0000000000000000e+00   0.0000000000000000e+00   9.8509694954354620e+02   1.0000000000000000e+03   0.0000000000000000e+00   0.0000000000000000e+00   -9.8509694954354620e+02   1.0039062499999999e+03   -9.4680989971558370e+02   3.0720985074327598e+02   -3.7092859096086428e+01   9.9609375000000000e+02   9.4680989971558370e+02   -3.0720985074327604e+02   3.7092859096086386e+01   1.2280731605771811e+00
1.0000000000000000e+03   0.0000000000000000e+00   0.0000000000000000e+00   9.8509694954354620e+02   1.0000000000000000e+03   0.0000000000000000e+00   0.0000000000000000e+00   -9.8509694954354620e+02   1.0039062499999994e+03   8.3755581168293858e+01   9.8944829289665302e+02   -7.8611939908146141e+01   9.9609375000000068e+02   -8.3755581168293958e+01   -9.8944829289665302e+02   7.8611939908146141e+01   1.2338084195243373e+00
1.0000000000000000e+03   0.0000000000000000e+00   0.0000000000000000e+00   9.8509694954354620e+02   1.0000000000000000e+03   0.0000000000000000e+00   0.0000000000000000e+00   -9.8509694954354620e+02   1.0039062499999991e+03   -9.0599948641566948e+02   -2.7814425583307383e+02   -3.0659984075447545e+02   9.9609375000000091e+02   9.0599948641567005e+02   2.7814425583307406e+02   3.0659984075447545e+02   1.3491290473424860e+00
1.0000000000000000e+03   0.0000000000000000e+00   0.0000000000000000e+00   9.8509694954354620e+02   1.0000000000000000e+03   0.0000000000000000e+00   0.0000000000000000e+00   -9.8509694954354620e+02   1.0039062500000005e+03   8.0291966074427114e+02   -2.5060258597192606e+02   -5.3359265463792565e+02   9.9609374999999943e+02   -8.0291966074427114e+02   2.5060258597192600e+02   5.3359265463792588e+02   1.6942625267688973e+00
1.0000000000000000e+03   0.0000000000000000e+00   0.0000000000000000e+00   9.8509694954354620e+02   1.0000000000000000e+03   0.0000000000000000e+00   0.0000000000000000e+00   -9.8509694954354620e+02   1.0039062499999999e+03   -6.1683634300813765e+02   -2.5843177564517453e+02   -7.3819286238102563e+02   9.9609375000000000e+02   6.1683634300813753e+02   2.5843177564517435e+02   7.3819286238102563e+02   2.6111412945472869e+00
1.0000000000000000e+03   0.0000000000000000e+00   0.0000000000000000e+00   9.8509694954354620e+02   1.0000000000000000e+03   0.0000000000000000e+00   0.0000000000000000e+00   -9.8509694954354620e+02   1.0039062500000000e+03   1.9172922499446005e+02   8.0403046044188545e+02   5.5585760924331646e+02   9.9609375000000000e+02   -1.9172922499446011e+02   -8.0403046044188545e+02   -5.5585760924331646e+02   1.7514091352303387e+00
1.0000000000000000e+03   0.0000000000000000e+00   0.0000000000000000e+00   9.8509694954354620e+02   1.0000000000000000e+03   0.0000000000000000e+00   0.0000000000000000e+00   -9.8509694954354620e+02   1.0039062500000000e+03   -4.3004551857706315e+02   3.2660686328370622e+02   8.3701348113206916e+02   9.9609375000000000e+02   4.3004551857706355e+02   -3.2660686328370565e+02   -8.3701348113206939e+02   3.8718383292546341e+00
1.0000000000000000e+03   0.0000000000000000e+00   0.0000000000000000e+00   9.8509694954354620e+02   1.0000000000000000e+03   0.0000000000000000e+00   0.0000000000000000e+00   -9.8509694954354620e+02   1.0039062499999849e+03   -1.1679459033928613e+02   1.7933753699277639e+02   9.7283083333226170e+02   9.9609375000001523e+02   1.1679459033928651e+02   -1.7933753699277401e+02   -9.7283083333225807e+02   1.6600067963389751e+01
1.0000000000000000e+03   0.0000000000000000e+00   0.0000000000000000e+00   9.8509694954354620e+02   1.0000000000000000e+03   0.0000000000000000e+00   0.0000000000000000e+00   -9.8509694954354620e+02   1.0039062500000001e+03   7.4410564973647001e+02   4.8417088272125216e+02   4.5176110627659398e+02   9.9609374999999989e+02   -7.4410564973647001e+02   -4.8417088272125216e+02   -4.5176110627659398e+02   1.5286854887337571e+00
1.0000000000000000e+03   0.0000000000000000e+00   0.0000000000000000e+00   9.8509694954354620e+02   1.0000000000000000e+03   0.0000000000000000e+00   0.0000000000000000e+00   -9.8509694954354620e+02   1.0039062500000005e+03   -4.2604423335238710e+02   -5.1292084952544531e+02   7.4000085955243060e+02   9.9609374999999943e+02   4.2604423335238721e+02   5.1292084952544678e+02   -7.4000085955243310e+02   2.6257888563788723e+00
1.0000000000000000e+03   0.0000000000000000e+00   0.0000000000000000e+00   9.8509694954354620e+02   1.0000000000000000e+03   0.0000000000000000e+00   0.0000000000000000e+00   -9.8509694954354620e+02   1.0039062499999997e+03   -2.9811061505947799e+02   7.2431593435515276e+02   -6.1538544605567529e+02   9.9609375000000045e+02   2.9811061505947544e+02   -7.2431593435515015e+02   6.1538544605567438e+02   1.9397001466645460e+00
1.0000000000000000e+03   0.0000000000000000e+00   0.0000000000000000e+00   9.8509694954354620e+02   1.0000000000000000e+03   0.0000000000000000e+00   0.0000000000000000e+00   -9.8509694954354620e+02   1.0039062500000001e+03   6.6276200624730484e+02   2.0919866450369668e+02   7.1357214115601505e+02   9.9609374999999989e+02   -6.6276200624730484e+02   -2.0919866450369668e+02   -7.1357214115601494e+02   2.4299492688468574e+00
1.0000000000000000e+03   0.0000000000000000e+00   0.0000000000000000e+00   9.8509694954354620e+02   1.0000000000000000e+03   0.0000000000000000e+00   0.0000000000000000e+00   -9.8509694954354620e+02   1.0039062500000000e+03   -3.8350039468674953e+02   9.1528960403501708e+02   8.5878674940820105e+01   9.9609374999999989e+02   3.8350039468674942e+02   -9.1528960403501719e+02   -8.5878674940819877e+01   1.2352438952865392e+00
1.0000000000000000e+03   0.0000000000000000e+00   0.0000000000000000e+00   9.8509694954354620e+02   1.0000000000000000e+03   0.0000000000000000e+00   0.0000000000000000e+00   -9.8509694954354620e+02   1.0039062500000017e+03   -7.9270050540580814e+02   6.0314677053566925e+02   -6.5299855156671525e+00   9.9609374999999829e+02   7.9270050540580655e+02   -6.0314677053566822e+02   6.5299855156677582e+00   1.2264910203073258e+00
1.0000000000000000e+03   0.0000000000000000e+00   0.0000000000000000e+00   9.8509694954354620e+02   1.0000000000000000e+03   0.0000000000000000e+00   0.0000000000000000e+00   -9.8509694954354620e+02   1.0039062500000000e+03   -3.3855051899154637e+02   4.0347101103878322e+02   -8.4545694634970005e+02   9.9609375000000011e+02   3.3855051899154637e+02   -4.0347101103878316e+02   8.4545694634970005e+02   4.0507511298287193e+00
1.0000000000000000e+03   0.0000000000000000e+00   0.0000000000000000e+00   9.8509694954354620e+02   1.0000000000000000e+03   0.0000000000000000e+00   0.0000000000000000e+00   -9.8509694954354620e+02   1.0039062500000008e+03   -3.2734397155854089e+02   -6.0633131950347479e+02   -7.1931287633582463e+02   9.9609374999999920e+02   3.2734397155854077e+02   6.0633131950347479e+02   7.1931287633582440e+02   2.4693687325301958e+00
