(run){
  EVENTS EVTS; FRAGMENTATION Off;
  LJET:=2; NJET:=2; YCUT:=1.75;
  EVENT_GENERATION_MODE W; NLO_Mode 3;
  BEAM_1  11 45.625; BEAM_2 -11 45.625;
  PDF_SET None;
  ANALYSIS Internal; ANALYSIS_WRITEOUT_INTERVAL 0.1;
  AMEGIC_LIBRARY_MODE 0;
  MASSIVE[5] 1; PARTICLE_CONTAINER 95 B 5 -5;
}(run);
(processes){
  Process 11 -11 -> (93,95) (93,95) (93,95){NJET};
  Order (*,2); CKKW pow(10,-YCUT);
  NLO_QCD_Part BVIRS {LJET};
  ME_Generator Amegic {LJET};
  RS_ME_Generator Comix {LJET};
  Loop_Generator OpenLoops {LJET}; 
  End process;
}(processes);

(analysis){
  BEGIN_ANALYSIS {
    LEVEL Shower; PATH_PIECE Jets/;
    Trigger { InList FinalState; OutList Jets; Finder 93 0 0 0 0.008 1; }
    JetDRate 1e-5 1 200 1 1 5 LogErr Jets;
  } END_ANALYSIS;
}(analysis);
