(run){
  EVENTS 10*EVTS;
  BEAM_1 2212; BEAM_ENERGY_1 4000;
  BEAM_2 2212; BEAM_ENERGY_2 4000;
  EVENT_GENERATION_MODE W;
  WIDTH[23] 0; WIDTH[24] 0; ACTIVE[5] 0;
  ACTIVE[25] 0; STABLE[24] 0; STABLE[23] 0;
  FRAGMENTATION Off; MI_HANDLER None; ME_QED Off;
  ANALYSIS 1; ANALYSIS_WRITEOUT_INTERVAL 0.1;
  HARD_DECAYS 1;
  HDH_ONLY_DECAY {24,12,-11}|{-24,-14,13}|{23,15,-15};
  HARD_SPIN_CORRELATIONS 1;
  RESPECT_MASSIVE_FLAG 1;
  HDH_QED_CORRECTIONS 0;
  SCALES VAR{Abs2(p[0]+p[1])};
}(run);

(processes){
  Process 93 93 -> 23 24 -24;
  Order_EW 3;
  End process;
}(processes)
