(run){
  EVENTS EVTS; RSMEG:=Comix;
  LJET:=2; NJET:=2; QCUT:=5;
  EVENT_GENERATION_MODE W; NLO_Mode 3;
  FRAGMENTATION Off; MI_HANDLER None;
  BEAM_1 2212 4000; BEAM_2 2212 4000;
  ANALYSIS Internal; ANALYSIS_WRITEOUT_INTERVAL 0.1;
  AMEGIC_LIBRARY_MODE 0;
}(run);
(processes){
  Process 93 93 -> 11 -11 93{NJET};
  Order (*,2); CKKW sqr(QCUT/E_CMS);
  NLO_QCD_Part BVIRS {LJET};
  Loop_Generator BlackHat {LJET}; 
  ME_Generator Amegic {LJET};
  RS_ME_Generator RSMEG {LJET};
  RS_PSI_ItMin 10000 {LJET};
  Enhance_Factor 4 {3};
  Enhance_Factor 16 {4};
  Enhance_Factor 64 {5};
  End process;
}(processes);
(selector){
  Mass 11 -11 60 116;
}(selector);

(analysis){
  BEGIN_ANALYSIS {
    LEVEL Shower; PATH_PIECE Jets/;
    Trigger { OutList Jets; Keep 93; Finder 93 1.0 -4.5 4.5 0.4 1; }
    JetDRate 0.5 5000 250 1 1 5 LogErr Jets FinalState;
  } END_ANALYSIS;
}(analysis);
