(run){
  EVENTS 4*EVTS; LGEN:=ML5;
  NJET:=2; LJET:=3,4; QCUT:=7;
  ME_SIGNAL_GENERATOR Comix Amegic LGEN;
  EVENT_GENERATION_MODE W;
  BEAM_1 2212 4000; BEAM_2 2212 4000;
  MUFO:=pow(MPerp2(p[2])*PPerp2(p[3])*PPerp2(p[4]),1/3);
  CORE_SCALE VAR{MUFO}{MUFO}{MUFO};
  SCALES METS{4*MU_F2}{MU_R2}{MU_Q2};
  CSS_CKFMODE 0;
  EXCLUSIVE_CLUSTER_MODE 1;
  EW_SCHEME 3; CHECK_LOOP_MAP 1;
  AMEGIC_MAP_ACCURACY 0;
  FRAGMENTATION Off;
  MI_HANDLER None;
  PSI_ITMIN 50000;
  ANALYSIS Rivet,Internal; ANALYSIS_WRITEOUT_INTERVAL 0.1;
  EVENT_SEED_MODE 3;
}(run);
(processes){
  Process 93 93 -> 25 93 93 93{NJET};
  NLO_QCD_Mode 3 {LJET}; CKKW sqr(QCUT/E_CMS);
  Loop_Generator LGEN {LJET};
  ME_Generator Amegic {LJET};
  RS_ME_Generator Comix {LJET};
  Selector_File *|(coresel){|}(coresel) {3};
  Enhance_Function FASTJET[A:kt,R:0.4,PT:1]{pow(min(PPerp2(p[3])*PPerp2(p[4]),10000),1.1)} {3};
  Integration_Error 0.05 {4};
  Order_EW 3;
  End process;
}(processes);
(coresel){
  FastjetFinder kt 2 1 0 0.4;
}(coresel);
