(run){
  EVENTS=EVTS
  ANALYSIS=Rivet RivetShower; ANALYSIS_WRITEOUT_INTERVAL 0.1;
  AMEGIC_LIBRARY_MODE 0;
}(run);
(processes){
  Process 11 -11 -> 93 93;
  Min_Order (0,2); Max_Order (99,2);
  End process;

  Process 11 -11 -> 5 -5;
  Min_Order (0,2); Max_Order (99,2);
  End process;
}(processes);
(model){
  ORDER_ALPHAS 1;
  ALPHAS(MZ) 0.1188;
  STABLE[15] 0;
  MASSIVE[5] 1;
}(model)
(beam){
  BEAM_1  11; BEAM_ENERGY_1 45.6;
  BEAM_2 -11; BEAM_ENERGY_2 45.6;
}(beam);
(shower){
  SHOWER_GENERATOR CSS;
}(shower);
