(run){
  EVENTS=EVTS
  OUTPUT           = 2
  ANALYSIS         = Rivet
}(run)

(me){
  ME_SIGNAL_GENERATOR   = Comix
  EVENT_GENERATION_MODE = Weighted
}(me)

(beam){
  BEAM_1          = 2212
  BEAM_ENERGY_1   = 980.
  BEAM_2          = -2212
  BEAM_ENERGY_2   = 980.
}(beam)

(mi){
  MI_HANDLER	= Amisic
}(mi)

(processes){
  Process : 93 93 -> 93 93
  Order_EW : 0
  Enhance_Function VAR{sqr(PPerp2(p[2]))+sqr(PPerp2(p[3]))}
  End process
}(processes)

(selector){
  NJetFinder  2  2.673  0  1
}(selector)

(analysis){
  BEGIN_RIVET {
    -a CDF_2008_LEADINGJETS # minbias CDF_2009_S8233977
  } END_RIVET
}(analysis)
