BEGIN_ANALYSIS {

  LEVEL ME Shower;

  PATH_PIECE H1/

  PT2 15 -15 0 50 50 LinErr FinalState
  PT2 15 -15 0 500 250 LinErr FinalState
  Mass 15 -15 115 125 50 LinErr FinalState
  
  Trigger {
     OutList kt_jets	
     Finder 93  40. -4. 4. 1. 1.	
     Keep 93
  }
 
  JetDRate 0.5  5000. 200 1  1  4 LogErr kt_jets FinalState	 

} END_ANALYSIS;
