1 0.36063 0
3 0.841784 0
5 1.00371 0
7 0.970976 0
9 0.913765 0
11 0.829529 0
13 0.767348 0
15 0.705136 0
17 0.651115 0
19 0.605625 0
21 0.559127 0
23 0.518516 0
25 0.465166 0
27 0.433497 0
29 0.401771 0
31 0.362674 0
33 0.340726 0
35 0.315578 0
37 0.286349 0
39 0.262066 0
41 0.239749 0
43 0.230303 0
45 0.223178 0
47 0.196581 0
49 0.192739 0
