(run){
  OUTPUT 2; EVENTS EVTS;
  NJET:=4; QCUT:=5; ICUT:=4; SDIS:=0.6;
  PARJ(21) 0.432; PARJ(41) 1.05; PARJ(42) 1.0;
  PARJ(47) 0.65; MSTJ(11) 5;
  CDXS_ITMAX 5000;

  RESULT_DIRECTORY r_tICUT_qQCUT_sSDIS/;
  GENERATE_RESULT_DIRECTORY 1;
  BATCH_MODE 0; WRITE_MAPPING_FILE 3;
  ANALYSIS HZTool,Internal;
  ASET:=1; ANALYSIS_OUTPUT a_1/;
}(run);
(processes){
  Process -11 93 -> -11 93 93{NJET};
  Order_EW 2; Max_N_Quarks 6;
  CKKW sqr(QCUT/E_CMS)/(1.0+sqr(QCUT/SDIS)/Abs2(p[2]-p[0]));
  Integration_Error 0.02 {5};
  Integration_Error 0.05 {6};
  End process;
}(processes);
(selector){
  Q2 -11 -11 ICUT 1e12;
}(selector)
(me){
  ME_SIGNAL_GENERATOR Comix;
  EVENT_GENERATION_MODE Weighted;
}(me);
(isr){
  PDF_SET_1 None;
  # PDF_LIBRARY MSTW08Sherpa; PDF_SET mstw2008nlo;
  # PDF_LIBRARY LHAPDFSherpa; PDF_SET cteq66.LHgrid;
  # PDF_LIBRARY LHAPDFSherpa; PDF_SET NNPDF12_100.LHgrid; PDF_SET_VERSION=-100;
  # PDF_LIBRARY LHAPDFSherpa; PDF_SET HERAPDF10_EIG.LHgrid;
  # PDF_LIBRARY LHAPDFSherpa; PDF_SET a02m_nlo.LHgrid;
}(isr);
(beam){
  BEAM_1  -11; BEAM_ENERGY_1 27.5;
  BEAM_2 2212; BEAM_ENERGY_2  820; 
}(beam);
(fragmentation){
  FRAGMENTATION Ahadic;
  # FRAGMENTATION Lund; DECAYMODEL Lund;
}(fragmentation);


(analysis){

  BEGIN_HZTOOL {

    HISTO_NAME a_jNJET_qQCUT_ASET.hbook;
    HZ_ENABLE hznorm hz00145 hz01073 hz02079 hz03160 hzh0508055;
    HZ_ENABLE hz95108 hz96160 hz96215 hz98210 hz99091;
    XS_EVENTS 10000;

  } END_HZTOOL;

  BEGIN_ANALYSIS {

    LEVEL Shower; PATH_PIECE a_jNJET_qQCUT_ASET/;
    Trigger {
      OutList KtJets; Keep 93;
      Finder 93 1.0 -4.0 4.0 1.0 1;
    }
    JetDRate 0.5 500 150 0 0 3 LogErr KtJets;

  } END_ANALYSIS;

}(analysis);
