(run){
  EVENTS EVTS;
  LGEN:=OpenLoops;
  LJET:=2,3,4; NJET:=2; QCUT:=30;
  FSF:=1; RSF:=1; QSF:=1;
  SCALES METS{4*MU_F2}{RSF*MU_R2}{QSF*MU_Q2};
  CORE_SCALE QCD;
  ME_SIGNAL_GENERATOR Comix Amegic LGEN;
  EVENT_GENERATION_MODE W;
  EVENT_SEED_MODE 3;
  BEAM_1 2212; BEAM_ENERGY_1 3500;
  BEAM_2 2212; BEAM_ENERGY_2 3500;
  MI_HANDLER None; FRAGMENTATION Off;
  HARD_DECAYS Off; HARD_SPIN_CORRELATIONS 1;
  HDH_ONLY_DECAY {24,12,-11}|{-24,-14,13}
  STABLE[24] 0; STABLE[6] 0; WIDTH[6] 0;
  PDF_LIBRARY MSTW08Sherpa;
  PDF_SET mstw2008nlo;
  METS_BBAR_MODE 5;
  RESPECT_MASSIVE_FLAG 1;
  HDH_QED_CORRECTIONS 0;
  ANALYSIS 1,Rivet;
  ANALYSIS_WRITEOUT_INTERVAL 0.1
  NLO_SMEAR_THRESHOLD 1;
  NLO_SMEAR_POWER 2;
}(run)
(processes){
  Process : 93 93 ->  6 -6 93{NJET};
  NLO_QCD_Mode 3 {LJET}; CKKW sqr(QCUT/E_CMS);
  ME_Generator Amegic {LJET};
  RS_ME_Generator Comix {LJET};
  Loop_Generator LGEN;
  Integration_Error 0.05;
  Order_EW 0;
  End process
}(processes)
