(run){
  BEAM_1 2212; BEAM_ENERGY_1 6500;
  BEAM_2 2212; BEAM_ENERGY_2 6500;

  EVENT_GENERATOION_MODE Weighted;

  ME_GENERATORS Comix Amegic OpenLoops;

  ANALYSIS Rivet;
}(run)

(processes){
  Process 93 93 -> 11 -11 93{1}
  Order (*,2);
  CKKW sqr(20/E_CMS); # did we change linear/square values
  Loop_Generator OpenLoops
  NLO_QCD_Mode MC@NLO
  ME_Generator Amegic
  RS_ME_Generator Comix
  End process;
  Process 93 93 -> 13 -13 93{1}
  Order (*,2);
  CKKW sqr(20/E_CMS); # did we change linear/square values
  Loop_Generator OpenLoops
  NLO_QCD_Mode MC@NLO
  ME_Generator Amegic
  RS_ME_Generator Comix
  End process;
}(processes)

(selector){
  Mass 11 -11 15 E_CMS
  Mass 13 -13 15 E_CMS
}(selector)

(analysis){
BEGIN_RIVET {
  -a CMS_2017_I1635889 CMS_2021_I1866118 ATLAS_2019_I1736531
} END_RIVET
}(analysis)
