(run){
  EVENTS=EVTS
  MI_HANDLER None; FRAGMENTATION Off
  LPT:=WhiteHat; NLOT:=BVIRS;
  NJET:=3; LJET:=0; QCUT:=15;
  RESULT_DIRECTORY r_QCUT/;
  ANALYSIS=Rivet
  ANALYSIS_OUTPUT=Analysis.NJET.LJET.NLOT.QCUT
  MASSIVE[15]=1
}(run)
(beam){
  BEAM_1 = 2212; BEAM_ENERGY_1 = 980.;
  BEAM_2 = -2212; BEAM_ENERGY_2 = 980.;
}(beam)
(processes){
  Process 93 93 -> 90 -90 93{NJET};
  NLO_QCD_Part NLOT {LJET}; Loop_Generator LPT;
  Order_EW 2; CKKW sqr(QCUT/E_CMS);
  Enhance_Function VAR{PPerp2(p[2]+p[3])} {3,4,5,6,7,8};
  Integration_Error 0.02 {3,4,5,6};
  End process;
}(processes)
(selector){
  Mass 90 -90 66. 116.
}(selector)
(me){
  ME_SIGNAL_GENERATOR Comix;
  EVENT_GENERATION_MODE Weighted;
  NLO_Mode 3;
}(me)
