BEGIN_ANALYSIS {

  LEVEL Shower;// Hadron;
  PATH_PIECE Oti;
  //PATH_PIECE tev.wwlep/mg.j/15/Oti;

  Trigger {
    InList   FinalState;
    OutList  Controlled;
    Counts  -11    1  -1;
    Counts   13    1  -1;
  }
  Trigger {
    InList   Controlled;
    OutList  Analysed;
    Finder   93  15.0   -20.0  20.0  1.0  1.;
  }
  Trigger {
    InList   Analysed;
    OutList  AnalysedJets;
    Keep     93;
  }

  Eta   -11      -5.0    5.0  20  Lin  Controlled;
  Eta2  -11  12  -5.0    5.0  20  Lin  Controlled;
  PT    -11       0.0  150.0  30  Lin  Controlled;
  PT2   -11  12   0.0  200.0  40  Lin  Controlled;

  PT4   -11  12  13  -14  0.0     400.0    100  Lin  Controlled;
  PT4   -11  12  13  -14  1.0e-1    1.0e3  100  Log  Controlled;

  PTdiff4  -11  12  13  -14     0.0  400.0 100  Lin  Controlled;
  PTdiff4  -11  12  13  -14  -402.0  402.0 201  Lin  Controlled; 
  Theta4   -11  12  13  -14     0.0    3.2  32  Lin  Controlled;
  Theta4   -11  12  13  -14    -0.1    3.2  33  Lin  Controlled;

  HT              0.0   500.0    50  Lin  Analysed;
  HT              0.0  2000.0  1000  Lin  Analysed;
  HT              0.0  2000.0  1000  Lin  FinalState;

  DR    -11  13   0.0    3.9   39  Lin  Controlled;
  DPhi  -11  13   0.0    3.2   32  Lin  Controlled;
  Mass  -11  13   0.0  400.0  100  Lin  Controlled;

  PT     93       0.0  100.0  20  Lin  Analysed;
  DR     13  93   0.0    3.9  39  Lin  Analysed;

  JetEta  -5.0    5.0  100  1  1  3  Lin  AnalysedJets;

  JetPT    0.0  300.0  150  1  1  3  Lin  AnalysedJets;
  JetPT    0.0  300.0  150  1  2  3  Lin  AnalysedJets;
  JetPT    0.0  300.0  150  1  3  3  Lin  AnalysedJets;
  JetPT    0.0  300.0  150  2  1  1  Lin  AnalysedJets;
  JetPT    0.0  300.0  150  2  2  2  Lin  AnalysedJets;
  JetPT    0.0  300.0  150  2  3  3  Lin  AnalysedJets;

  JetDRate 2.0e-1 1.0e3 100 1  1  3  Log  Analysed;

} END_ANALYSIS;


BEGIN_ANALYSIS {

  LEVEL Shower;// Hadron;
  PATH_PIECE Otx;
  //PATH_PIECE tev.wwlep/mg.j/15/Otx;

  Trigger {
    InList   FinalState;
    OutList  Analysed;
    Finder   93        15.   -2.0  2.0  0.7  1.;
    Finder  -11        20.   -1.0  1.0;
    Finder   13        20.   -1.0  1.0;
    DRMin    93  -11    0.4;
    DRMin    93   13    0.4;
    DRMin   -11   13    0.2;
    Counts  -11    1  -1;
    Counts   13    1  -1;
  }

  Trigger {
    InList   Analysed;
    OutList  AnalysedJets;
    Keep     93;
  }

  Trigger {
    OutList  R1
    Finder   93        15.  -20.0 20.0  1.0  1.;
  }

  Eta   -11      -5.0    5.0  20  Lin  Analysed;
  Eta2  -11  12  -5.0    5.0  20  Lin  Analysed;
  PT    -11       0.0  150.0  30  Lin  Analysed;
  PT2   -11  12   0.0  200.0  40  Lin  Analysed;

  PT4   -11  12  13  -14  0.0     400.0    100  Lin  Analysed;
  PT4   -11  12  13  -14  1.0e-1    1.0e3  100  Log  Analysed;

  PTdiff4  -11  12  13  -14     0.0  400.0 100  Lin  Analysed;
  PTdiff4  -11  12  13  -14  -402.0  402.0 201  Lin  Analysed;
  Theta4   -11  12  13  -14     0.0    3.2  32  Lin  Analysed;
  Theta4   -11  12  13  -14    -0.1    3.2  33  Lin  Analysed;

  HT              0.0   500.0    50  Lin  Analysed;
  HT              0.0  2000.0  1000  Lin  Analysed;
  HT              0.0  2000.0  1000  Lin  FinalState;

  DR    -11  13   0.0    3.9   39  Lin  Analysed;
  DPhi  -11  13   0.0    3.2   32  Lin  Analysed;
  Mass  -11  13   0.0  400.0  100  Lin  Analysed;

  PT     93       0.0  100.0  20  Lin  Analysed;
  DR     13  93   0.0    3.9  39  Lin  Analysed;

  JetEta  -5.0    5.0  100  1  1  3  Lin  AnalysedJets;

  JetPT    0.0  300.0  150  1  1  3  Lin  AnalysedJets;
  JetPT    0.0  300.0  150  1  2  3  Lin  AnalysedJets;
  JetPT    0.0  300.0  150  1  3  3  Lin  AnalysedJets;
  JetPT    0.0  300.0  150  2  1  1  Lin  AnalysedJets;
  JetPT    0.0  300.0  150  2  2  2  Lin  AnalysedJets;
  JetPT    0.0  300.0  150  2  3  3  Lin  AnalysedJets;

  JetDRate 2.0e-1 1.0e3 100 1  1  3  Log  Analysed;
  JetDRate 2.0e-1 1.0e3 100 1  1  3  Log  R1 Analysed;

} END_ANALYSIS;
