(run){
  EVENTS EVTS;
  LJET:=2,3; NJET:=1; QCUT:=7.07;
  LGEN:=OpenLoops;
  ME_SIGNAL_GENERATOR Comix Amegic LGEN;
  EVENT_GENERATION_MODE W;
  EVENT_SEED_MODE 3;
  NLO_Mode 3;
  BEAM_1  2212; BEAM_ENERGY_1 980;
  BEAM_2 -2212; BEAM_ENERGY_2 980;
  CORE_SCALE VAR{Abs2(p[2]+p[3])};
  RENORMALIZATION_SCALE_FACTOR 0.25;
  SCALES METS{0.25*MU_F2}{MU_R2}{MU_Q2}; 
  EXCLUSIVE_CLUSTER_MODE 1;
  PDF_LIBRARY MSTW08Sherpa; PDF_SET mstw2008nlo;
  WIDTH[6] 0;
  CSS_KFACTOR_SCHEME 0;
  CSS_IS_AS_FAC 1; CSS_FS_AS_FAC 1;
  CSS_IS_PT2MIN 3; CSS_FS_PT2MIN 3;
  MI_HANDLER None;
  FRAGMENTATION Off; 
  ANALYSIS_WRITEOUT_INTERVAL 0.1;
  ANALYSIS Rivet Internal;
  NLO_SMEAR_THRESHOLD 1;
  NLO_SMEAR_POWER 0.5;
  AMEGIC_LIBRARY_MODE 0;
  OL_PARAMETERS preset 2;
}(run);

(processes){
  Process 93 93 -> 6 -6 93{NJET};
  NLO_QCD_Part BVIRS {LJET};
  CKKW sqr(QCUT/E_CMS);
  Loop_Generator LGEN;
  RS_ME_Generator Comix {LJET};
  ME_Generator Amegic {LJET};
  Integration_Error 0.1;
  Enhance_Factor 10 {3};
  Min_Order (0,0); Max_Order (99,0);
  End process;
}(processes);

