(run){
  EVENTS=EVTS
  OUTPUT            = 2
  ANALYSIS          = 1
  ANALYSIS_WRITEOUT_INTERVAL 0.1
  MI_HANDLER None;
  AMEGIC_LIBRARY_MODE 0;
}(run)
(me){
  ME_SIGNAL_GENERATOR   = Comix
  EVENT_GENERATION_MODE = Weighted
}(me)
(fragmentation){
  FRAGMENTATION = Off
}(fragmentation)
(model){
  ACTIVE[6] = 0
  ACTIVE[25] = 0
}(model)
(beam){
  BEAM_1          = 2212
  BEAM_ENERGY_1   = 980.
  BEAM_2          = -2212
  BEAM_ENERGY_2   = 980.
}(beam)
(processes){
 Process : 93 93 ->  12 -11 13 -14 93{2}
  Min_Order (0,4); Max_Order (99,4)
  CKKW sqr(30/E_CMS)
  End process
}(processes)
(selector){
  Mass -11 12 10 E_CMS
  Mass 13 -14 10 E_CMS
}(selector)
