0.5 1.703 0.5 0.5 0.028 0.028
1.5 3.426 0.5 0.5 0.119 0.119
2.5 5.581 0.5 0.5 0.240 0.240
3.5 7.210 0.5 0.5 0.344 0.344
4.5 8.574 0.5 0.5 0.440 0.440
5.5 9.676 0.5 0.5 0.578 0.578
6.5 10.451 0.5 0.5 0.636 0.636
7.5 10.969 0.5 0.5 0.645 0.645
8.5 11.537 0.5 0.5 0.808 0.808
9.5 12.017 0.5 0.5 1.067 1.067
10.5 12.228 0.5 0.5 0.863 0.863
11.5 12.714 0.5 0.5 0.535 0.535
12.5 12.986 0.5 0.5 1.135 1.135
13.5 13.620 0.5 0.5 1.121 1.121
14.5 14.269 0.5 0.5 0.887 0.887
15.5 13.681 0.5 0.5 0.748 0.748
16.5 13.048 0.5 0.5 2.093 2.093
17.5 14.696 0.5 0.5 2.826 2.826
18.5 13.529 0.5 0.5 1.646 1.646
19.5 13.667 0.5 0.5 1.810 1.810
20.5 13.857 0.5 0.5 1.257 1.257
