(run){
  EVENTS EVTS; RSMEG:=Comix;
  LJET:=1; NJET:=1; QCUT:=10;
  EVENT_GENERATION_MODE W; NLO_Mode 3;
  FRAGMENTATION Off; MI_HANDLER None;
  VARIATIONS 1,1,0.5 1,1,2 1,1,1e12;
  BEAM_1 2212 4000; BEAM_2 2212 4000;
  MODEL SMEHC; WIDTH[25] 0;
  ANALYSIS Internal; ANALYSIS_WRITEOUT_INTERVAL 0.1;
  AMEGIC_LIBRARY_MODE 0;
}(run);
(processes){
  Process 93 93 -> 25 93{NJET};
  Order (2,1); CKKW QCUT;
  NLO_Order (1,0) {LJET};
  NLO_Mode MC@NLO {LJET};
  Loop_Generator Internal {LJET}; 
  ME_Generator Amegic {LJET};
  RS_ME_Generator RSMEG {LJET};
  RS_PSI_ItMin 10000 {LJET};
  Enhance_Factor 4 {3};
  Enhance_Factor 16 {4};
  Enhance_Factor 64 {5};
  End process;
}(processes);

(analysis){
  BEGIN_ANALYSIS {
    LEVEL Shower; PATH_PIECE Jets/;
    Trigger { OutList Jets; Keep 93; Finder 93 1.0 -4.5 4.5 0.4 1; }
    JetDRate 0.5 5000 250 1 1 5 LogErr Jets FinalState;
  } END_ANALYSIS;
}(analysis);
