(run){
  OUTPUT          = 2
  ANALYSIS       = 1
  ANALYSIS_WRITEOUT_INTERVAL 0.1
}(run)
(me){
  ME_SIGNAL_GENERATOR   = Comix
  EVENT_GENERATION_MODE = Weighted
}(me)
(fragmentation){
  FRAGMENTATION = Off
}(fragmentation)
(model){
  STABLE[24] = 1
}(model)
(beam){
  BEAM_1          = 2212
  BEAM_ENERGY_1   = 7000
  BEAM_2          = 2212
  BEAM_ENERGY_2   = 7000
}(beam)
(processes){
  Process : 93 93 ->  6[a] -6[b] 93{1}
  DecayOS : 6[a] -> 24 5
  DecayOS : -6[b] -> -24 -5
  Order_EW 2
  CKKW sqr(20/E_CMS)
  End process
}(processes)
