(run){
  EVENTS          = 0
  OUTPUT          = 2
  YUKAWA_MASSES         = Fixed
  COUPLINGS             = None
  AMEGIC_INTEGRATOR 4
  AMEGIC_LIBRARY_MODE 0;
}(run)
(me){
  ME_SIGNAL_GENERATOR   = Amegic
  SCALES                = VAR{sqr(360)}
}(me)
(model){
  MODEL                 = SM
  EW_SCHEME             = 3
  ALPHAS(MZ)            = 0.0925
  ORDER_ALPHAS          = 0
  1/ALPHAQED(0)         = 132.50495
  SIN2THETAW            = 0.2222499
  VEV                   = 246.21846
  LAMBDA                = 0.47591
  YUKAWA[11]              = 0.
  YUKAWA[13]             = 0.1056583
  YUKAWA[15]            = 1.777
  YUKAWA[2]              = 0.0
  YUKAWA[1]              = 0.0
  YUKAWA[3]              = 0.2
  YUKAWA[4]              = 1.3
  YUKAWA[5]              = 4.8
  YUKAWA[6]              = 174.3
  MASS[23]=91.1882
  MASS[24]=80.419
  MASS[25]=130.
  MASS[1]=0.01
  MASS[2]=0.005
  MASS[3]=0.2
  MASS[4]=1.3
  MASS[5]=4.8
  MASS[6]=174.3
  MASS[13]=0.1056583
  WIDTH[23]=2.4952
  WIDTH[24]=2.12
  WIDTH[25]=0.004291
  WIDTH[6]=1.6
  MASSIVE[1]=1
  MASSIVE[2]=1
  MASSIVE[3]=1
  MASSIVE[4]=1
  MASSIVE[5]=1
  MASSIVE[13]=1
  MASSIVE[15]=1
}(model)
(isr){
  PDF_SET None;
}(isr)
(beam){
  BEAM_1          = 11
  BEAM_ENERGY_1   = 180.
  BEAM_2          = -11
  BEAM_ENERGY_2   = 180.
}(beam)
(integration){
  FINISH_OPTIMIZATION = Off
}(integration)
(processes){
  Process : 11 -11 -> 13 -13 2 -2 2 -2
  Integration_Error 0.005
  Order (0,6)
  End process
}(processes)
(selector){
  BeamAngle  11  0  -0.99619469809 0.99619469809
  BeamAngle -11  0  -0.99619469809 0.99619469809
  BeamAngle  13  0  -0.99619469809 0.99619469809
  BeamAngle -13  0  -0.99619469809 0.99619469809
  BeamAngle   2  0  -0.99619469809 0.99619469809
  BeamAngle  -2  0  -0.99619469809 0.99619469809
  BeamAngle   1  0  -0.99619469809 0.99619469809
  BeamAngle  -1  0  -0.99619469809 0.99619469809
  BeamAngle  5  0   -0.99619469809 0.99619469809
  BeamAngle -5  0   -0.99619469809 0.99619469809
  Angle     11  -11  -1.1 0.99619469809
  Angle     13  -13  -1.1 0.99619469809
  Angle     11  13  -1.1 0.99619469809
  Angle     11  -13  -1.1 0.99619469809
  Angle     -11  13  -1.1 0.99619469809
  Angle     -11  -13  -1.1 0.99619469809
  Angle     11  2  -1.1 0.99619469809
  Angle     11  -2  -1.1 0.99619469809
  Angle     -11  2  -1.1 0.99619469809
  Angle     -11  -2  -1.1 0.99619469809
  Angle     13  2  -1.1 0.99619469809
  Angle     13  -2  -1.1 0.99619469809
  Angle     -13  2  -1.1 0.99619469809
  Angle     -13  -2  -1.1 0.99619469809
  Angle     11  1  -1.1 0.99619469809
  Angle     11  -1  -1.1 0.99619469809
  Angle     -11  1  -1.1 0.99619469809
  Angle     -11  -1  -1.1 0.99619469809
  Angle     13  1  -1.1 0.99619469809
  Angle     13  -1  -1.1 0.99619469809
  Angle     -13  1  -1.1 0.99619469809
  Angle     -13  -1  -1.1 0.99619469809
  Angle     13  5  -1.1 0.99619469809
  Angle     13  -5  -1.1 0.99619469809
  Angle     -13  5  -1.1 0.99619469809
  Angle     -13  -5  -1.1 0.99619469809
  Angle     11  5  -1.1 0.99619469809
  Angle     11  -5  -1.1 0.99619469809
  Angle     -11  5  -1.1 0.99619469809
  Angle     -11  -5  -1.1 0.99619469809
  Energy     11      10.        10000.
  Energy    -11      10.        10000.
  Energy     13      10.        10000.
  Energy    -13      10.        10000.
  Energy      2      10.        10000.
  Energy     -2      10.        10000.
  Energy      1      10.        10000.
  Energy     -1      10.        10000.
  Energy      5      10.        10000.
  Energy     -5      10.        10000.
  Mass        2  -2  10.        10000.
  Mass        1  -1  10.        10000.
  Mass        1   2  10.        10000.
  Mass        1  -2  10.        10000.
  Mass        -1   2  10.        10000.
  Mass        -1  -2  10.        10000.
  Mass        5  -5  10.        10000.
}(selector)
