(run){
  EVENTS EVTS; RSMEG:=Comix;
  LJET:=0; NJET:=1; QCUT:=20;
  EVENT_GENERATION_MODE W; NLO_Mode 3;
  FRAGMENTATION Off; MI_HANDLER None;
  VARIATIONS 1,1,0.5 1,1,2 1,1,1e12;
  BEAM_1 2212 4000; BEAM_2 2212 4000;
  ANALYSIS Internal; ANALYSIS_WRITEOUT_INTERVAL 0.1;
  AMEGIC_LIBRARY_MODE 0;
  CORE_SCALE QCD;
}(run);
(processes){
  Process 93 93 -> 22 22 93{NJET};
  Order (0,2); CKKW QCUT;
  NLO_Order (1,0) {LJET};
  NLO_Mode MC@NLO {LJET};
  Loop_Generator BlackHat {LJET}; 
  ME_Generator Amegic {LJET};
  RS_ME_Generator RSMEG {LJET};
  RS_PSI_ItMin 10000 {LJET};
  End process;
}(processes);
(selector){
  "PT" 22 40,E_CMS:30,E_CMS [PT_UP];
  Mass 22 22 20 E_CMS;
  DR 22 22 0.4 1e12;
  IsolationCut 22 0.3 2 0.025;
}(selector);

(analysis){
  BEGIN_ANALYSIS {
    LEVEL Shower; PATH_PIECE Jets/;
    Trigger { OutList Jets; Qual !KF(6)&NotLepton; Finder 93 1.0 -4.5 4.5 0.4 1; }
    JetDRate 0.5 5000 250 1 1 5 LogErr Jets FinalState;
  } END_ANALYSIS;
}(analysis);
