(analysis){

  BEGIN_RIVET {
    -a CDF_2012_I1198155 MC_QCD_PARTONS MC_FBA_TTBAR;
  }  END_RIVET;

  BEGIN_ANALYSIS {

    LEVEL Shower;

    // analysis plots
    MomSel {
      InList FinalState; OutList FSFW;
      Tags 6,-6 0,0 Calc(Y(p[0])-Y(p[1])) 0 1e12; 
    }
    MomSel {
      InList FinalState; OutList FSBW;
      Tags 6,-6 0,0 Calc(Y(p[0])-Y(p[1])) -1e12 0; 
    }
    VarObs { InList FSFW;
      Tags 6,-6 0,0 Calc(abs(Y(p[0])-Y(p[1]))) 0 2 4 LinErr;
      Tags 6,-6 0,0 m 350 750 4 LinErr;
      Tags 6,-6 0,0 PT 0 70 7 LinErr;
    }
    VarObs { InList FSBW;
      Tags 6,-6 0,0 Calc(abs(Y(p[0])-Y(p[1]))) 0 2 4 LinErr;
      Tags 6,-6 0,0 m 350 750 4 LinErr;
      Tags 6,-6 0,0 PT 0 70 7 LinErr;
    }

    // control plots
    PT2 6 -6 1 1000 400 LinErr FinalState;
    PT2 6 -6 1 1000 100 LogErr FinalState;
    VarObs { InList FinalState;
      Tags 6,-6 0,0 Calc(abs(Y(p[0])-Y(p[1]))) 0 4 40 LinErr;
      Tags 6,-6 0,0 m 350 750 40 LinErr;
      Tags 6,-6 0,0 PT 0 70 35 LinErr;
    }

    Trigger {
      OutList AllJets;
      Finder 93 10 -5 5 0.7 1;
    }
    JetDRate 0.5 5000 200 1 1 5 LogErr AllJets FinalState;

  } END_ANALYSIS;

}(analysis);
