(run){
  EVENTS=EVTS
  OUTPUT           = 2
  ANALYSIS         = Rivet
}(run)

(me){
  ME_SIGNAL_GENERATOR   = Comix
  EVENT_GENERATION_MODE = Weighted
}(me)

(beam){
  BEAM_1          = 2212
  BEAM_ENERGY_1   = 315.
  BEAM_2          = -2212
  BEAM_ENERGY_2   = 315.
}(beam)

(mi){
  MI_HANDLER	= Amisic
}(mi)

(processes){
  Process : 93 93 -> 93 93
  Order_EW : 0
  Enhance_Function VAR{sqr(PPerp2(p[2]))+sqr(PPerp2(p[3]))}
  End process
}(processes)

(selector){
  NJetFinder 2  2.15  0  1
}(selector)

(analysis){
  BEGIN_RIVET {
    -a CDF_2004_S5839831 # minbias CDF_1988_S1865951 CDF_1990_S2089246 CDF_2002_S4796047
  } END_RIVET
}(analysis)
