1.8 2.327 1.8 1.8 0.080 0.080
5.4 1.599 1.8 1.8 0.055 0.055
9 1.057 1.8 1.8 0.037 0.037
12.6 0.739 1.8 1.8 0.026 0.026
16.2 0.537 1.8 1.8 0.020 0.020
19.8 0.382 1.8 1.8 0.019 0.019
23.4 0.285 1.8 1.8 0.016 0.016
27 0.219 1.8 1.8 0.010 0.010
30.6 0.160 1.8 1.8 0.011 0.011
34.2 0.130 1.8 1.8 0.008 0.008
37.8 0.111 1.8 1.8 0.008 0.008
41.4 0.127 1.8 1.8 0.007 0.007
45 0.129 1.8 1.8 0.009 0.009
48.6 0.132 1.8 1.8 0.007 0.007
52.2 0.126 1.8 1.8 0.006 0.006
55.8 0.118 1.8 1.8 0.011 0.011
59.4 0.120 1.8 1.8 0.008 0.008
63 0.125 1.8 1.8 0.009 0.009
66.6 0.128 1.8 1.8 0.008 0.008
70.2 0.119 1.8 1.8 0.008 0.008
73.8 0.127 1.8 1.8 0.008 0.008
77.4 0.121 1.8 1.8 0.008 0.008
81 0.117 1.8 1.8 0.010 0.010
84.6 0.129 1.8 1.8 0.011 0.011
88.2 0.122 1.8 1.8 0.008 0.008
91.8 0.125 1.8 1.8 0.008 0.008
95.4 0.129 1.8 1.8 0.007 0.007
99 0.134 1.8 1.8 0.009 0.009
102.6 0.131 1.8 1.8 0.010 0.010
106.2 0.140 1.8 1.8 0.008 0.008
109.8 0.130 1.8 1.8 0.010 0.010
113.4 0.139 1.8 1.8 0.008 0.008
117 0.141 1.8 1.8 0.012 0.012
120.6 0.148 1.8 1.8 0.007 0.007
124.2 0.144 1.8 1.8 0.011 0.011
127.8 0.152 1.8 1.8 0.013 0.013
131.4 0.153 1.8 1.8 0.009 0.009
135 0.153 1.8 1.8 0.013 0.013
138.6 0.157 1.8 1.8 0.011 0.011
142.2 0.166 1.8 1.8 0.010 0.010
145.8 0.179 1.8 1.8 0.011 0.011
149.4 0.181 1.8 1.8 0.011 0.011
153 0.180 1.8 1.8 0.011 0.011
156.6 0.184 1.8 1.8 0.013 0.013
160.2 0.197 1.8 1.8 0.011 0.011
163.8 0.198 1.8 1.8 0.016 0.016
167.4 0.209 1.8 1.8 0.010 0.010
171 0.202 1.8 1.8 0.008 0.008
174.6 0.210 1.8 1.8 0.012 0.012
178.2 0.215 1.8 1.8 0.010 0.010
