(run){
  EVENTS EVTS; FRAGMENTATION Off;
  RESPECT_MASSIVE_FLAG 1;
  LJET:=2; NJET:=0; QCUT:=5;
  EVENT_GENERATION_MODE W; NLO_Mode 3;
  BEAM_1 -11 27.5; BEAM_2 2212 920;
  PDF_SET_1 None;
  ANALYSIS Internal; ANALYSIS_WRITEOUT_INTERVAL 0.1;
  AMEGIC_LIBRARY_MODE 0;
}(run);
(processes){
  Process -11 93 -> -11 93 93{NJET};
  CKKW sqr(QCUT/E_CMS)/(1.0+sqr(QCUT/0.6)/Abs2(p[2]-p[0]));
  NLO_QCD_Part BVIRS {LJET};
  ME_Generator Amegic {LJET};
  RS_ME_Generator Comix {LJET};
  Loop_Generator BlackHat {LJET}; 
  RS_PSI_ItMin 10000 {LJET};
  Enhance_Factor 1e2 {3};
  Enhance_Factor 1e4 {4};
  Integration_Error 0.02 {4};
  Order (*,2);
  End process;
}(processes);
(selector){
  Q2 -11 -11 100 1e12;
}(selector);

(analysis){
  BEGIN_ANALYSIS {
    LEVEL Shower; PATH_PIECE Jets/;
    Trigger { OutList Jets; Keep 93; Finder 93 1.0 -4.0 4.0 1.0 1; }
    JetDRate 0.5 5000 250 1 1 5 LogErr Jets;
  } END_ANALYSIS;
}(analysis);
