(run){
  NUM_ACCURACY    = 1.e-6
  EVENTS=EVTS
  ANALYSIS         = 1
  ANALYSIS_WRITEOUT_INTERVAL 0.1
  MI_HANDLER None;
  ME_QED Off;
  HARD_DECAYS 1;
  STABLE[25] 0;
  HDH_ONLY_DECAY {25,15,-15};
  SCALES STRICT_METS;
}(run)
(me){
  EVENT_GENERATION_MODE = Weighted
  ME_SIGNAL_GENERATOR Amegic;
}(me)
(fragmentation){
  FRAGMENTATION = Off
}(fragmentation)
(model){
  MODEL                 = SM+EHC;
  MASSIVE[15] 1
}(model)
(beam){
  BEAM_1          = 2212
  BEAM_ENERGY_1   = 7000.
  BEAM_2          = 2212
  BEAM_ENERGY_2   = 7000.
}(beam)
(integration){
  FINISH_OPTIMIZATION = Off
}(integration)
(processes){
  %
  Process : 93 93 -> 25 93{1}
  Order_EW 1; CKKW sqr(45/E_CMS);
  Enhance_Factor 3 {3}
  Enhance_Factor 10 {4}
  Enable_MHV 0
  End process
}(processes)
