!-------------------------------------------------------
!-- Parton showers -------------------------------------
!-------------------------------------------------------
SHOWER_GENERATOR  = Apacic   !  
!
FSR_SHOWER        = 0        !  1=On,0=Off
ISR_SHOWER        = 0        !  1=On,0=Off
!
FS_PT2MIN         = 0.6      !  
