(run){
  EVENTS = 0
  OUTPUT = 2
  RANDOM_SEED     = 882 12
  PDF_LIBRARY = CTEQ6Sherpa;
  PDF_GRID_PATH = CTEQ6Grid;
  PDF_SET = cteq6l1;
  OVERRIDE_PDF_INFO = 1;
  CDXS_ITMIN 10000;
}(run)
(me){
  ME_SIGNAL_GENERATOR   = Comix
  EVENT_GENERATION_MODE = Weighted
  YUKAWA_MASSES         = Running
  SCALES                = VAR{8315.25}{8315.25}
  COUPLINGS             = Alpha_QCD 1
}(me)
(model){
  MODEL                 = SM
  MASS[5] = 4.7
  MASS[6] = 174.3
  WIDTH[6] = 1.508
  WIDTH[23] = 2.446
  WIDTH[24] = 2.048
  MASSIVE[5] = 1
  MASSIVE[15] = 1
  GENERATOR_ON          = 0
  EW_SCHEME             = 3
  ALPHAS(MZ)            = 0.130
  ALPHAS(default)       = 0.130
  ORDER_ALPHAS          = 0
  1/ALPHAQED(0)         = 137.036
  1/ALPHAQED(default)   = 132.51
  SIN2THETAW            = 0.2222
  VEV                   = 246.
  LAMBDA                = 0.47591
  YUKAWA_E              = 0.
  YUKAWA_MU             = 0.
  YUKAWA_TAU            = 1.77
  YUKAWA_U              = 0.
  YUKAWA_D              = 0.
  YUKAWA_S              = 0.
  YUKAWA_C              = 0.
  YUKAWA_B              = 4.5
  YUKAWA_T              = 174.3
  MSTRANGE_EFF          = 0.48
  CKMORDER              = 2
  CABIBBO               = 0.2222
  A                     = 0.85
  RHO                   = 0.50
  ETA                   = 0.50
}(model)
(beam){
  BEAM_1          = 2212
  BEAM_ENERGY_1   = 7000.
  BEAM_2          = 2212
  BEAM_ENERGY_2   = 7000.
}(beam)
(integration){
  ERROR =  5.e-3
  FINISH_OPTIMIZATION = On
}(integration)
(processes){
  %
  Process : 93 93 -> 93 93
  Order_EW : 0
  Order_QCD : 2
  End process
  %
  Process : 93 93 -> 93 93 93
  Order_EW : 0
  Order_QCD : 3
  End process
  %
  %Process : 93 93 -> 93 93 93 93
  %Order_EW : 0
  %Order_QCD : 4
  %Enable_MHV
  %End process
  %
  %Process : 93 93 -> 93 93 93 93 93
  %Order_EW : 0
  %Order_QCD : 5
  %End process
  %
  %%%%%%%%%%%%%%%%%%%%%%%%%%%%%%%%%%%%%%%%%%%%%%%%%%
  %
  Process : 93 93 -> 22 93
  Order_EW : 1
  Order_QCD : 1
  End process
  %
  Process : 93 93 -> 22 93 93
  Order_EW : 1
  Order_QCD : 2
  End process
  %
  %Process : 93 93 -> 22 93 93 93
  %Order_EW : 1
  %Order_QCD : 3
  %End process
  %
  %Process : 93 93 -> 22 93 93 93 93
  %Order_EW : 1
  %Order_QCD : 4
  %End process
  %
  %%%%%%%%%%%%%%%%%%%%%%%%%%%%%%%%%%%%%%%%%%%%%%%%%%
  %
  Process : 93 93 -> 22 22
  Order_EW : 2
  Order_QCD : 0
  End process
  %
  Process : 93 93 -> 22 22 93
  Order_EW : 2
  Order_QCD : 1
  End process
  %
  %Process : 93 93 -> 22 22 93 93
  %Order_EW : 2
  %Order_QCD : 2
  %End process
  %
  %Process : 93 93 -> 22 22 93 93 93
  %Order_EW : 2
  %Order_QCD : 3
  %End process
  %
  %%%%%%%%%%%%%%%%%%%%%%%%%%%%%%%%%%%%%%%%%%%%%%%%%%
  %
  Process : 93 93 -> 11 -12
  Order_EW : 2
  Order_QCD : 0
  End process
  %
  Process : 93 93 -> 11 -12 93
  Order_EW : 2
  Order_QCD : 1
  End process
  %
  Process : 93 93 -> 11 -12 93 93
  Order_EW : 2
  Order_QCD : 2
  End process
  %
  %Process : 93 93 -> 11 -12 93 93 93
  %Order_EW : 2
  %Order_QCD : 3
  %End process
  %
  %%%%%%%%%%%%%%%%%%%%%%%%%%%%%%%%%%%%%%%%%%%%%%%%%%
  %
  Process : 93 93 -> -11 12
  Order_EW : 2
  Order_QCD : 0
  End process
  %
  Process : 93 93 -> -11 12 93
  Order_EW : 2
  Order_QCD : 1
  End process
  %%
  Process : 93 93 -> -11 12 93 93
  Order_EW : 2
  Order_QCD : 2
  End process
  %
  %Process : 93 93 -> -11 12 93 93 93
  %Order_EW : 2
  %Order_QCD : 3
  %End process
  %
  %%%%%%%%%%%%%%%%%%%%%%%%%%%%%%%%%%%%%%%%%%%%%%%%%%
  %
  Process : 93 93 -> 11 -11
  Order_EW : 2
  Order_QCD : 0
  End process
  %
  Process : 93 93 -> 11 -11 93
  Order_EW : 2
  Order_QCD : 1
  End process
  %
  Process : 93 93 -> 11 -11 93 93
  Order_EW : 2
  Order_QCD : 2
  End process
  %
  %Process : 93 93 -> 11 -11 93 93 93
  %Order_EW : 2
  %Order_QCD : 3
  %End process
  %
  %%%%%%%%%%%%%%%%%%%%%%%%%%%%%%%%%%%%%%%%%%%%%%%%%%
  %
  Process : 93 93 -> 12 -12
  Order_EW : 2
  Order_QCD : 0
  End process
  %
  Process : 93 93 -> 12 -12 93
  Order_EW : 2
  Order_QCD : 1
  End process
  %
  %Process : 93 93 -> 12 -12 93 93
  %Order_EW : 2
  %Order_QCD : 2
  %End process
  %
  %Process : 93 93 -> 12 -12 93 93 93
  %Order_EW : 2
  %Order_QCD : 3
  %End process
  %
  %%%%%%%%%%%%%%%%%%%%%%%%%%%%%%%%%%%%%%%%%%%%%%%%%%
  %
  Process : 93 93 -> 11 -12 5 -5
  Order_EW : 2
  Order_QCD : 2
  End process
  %
  %Process : 93 93 -> 11 -12 5 -5 93
  %Order_EW : 2
  %Order_QCD : 3
  %End process
  %
  %Process : 93 93 -> 11 -12 5 -5 93 93
  %Order_EW : 2
  %Order_QCD : 4
  %End process
  %
  %%%%%%%%%%%%%%%%%%%%%%%%%%%%%%%%%%%%%%%%%%%%%%%%%%
  %
  Process : 93 93 -> 11 -11 5 -5
  Order_EW : 2
  Order_QCD : 2
  End process
  %
  %Process : 93 93 -> 11 -11 5 -5 93
  %Order_EW : 2
  %Order_QCD : 3
  %End process
  %
  %Process : 93 93 -> 11 -11 5 -5 93 93
  %Order_EW : 2
  %Order_QCD : 4
  %End process
  %
  %%%%%%%%%%%%%%%%%%%%%%%%%%%%%%%%%%%%%%%%%%%%%%%%%%
  %
  Process : 93 93 -> 6 -6
  Order_EW : 0
  Order_QCD : 2
  End process
  %
  Process : 93 93 -> 6 -6 93
  Order_EW : 0
  Order_QCD : 3
  End process
  %
  %Process : 93 93 -> 6 -6 93 93
  %Order_EW : 0
  %Order_QCD : 4
  %End process
  %
  %%%%%%%%%%%%%%%%%%%%%%%%%%%%%%%%%%%%%%%%%%%%%%%%%%
  %
  Process : 93 93 -> 5 -5
  Order_EW : 0
  Order_QCD : 2
  End process
  %
  Process : 93 93 -> 5 -5 93
  Order_EW : 0
  Order_QCD : 3
  End process
  %
  %Process : 93 93 -> 5 -5 93 93
  %Order_EW : 0
  %Order_QCD : 4
  %End process
  %
}(processes)
(selector){
  ET        93       20.   1000000000.
  ET        22       20.   1000000000.
  ET        11       20.   1000000000.
  ET        -11       20.   1000000000.
  ConeFinder    0.4
  PseudoRapidity  93     -2.5      2.5
  PseudoRapidity  22     -2.5      2.5
  PseudoRapidity  11     -2.5      2.5
  PseudoRapidity  -11     -2.5      2.5
  PseudoRapidity  12     -100.    100.
  PseudoRapidity  -12     -100.    100.
  PseudoRapidity  5     -100.    100.
  PseudoRapidity  -5     -100.    100.
  PseudoRapidity  6     -100.    100.
  PseudoRapidity  -6     -100.    100.
}(selector)
