0.1 0 0
0.3 0 0
0.5 0 0
0.7 0.0328926 0
0.9 0.0598719 0
1.1 0.054821 0
1.3 0.0519875 0
1.5 0.0486613 0
1.7 0.0512484 0
1.9 0.0507556 0
2.1 0.0519875 0
2.3 0.0554369 0
2.5 0.0572848 0
2.7 0.0593791 0
2.9 0.0625821 0
3.1 0.058024 0
3.3 0.0530963 0
3.5 0.0463513 0
3.7 0.0447191 0
3.9 0.0391754 0
4.1 0.0348637 0
4.3 0.031907 0
4.5 0.0272257 0
4.7 0.0290736 0
4.9 0.0224212 0
