(run){
  EVENTS 10*EVTS; ANALYSIS Rivet; ERROR 0.1;
  MI_HANDLER None; FRAGMENTATION Off; ME_QED Off;

  EVENT_SEED_MODE 3;
  SP_NLOCT 1; FSF:=1; RSF:=1; QSF:=0.5;
  SCALES STRICT_METS{FSF*MU_F2}{RSF*MU_R2}{QSF*MU_Q2};

  NLO_CSS_DISALLOW_FLAVOUR 5;

  LJET:=2,3; NJET:=2; QCUT:=30;
  LOOPGEN:=OpenLoops;
  ME_SIGNAL_GENERATOR Comix Amegic LOOPGEN;
  EVENT_GENERATION_MODE Weighted;
  MASSLESS_PS 1 2 3;
  ERROR 0.1;

  ENH0:=1.; RSENH0:=1.;
  ENH1:=1.; RSENH1:=1.;

  PARTICLE_CONTAINER 900 W 24 -24;
  PARTICLE_CONTAINER 901 lightflavs 1 -1 2 -2 3 -3 4 -4 21;

  RESULT_DIRECTORY res.MEPSatNLO.QCUT;
  ANALYSIS_OUTPUT  ana.MEPSatNLO.FSF.RSF.QSF.QCUT.NJET;

  MODEL SM;

  STABLE[24] 0; WIDTH[24] 0;
  STABLE[25] 0; WIDTH[25] 0;
  MASS[25] 125;
  STABLE[15] 0; MASSIVE[15] 1;

  HARD_DECAYS On;
  HDH_ONLY_DECAY {25,24,-12,11}|{25,24,-14,13}|{25,24,-16,15}|{25,-24,12,-11}|{25,-24,14,-13}|{25,-24,16,-15}|{24,12,-11}|{24,14,-13}|{24,16,-15}|{-24,-12,11}|{-24,-14,13}|{-24,-16,15}|{15,16,-12,11}|{15,16,-14,13}|{-15,-16,12,-11}|{-15,-16,14,-13};
  HARD_SPIN_CORRELATIONS 1;
  STORE_DECAY_RESULTS 1;
  DECAY_RESULT_DIRECTORY ../res.decays.WW;
  DECAY_TAU_HARD 1;

  BEAM_1 2212; BEAM_ENERGY_1 4000;
  BEAM_2 2212; BEAM_ENERGY_2 4000;
}(run);

(processes){
  Process 901 901 -> 900 25 901{NJET};
  Order_EW 2; 
  CKKW sqr(QCUT/E_CMS);
  NLO_QCD_Mode MC@NLO {LJET};
  Loop_Generator LOOPGEN;
  ME_Generator Amegic {LJET};
  RS_ME_Generator Comix
  Enhance_Factor ENH0 {3};
  Enhance_Factor ENH1 {4};
  RS_Enhance_Factor RSENH0 {3};
  RS_Enhance_Factor RSENH1 {4};
  End process;
}(processes);

(analysis){
  BEGIN_RIVET {
    -a MC_WH2WW MC_WH_ATLAS ATLAStrileptonVR2 MC_QCD_PARTONS;
  } END_RIVET
}(analysis)

