@startuml
left to right direction
actor Anonymous
actor Registered
Registered <|-- Anonymous
left to right direction
rectangle Client {
  Anonymous -- (Play game)
  Anonymous -- (Check Hall of Fame)
  Anonymous -- (Check Game Rules)
  Anonymous -- (Registration)
  Registered -- (Invite friends to play)
  Registered -- (Search for friends)
  Registered -- (Login)
  Registered -- (Add a friend)
  Registered -- (Accept friend\nRequest)
  Registered -- (Check my position in ranking)
  Registered -- (Play ranked game)
  Registered -- (Play game)
  Registered -- (Check Game Rules)
  Registered -- (Check Hall of Fame)

  (Play ranked game) .> (Play game) : extends
}
@enduml