@startuml

top to bottom direction

skinparam packageStyle rectangle

skinparam usecase {
	BackgroundColor DarkSeaGreen
	BorderColor DarkSlateGray
	ArrowColor Olive
	ActorBorderColor black
	ActorFontName Courier
	ActorBackgroundColor<<LoggedPlayer>> Gold
}

:Player1: <<LoggedPlayer>>
:Player2: <<LoggedPlayer>>


rectangle Server {

usecase ServerLobby as "Service of lobbies
--
Player can ask for a lobby specifying
friends he wants to invite
"

usecase MasterLobby as "Service that handle lobbies
--
It creates a lobby for Player1
and invites Player2
"

Player1 --> ServerLobby : Ask for lobby\n specifying Player2
ServerLobby --> MasterLobby : Create a lobby\nfor player1
MasterLobby --> (Lobby) : Create Lobby
MasterLobby --> Player2 : Invite Player2 to Lobby
Player2 --> (Lobby) : Accept/refuse
}
@enduml