@startuml

class MatchMakingActor{
-twoPlayersMatching: ListBuffer[GamersContainer]
-threePlayersMatching: ListBuffer[GamersContainer]
-fourPlayersMatching: ListBuffer[GamersContainer]
-fivePlayersMatching: ListBuffer[GamersContainer]
-sixPlayersMatching: ListBuffer[GamersContainer]
-rankedMatching: ListBuffer[GamersContainer]
-matchParty(containers: ListBuffer[GamersContainer], gamers: List[(ActorRef, String)], gameTypes: GameTypes): Unit
}

interface GamersContainer{
  +size: Int
  +freeSpace: Int
  +removePlayer(name:String): Unit
  +getIgnoredTimes: Int
  +incIgnoredTimes(num: Int): Unit
  +addGamers(gamers: List[(ActorRef, String)]): Unit
  +isFull: Boolean
  +gamersList: List[(ActorRef, String)]
}
object MatchingStrategy{
+ apply(queue: List[GamersContainer], gamers: List[ActorRef]): Option[GamersContainer]
}
MatchMakingActor "0..n"--"1..1" GamersContainer:contain
MatchMakingActor --> MatchingStrategy:use
MatchingStrategy --> GamersContainer:select








@enduml