@startuml
actor Player order 2
actor LobbyActor order 1
actor OtherJoinedPlayers order 3

box "server" #lightgreen
    participant LobbyActor
end box

box "client" #lightblue
    participant Player
    participant OtherJoinedPlayers
end box
== FIRST JOIN ==

Player ->> LobbyActor : Subscribe(playerName)
activate LobbyActor
hnote over LobbyActor: it saves ActorRef and\nname in a list and checks\nthe list size.
LobbyActor --> Player : Hello(owner, players) <<ACK>>
deactivate LobbyActor

== OTHER JOINS ==

hnote over OtherJoinedPlayers #red : They are waiting \nin lobby
Player ->> LobbyActor :  Subscribe(playerName)
activate LobbyActor
hnote over LobbyActor: it saves ActorRef and\nname in a list and checks\nthe list size.
LobbyActor --> Player : Hello(owner, players) <<ACK>>
LobbyActor --> OtherJoinedPlayers : HasJoined(playerName)
deactivate LobbyActor
@enduml