@startuml
title Player State
scale 550 width
[*] --> Waiting : LogIn(Username, Password)
Waiting --> [*] : LogOut(Username)
Waiting --> inLobby : <Create or join lobby>
inLobby --> Waiting : <Lobby destroyed>
inLobby --> inGame : <Lobby done, start game >
inGame --> Waiting : <Game is over>


inLobby: Here player waits for other \ninvited player join the lobby
Waiting : player is doing nothing.Now he can receive\n invite to a lobby or he can create\n lobby himself inviting other player
inGame : Player now is playing a game

@enduml