{
  "tags": {
    "ues": [
      "/home/{{ ansible_user }}/dNull/ues.lib",
      "/home/{{ ansible_user }}/dNull/ues.utils",
      "/home/{{ ansible_user }}/dNull/ues.insta"
    ],
    "dnull": [
      "/home/{{ ansible_user }}/dNull/dnull",
      "/home/{{ ansible_user }}/dNull/ansible",
      "/home/{{ ansible_user }}/dNull/external_roles/components",
      "/home/{{ ansible_user }}/dNull/lib/python/dnull"
    ]
  }
}
