module gorm-snippet

go 1.20

require (
	github.com/google/uuid v1.3.0
	github.com/joho/godotenv v1.5.1
	github.com/sanity-io/litter v1.5.5
	github.com/sirupsen/logrus v1.9.0
	gorm.io/driver/mysql v1.4.7
	gorm.io/gorm v1.24.7-0.20230306060331-85eaf9eeda11
)

require (
	github.com/go-sql-driver/mysql v1.7.0 // indirect
	github.com/jinzhu/inflection v1.0.0 // indirect
	github.com/jinzhu/now v1.1.5 // indirect
	github.com/stretchr/testify v1.8.1 // indirect
	golang.org/x/sys v0.5.0 // indirect
)
