{
	"info": {
		"_postman_id": "250e1d53-a0ae-4973-b571-e9c544c5ad19",
		"name": "Drive Me APIs",
		"schema": "https://schema.getpostman.com/json/collection/v2.1.0/collection.json",
		"_exporter_id": "25357162"
	},
	"item": [
		{
			"name": "Auth API",
			"item": [
				{
					"name": "Login",
					"protocolProfileBehavior": {
						"disabledSystemHeaders": {
							"accept": true
						}
					},
					"request": {
						"method": "POST",
						"header": [
							{
								"key": "Accept",
								"value": "application/json",
								"type": "default"
							}
						],
						"body": {
							"mode": "formdata",
							"formdata": [
								{
									"key": "email",
									"value": "noroz@email121.com",
									"type": "default"
								},
								{
									"key": "password",
									"value": "12345678",
									"type": "default"
								}
							]
						},
						"url": {
							"raw": "{{base_url}}user/login",
							"host": [
								"{{base_url}}user"
							],
							"path": [
								"login"
							]
						}
					},
					"response": []
				},
				{
					"name": "Register",
					"protocolProfileBehavior": {
						"disabledSystemHeaders": {
							"accept": true
						}
					},
					"request": {
						"method": "POST",
						"header": [
							{
								"key": "Accept",
								"value": "application/json",
								"type": "default"
							}
						],
						"body": {
							"mode": "formdata",
							"formdata": [
								{
									"key": "email",
									"value": "noroz123@email123.com",
									"type": "default"
								},
								{
									"key": "password",
									"value": "12345678",
									"type": "default"
								},
								{
									"key": "latitude",
									"value": "12.55567",
									"type": "default"
								},
								{
									"key": "longitude",
									"value": "12.456566",
									"type": "default"
								},
								{
									"key": "first_name",
									"value": "Noroz",
									"type": "default"
								},
								{
									"key": "phone",
									"value": "01478981134",
									"type": "default"
								},
								{
									"key": "cpass",
									"value": "12345678",
									"type": "default"
								},
								{
									"key": "address",
									"value": "USA",
									"type": "text"
								},
								{
									"key": "last_name",
									"value": "Hyder",
									"type": "text"
								}
							]
						},
						"url": {
							"raw": "{{base_url}}user/register",
							"host": [
								"{{base_url}}user"
							],
							"path": [
								"register"
							]
						}
					},
					"response": []
				},
				{
					"name": "Vendor Register",
					"protocolProfileBehavior": {
						"disabledSystemHeaders": {
							"accept": true
						}
					},
					"request": {
						"method": "POST",
						"header": [
							{
								"key": "Accept",
								"value": "application/json",
								"type": "default"
							}
						],
						"body": {
							"mode": "formdata",
							"formdata": [
								{
									"key": "email",
									"value": "vendor@test11.com",
									"type": "default"
								},
								{
									"key": "password",
									"value": "12345678",
									"type": "default"
								},
								{
									"key": "address",
									"value": "Karachi",
									"type": "text"
								},
								{
									"key": "latitude",
									"value": "12.55567",
									"type": "default"
								},
								{
									"key": "longitude",
									"value": "12.456566",
									"type": "default"
								},
								{
									"key": "name",
									"value": "Noroz",
									"type": "default"
								},
								{
									"key": "phone",
									"value": "014789811358",
									"type": "default"
								},
								{
									"key": "cpass",
									"value": "12345678",
									"type": "default"
								},
								{
									"key": "driver_license_front_image",
									"type": "file",
									"src": "/C:/Users/Hp/Downloads/store (1).png"
								},
								{
									"key": "driver_license_back_image",
									"type": "file",
									"src": "/C:/Users/Hp/Downloads/delivery (1).png"
								},
								{
									"key": "emirates_id",
									"value": "123456",
									"type": "text"
								},
								{
									"key": "refferal_code",
									"value": "92023",
									"type": "text"
								}
							]
						},
						"url": {
							"raw": "{{base_url}}vendor/register",
							"host": [
								"{{base_url}}vendor"
							],
							"path": [
								"register"
							]
						}
					},
					"response": []
				},
				{
					"name": "Forgot Password",
					"protocolProfileBehavior": {
						"disabledSystemHeaders": {
							"accept": true
						}
					},
					"request": {
						"method": "POST",
						"header": [
							{
								"key": "Accept",
								"value": "application/json",
								"type": "default"
							}
						],
						"body": {
							"mode": "formdata",
							"formdata": [
								{
									"key": "email",
									"value": "noroz@test112.com",
									"type": "default"
								},
								{
									"key": "password",
									"value": "12345678",
									"type": "default",
									"disabled": true
								},
								{
									"key": "latitude",
									"value": "12.55567",
									"type": "default",
									"disabled": true
								},
								{
									"key": "longitude",
									"value": "12.456566",
									"type": "default",
									"disabled": true
								}
							]
						},
						"url": {
							"raw": "{{base_url}}forgot/password",
							"host": [
								"{{base_url}}forgot"
							],
							"path": [
								"password"
							]
						}
					},
					"response": []
				},
				{
					"name": "Verify OTP",
					"protocolProfileBehavior": {
						"disabledSystemHeaders": {
							"accept": true
						}
					},
					"request": {
						"method": "POST",
						"header": [
							{
								"key": "Accept",
								"value": "application/json",
								"type": "default"
							}
						],
						"body": {
							"mode": "formdata",
							"formdata": [
								{
									"key": "email",
									"value": "noroz@email1233211.com",
									"type": "text"
								},
								{
									"key": "token",
									"value": "764016",
									"type": "text"
								}
							]
						},
						"url": {
							"raw": "{{base_url}}confirm/otp",
							"host": [
								"{{base_url}}confirm"
							],
							"path": [
								"otp"
							]
						}
					},
					"response": []
				},
				{
					"name": "Reser Passwords",
					"request": {
						"method": "POST",
						"header": [],
						"body": {
							"mode": "formdata",
							"formdata": [
								{
									"key": "email",
									"value": "noroz@test112.com",
									"type": "default"
								},
								{
									"key": "password",
									"value": "123456789",
									"type": "default"
								},
								{
									"key": "cpass",
									"value": "123456789",
									"type": "default"
								}
							]
						},
						"url": {
							"raw": "{{base_url}}reset/password",
							"host": [
								"{{base_url}}reset"
							],
							"path": [
								"password"
							]
						}
					},
					"response": []
				},
				{
					"name": "Get User Profile",
					"protocolProfileBehavior": {
						"disabledSystemHeaders": {
							"accept": true
						}
					},
					"request": {
						"auth": {
							"type": "bearer",
							"bearer": [
								{
									"key": "token",
									"value": "{{auth_token}}",
									"type": "string"
								}
							]
						},
						"method": "GET",
						"header": [
							{
								"key": "Accept",
								"value": "application/json",
								"type": "default"
							}
						],
						"url": {
							"raw": "{{base_url}}user",
							"host": [
								"{{base_url}}user"
							]
						}
					},
					"response": []
				},
				{
					"name": "OTP Verification after Registration/Login",
					"protocolProfileBehavior": {
						"disabledSystemHeaders": {
							"accept": true
						}
					},
					"request": {
						"auth": {
							"type": "bearer",
							"bearer": [
								{
									"key": "token",
									"value": "{{auth_token}}",
									"type": "string"
								}
							]
						},
						"method": "POST",
						"header": [
							{
								"key": "Accept",
								"value": "application/json",
								"type": "text"
							}
						],
						"body": {
							"mode": "formdata",
							"formdata": [
								{
									"key": "otp",
									"value": "390236",
									"type": "text"
								}
							]
						},
						"url": {
							"raw": "{{base_url}}verify/otp",
							"host": [
								"{{base_url}}verify"
							],
							"path": [
								"otp"
							]
						}
					},
					"response": []
				}
			]
		},
		{
			"name": "Users",
			"item": [
				{
					"name": "Profile Update",
					"request": {
						"auth": {
							"type": "bearer",
							"bearer": [
								{
									"key": "token",
									"value": "{{auth_token}}",
									"type": "string"
								}
							]
						},
						"method": "POST",
						"header": [
							{
								"key": "Accept",
								"value": "application/json",
								"type": "text"
							}
						],
						"body": {
							"mode": "formdata",
							"formdata": [
								{
									"key": "name",
									"value": "noroz2",
									"type": "text"
								},
								{
									"key": "bio",
									"value": "this is noroz working so hard",
									"type": "text"
								},
								{
									"key": "phone",
									"value": "090078601",
									"type": "text"
								},
								{
									"key": "address",
									"value": "khao gali test road",
									"type": "text"
								},
								{
									"key": "latitude",
									"value": "35.6212",
									"type": "text"
								},
								{
									"key": "longitude",
									"value": "36.23221",
									"type": "text"
								},
								{
									"key": "imageFile",
									"type": "file",
									"src": "/C:/Users/Hp/Downloads/71NTi82uBEL._AC_SX466_.jpg"
								},
								{
									"key": "driver_license_front_image",
									"description": "When user is Captain",
									"type": "file",
									"src": "/C:/Users/Hp/Downloads/delivery.png"
								},
								{
									"key": "driver_license_back_image",
									"description": "When user is Captain",
									"type": "file",
									"src": "/C:/Users/Hp/Downloads/store.png"
								}
							]
						},
						"url": {
							"raw": "{{base_url}}user/updateprofile",
							"host": [
								"{{base_url}}user"
							],
							"path": [
								"updateprofile"
							]
						}
					},
					"response": []
				},
				{
					"name": "Get Notification",
					"protocolProfileBehavior": {
						"disabledSystemHeaders": {
							"accept": true
						}
					},
					"request": {
						"auth": {
							"type": "bearer",
							"bearer": [
								{
									"key": "token",
									"value": "{{auth_token}}",
									"type": "string"
								}
							]
						},
						"method": "GET",
						"header": [
							{
								"key": "Accept",
								"value": "application/json",
								"type": "text"
							}
						],
						"url": {
							"raw": "{{base_url}}notifications",
							"host": [
								"{{base_url}}notifications"
							]
						}
					},
					"response": []
				},
				{
					"name": "Read All Notification",
					"request": {
						"auth": {
							"type": "bearer",
							"bearer": [
								{
									"key": "token",
									"value": "{{auth_token}}",
									"type": "string"
								}
							]
						},
						"method": "POST",
						"header": [],
						"url": {
							"raw": "{{base_url}}notifications/all",
							"host": [
								"{{base_url}}notifications"
							],
							"path": [
								"all"
							]
						}
					},
					"response": []
				},
				{
					"name": "Get and Read Notification by Id",
					"protocolProfileBehavior": {
						"disabledSystemHeaders": {
							"accept": true
						}
					},
					"request": {
						"auth": {
							"type": "bearer",
							"bearer": [
								{
									"key": "token",
									"value": "{{auth_token}}",
									"type": "string"
								}
							]
						},
						"method": "GET",
						"header": [
							{
								"key": "Accept",
								"value": "application/json",
								"type": "text"
							}
						],
						"url": {
							"raw": "{{base_url}}notifications/cbaf9550-8f02-4927-a1d4-755e28850dd4",
							"host": [
								"{{base_url}}notifications"
							],
							"path": [
								"cbaf9550-8f02-4927-a1d4-755e28850dd4"
							]
						}
					},
					"response": []
				},
				{
					"name": "Change Password",
					"request": {
						"auth": {
							"type": "bearer",
							"bearer": [
								{
									"key": "token",
									"value": "{{auth_token}}",
									"type": "string"
								}
							]
						},
						"method": "POST",
						"header": [],
						"body": {
							"mode": "formdata",
							"formdata": [
								{
									"key": "current_password",
									"value": "12345678",
									"type": "text"
								},
								{
									"key": "new_password",
									"value": "123456789",
									"type": "text"
								},
								{
									"key": "confirm_password",
									"value": "123456789",
									"type": "text"
								}
							]
						},
						"url": {
							"raw": "{{base_url}}user/changePassword",
							"host": [
								"{{base_url}}user"
							],
							"path": [
								"changePassword"
							]
						}
					},
					"response": []
				},
				{
					"name": "Delete Account",
					"request": {
						"auth": {
							"type": "bearer",
							"bearer": [
								{
									"key": "token",
									"value": "{{auth_token}}",
									"type": "string"
								}
							]
						},
						"method": "DELETE",
						"header": [],
						"url": {
							"raw": "{{base_url}}user/delete",
							"host": [
								"{{base_url}}user"
							],
							"path": [
								"delete"
							]
						}
					},
					"response": []
				}
			]
		},
		{
			"name": "Car",
			"item": [
				{
					"name": "Get all Cars",
					"request": {
						"auth": {
							"type": "bearer",
							"bearer": [
								{
									"key": "token",
									"value": "{{auth_token}}",
									"type": "string"
								}
							]
						},
						"method": "GET",
						"header": [],
						"url": {
							"raw": "{{base_url}}cars",
							"host": [
								"{{base_url}}cars"
							]
						}
					},
					"response": []
				},
				{
					"name": "Get all Cars Copy",
					"request": {
						"auth": {
							"type": "bearer",
							"bearer": [
								{
									"key": "token",
									"value": "{{auth_token}}",
									"type": "string"
								}
							]
						},
						"method": "GET",
						"header": [],
						"url": {
							"raw": "{{base_url}}cars",
							"host": [
								"{{base_url}}cars"
							]
						}
					},
					"response": []
				},
				{
					"name": "Get a Car by Id",
					"request": {
						"auth": {
							"type": "bearer",
							"bearer": [
								{
									"key": "token",
									"value": "{{auth_token}}",
									"type": "string"
								}
							]
						},
						"method": "GET",
						"header": [],
						"url": {
							"raw": "{{base_url}}cars/1",
							"host": [
								"{{base_url}}cars"
							],
							"path": [
								"1"
							]
						}
					},
					"response": []
				},
				{
					"name": "Add a Car",
					"protocolProfileBehavior": {
						"disabledSystemHeaders": {
							"accept": true
						}
					},
					"request": {
						"auth": {
							"type": "bearer",
							"bearer": [
								{
									"key": "token",
									"value": "{{auth_token}}",
									"type": "string"
								}
							]
						},
						"method": "POST",
						"header": [
							{
								"key": "Accept",
								"value": "application/json",
								"type": "text"
							}
						],
						"body": {
							"mode": "formdata",
							"formdata": [
								{
									"key": "name",
									"value": "Honda Vitz",
									"type": "text"
								},
								{
									"key": "model",
									"value": "2023",
									"type": "text"
								},
								{
									"key": "plate_number",
									"value": "ABC-123",
									"type": "text"
								},
								{
									"key": "transmission_type",
									"value": "manual",
									"type": "text"
								},
								{
									"key": "is_insured",
									"value": "1",
									"type": "text"
								}
							]
						},
						"url": {
							"raw": "{{base_url}}cars",
							"host": [
								"{{base_url}}cars"
							]
						}
					},
					"response": []
				},
				{
					"name": "Update a Car",
					"protocolProfileBehavior": {
						"disabledSystemHeaders": {
							"accept": true
						}
					},
					"request": {
						"auth": {
							"type": "bearer",
							"bearer": [
								{
									"key": "token",
									"value": "{{auth_token}}",
									"type": "string"
								}
							]
						},
						"method": "PUT",
						"header": [
							{
								"key": "Accept",
								"value": "application/json",
								"type": "text"
							}
						],
						"url": {
							"raw": "{{base_url}}cars/1?name=Honda Vitz&model=2023&plate_number=ABC-123&transmission_type=manual&is_insured=0",
							"host": [
								"{{base_url}}cars"
							],
							"path": [
								"1"
							],
							"query": [
								{
									"key": "name",
									"value": "Honda Vitz"
								},
								{
									"key": "model",
									"value": "2023"
								},
								{
									"key": "plate_number",
									"value": "ABC-123"
								},
								{
									"key": "transmission_type",
									"value": "manual"
								},
								{
									"key": "is_insured",
									"value": "0"
								}
							]
						}
					},
					"response": []
				},
				{
					"name": "Car Brands",
					"request": {
						"auth": {
							"type": "bearer",
							"bearer": [
								{
									"key": "token",
									"value": "{{auth_token}}",
									"type": "string"
								}
							]
						},
						"method": "GET",
						"header": [],
						"url": {
							"raw": "{{base_url}}car/brands",
							"host": [
								"{{base_url}}car"
							],
							"path": [
								"brands"
							]
						}
					},
					"response": []
				}
			]
		},
		{
			"name": "Book a Trip",
			"item": [
				{
					"name": "Get All Trips",
					"protocolProfileBehavior": {
						"disabledSystemHeaders": {
							"accept": true
						}
					},
					"request": {
						"auth": {
							"type": "bearer",
							"bearer": [
								{
									"key": "token",
									"value": "{{auth_token}}",
									"type": "string"
								}
							]
						},
						"method": "GET",
						"header": [
							{
								"key": "Accept",
								"value": "application/json",
								"type": "text"
							}
						],
						"url": {
							"raw": "{{base_url}}trips",
							"host": [
								"{{base_url}}trips"
							],
							"query": [
								{
									"key": "trip_type",
									"value": "ride_now",
									"disabled": true
								},
								{
									"key": "status",
									"value": "pending",
									"disabled": true
								},
								{
									"key": "start_date",
									"value": "2023-02-01",
									"disabled": true
								},
								{
									"key": "end_date",
									"value": "2023-02-10",
									"disabled": true
								}
							]
						}
					},
					"response": []
				},
				{
					"name": "Book a Trip",
					"protocolProfileBehavior": {
						"disabledSystemHeaders": {
							"accept": true
						}
					},
					"request": {
						"auth": {
							"type": "bearer",
							"bearer": [
								{
									"key": "token",
									"value": "{{auth_token}}",
									"type": "string"
								}
							]
						},
						"method": "POST",
						"header": [
							{
								"key": "Accept",
								"value": "application/json",
								"type": "text"
							}
						],
						"body": {
							"mode": "formdata",
							"formdata": [
								{
									"key": "pickup_id",
									"value": "0",
									"description": "If user choose from there previous addresses then provide address id else dont send in request",
									"type": "text",
									"disabled": true
								},
								{
									"key": "dropoff_id",
									"value": "0",
									"description": "If user choose from there previous addresses then provide address id else dont send in request",
									"type": "text",
									"disabled": true
								},
								{
									"key": "pickup_address",
									"value": "Karachi",
									"description": "put false/0 if you provide pickup id",
									"type": "text"
								},
								{
									"key": "pickup_latitude",
									"value": "24.1265646",
									"description": "required if pickup address is not false/0",
									"type": "text"
								},
								{
									"key": "pickup_longitude",
									"value": "64.0256565",
									"description": "required if pickup address is not false/0",
									"type": "text"
								},
								{
									"key": "dropoff_address",
									"value": "Gulshan Johar",
									"description": "put false/0 if you provide dropoff id",
									"type": "text"
								},
								{
									"key": "dropoff_latitude",
									"value": "24.1265646",
									"description": "required if dropoff address is not false/0",
									"type": "text"
								},
								{
									"key": "dropoff_longitude",
									"value": "64.0256565",
									"description": "required if dropoff address is not false/0",
									"type": "text"
								},
								{
									"key": "status",
									"value": "schedule",
									"description": "Status wil be [pending, schedule, cancel, processing]",
									"type": "text"
								},
								{
									"key": "schedule_datetime",
									"value": "2023-02-07 12:00:00 AM",
									"description": "Required if status is schedule",
									"type": "text"
								},
								{
									"key": "trip_type",
									"value": "ride_now",
									"description": "['ride_now', 'garage_pickup', 'rta_inspection', 'inter_city']",
									"type": "text"
								},
								{
									"key": "booking_type",
									"value": "pay_per_minute",
									"description": "['pay_per_minute', 'pay_per_hour']",
									"type": "text"
								},
								{
									"key": "instruction",
									"value": "Optional",
									"type": "text"
								},
								{
									"key": "car_id",
									"value": "1",
									"type": "text"
								},
								{
									"key": "promocode",
									"value": "FRIDAY50",
									"type": "text",
									"disabled": true
								},
								{
									"key": "amount",
									"value": "50",
									"type": "text"
								}
							]
						},
						"url": {
							"raw": "{{base_url}}trips",
							"host": [
								"{{base_url}}trips"
							]
						}
					},
					"response": []
				},
				{
					"name": "Get a Trip By Id",
					"request": {
						"auth": {
							"type": "bearer",
							"bearer": [
								{
									"key": "token",
									"value": "{{auth_token}}",
									"type": "string"
								}
							]
						},
						"method": "GET",
						"header": [],
						"url": {
							"raw": "{{base_url}}trips/1",
							"host": [
								"{{base_url}}trips"
							],
							"path": [
								"1"
							]
						}
					},
					"response": []
				},
				{
					"name": "Update Trip",
					"request": {
						"auth": {
							"type": "bearer",
							"bearer": [
								{
									"key": "token",
									"value": "{{auth_token}}",
									"type": "string"
								}
							]
						},
						"method": "PUT",
						"header": [],
						"url": {
							"raw": "{{base_url}}trips/1?status=cancel&reason=If Status is Cancel&instruction=OptionaL",
							"host": [
								"{{base_url}}trips"
							],
							"path": [
								"1"
							],
							"query": [
								{
									"key": "status",
									"value": "cancel"
								},
								{
									"key": "schedule_datetime",
									"value": "2023-02-07 12:00:00 AM",
									"disabled": true
								},
								{
									"key": "reason",
									"value": "If Status is Cancel"
								},
								{
									"key": "instruction",
									"value": "OptionaL"
								}
							]
						}
					},
					"response": []
				},
				{
					"name": "Pay for Trip",
					"request": {
						"auth": {
							"type": "bearer",
							"bearer": [
								{
									"key": "token",
									"value": "{{auth_token}}",
									"type": "string"
								}
							]
						},
						"method": "POST",
						"header": [],
						"body": {
							"mode": "formdata",
							"formdata": [
								{
									"key": "payment_id",
									"value": "1",
									"type": "text"
								},
								{
									"key": "amount",
									"value": "25",
									"type": "text"
								}
							]
						},
						"url": {
							"raw": "{{base_url}}trips/pay/1",
							"host": [
								"{{base_url}}trips"
							],
							"path": [
								"pay",
								"1"
							]
						}
					},
					"response": []
				},
				{
					"name": "Estimation Trip Price",
					"request": {
						"auth": {
							"type": "bearer",
							"bearer": [
								{
									"key": "token",
									"value": "{{auth_token}}",
									"type": "string"
								}
							]
						},
						"method": "POST",
						"header": [],
						"body": {
							"mode": "formdata",
							"formdata": [
								{
									"key": "distance",
									"value": "25",
									"type": "text"
								},
								{
									"key": "time",
									"value": "01:30:00",
									"type": "text"
								}
							]
						},
						"url": {
							"raw": "{{base_url}}trip/estimation",
							"host": [
								"{{base_url}}trip"
							],
							"path": [
								"estimation"
							]
						}
					},
					"response": []
				}
			]
		},
		{
			"name": "Rider",
			"item": [
				{
					"name": "Get Rides",
					"request": {
						"auth": {
							"type": "bearer",
							"bearer": [
								{
									"key": "token",
									"value": "{{auth_token}}",
									"type": "string"
								}
							]
						},
						"method": "GET",
						"header": [],
						"url": {
							"raw": "{{base_url}}driver/ride",
							"host": [
								"{{base_url}}driver"
							],
							"path": [
								"ride"
							]
						}
					},
					"response": []
				},
				{
					"name": "Accept/Reject a Ride",
					"request": {
						"auth": {
							"type": "bearer",
							"bearer": [
								{
									"key": "token",
									"value": "{{auth_token}}",
									"type": "string"
								}
							]
						},
						"method": "POST",
						"header": [],
						"body": {
							"mode": "formdata",
							"formdata": [
								{
									"key": "status",
									"value": "accept",
									"description": "[accept, reject]",
									"type": "text"
								}
							]
						},
						"url": {
							"raw": "{{base_url}}driver/ride/1",
							"host": [
								"{{base_url}}driver"
							],
							"path": [
								"ride",
								"1"
							]
						}
					},
					"response": []
				}
			]
		},
		{
			"name": "Bank Details",
			"item": [
				{
					"name": "Get User Bank Detail ",
					"request": {
						"auth": {
							"type": "bearer",
							"bearer": [
								{
									"key": "token",
									"value": "{{auth_token}}",
									"type": "string"
								}
							]
						},
						"method": "GET",
						"header": [
							{
								"key": "Accept",
								"value": "application/json",
								"type": "text"
							}
						],
						"url": {
							"raw": "{{local}}/user/bank/details",
							"host": [
								"{{local}}"
							],
							"path": [
								"user",
								"bank",
								"details"
							]
						}
					},
					"response": []
				},
				{
					"name": "Bank Detail by Id",
					"request": {
						"auth": {
							"type": "bearer",
							"bearer": [
								{
									"key": "token",
									"value": "{{auth_token}}",
									"type": "string"
								}
							]
						},
						"method": "GET",
						"header": [
							{
								"key": "Accept",
								"value": "application/json",
								"type": "text"
							}
						],
						"url": {
							"raw": "{{local}}/user/bank/details/1",
							"host": [
								"{{local}}"
							],
							"path": [
								"user",
								"bank",
								"details",
								"1"
							]
						}
					},
					"response": []
				},
				{
					"name": "Add Bank Detail",
					"request": {
						"auth": {
							"type": "bearer",
							"bearer": [
								{
									"key": "token",
									"value": "{{auth_token}}",
									"type": "string"
								}
							]
						},
						"method": "POST",
						"header": [
							{
								"key": "Accept",
								"value": "application/json",
								"type": "text"
							}
						],
						"body": {
							"mode": "formdata",
							"formdata": [
								{
									"key": "bank_country",
									"value": "Pakistan",
									"type": "text"
								},
								{
									"key": "account_number",
									"value": "424242424242424",
									"type": "text"
								},
								{
									"key": "bank_currency",
									"value": "usd",
									"type": "text"
								},
								{
									"key": "account_holder_name",
									"value": "Noroz Hyder",
									"type": "text"
								},
								{
									"key": "bank_name",
									"value": "Dubai islamic",
									"type": "text",
									"disabled": true
								},
								{
									"key": "iban_number",
									"value": "pk-100202093",
									"type": "text",
									"disabled": true
								},
								{
									"key": "branch_code",
									"value": "0096",
									"type": "text",
									"disabled": true
								},
								{
									"key": "type",
									"value": "card",
									"description": "[bak, card]",
									"type": "text"
								}
							]
						},
						"url": {
							"raw": "{{local}}/user/bank/details",
							"host": [
								"{{local}}"
							],
							"path": [
								"user",
								"bank",
								"details"
							]
						}
					},
					"response": []
				},
				{
					"name": "Add Bank Detail Copy",
					"request": {
						"auth": {
							"type": "bearer",
							"bearer": [
								{
									"key": "token",
									"value": "{{auth_token}}",
									"type": "string"
								}
							]
						},
						"method": "PUT",
						"header": [
							{
								"key": "Accept",
								"value": "application/json",
								"type": "text"
							}
						],
						"url": {
							"raw": "{{local}}/user/bank/details/1?bank_country=Pakistan&account_number=01999201&bank_currency=dirham&account_holder_name=Noroz&bank_name=Dubai islamic&iban_number=pk-100202093&branch_code=0096",
							"host": [
								"{{local}}"
							],
							"path": [
								"user",
								"bank",
								"details",
								"1"
							],
							"query": [
								{
									"key": "bank_country",
									"value": "Pakistan"
								},
								{
									"key": "account_number",
									"value": "01999201"
								},
								{
									"key": "bank_currency",
									"value": "dirham"
								},
								{
									"key": "account_holder_name",
									"value": "Noroz"
								},
								{
									"key": "bank_name",
									"value": "Dubai islamic"
								},
								{
									"key": "iban_number",
									"value": "pk-100202093"
								},
								{
									"key": "branch_code",
									"value": "0096"
								}
							]
						}
					},
					"response": []
				}
			]
		},
		{
			"name": "Complaint",
			"item": [
				{
					"name": "Get All Complaints",
					"request": {
						"auth": {
							"type": "bearer",
							"bearer": [
								{
									"key": "token",
									"value": "{{auth_token}}",
									"type": "string"
								}
							]
						},
						"method": "GET",
						"header": [],
						"url": {
							"raw": "{{base_url}}complaints",
							"host": [
								"{{base_url}}complaints"
							]
						}
					},
					"response": []
				},
				{
					"name": "Add Complaint",
					"request": {
						"auth": {
							"type": "bearer",
							"bearer": [
								{
									"key": "token",
									"value": "{{auth_token}}",
									"type": "string"
								}
							]
						},
						"method": "POST",
						"header": [],
						"body": {
							"mode": "formdata",
							"formdata": [
								{
									"key": "user_trip_id",
									"value": "1",
									"type": "text"
								},
								{
									"key": "message",
									"value": "ABCD",
									"type": "text"
								}
							]
						},
						"url": {
							"raw": "{{base_url}}complaints",
							"host": [
								"{{base_url}}complaints"
							]
						}
					},
					"response": []
				},
				{
					"name": "Get Complaint By Id",
					"request": {
						"auth": {
							"type": "bearer",
							"bearer": [
								{
									"key": "token",
									"value": "{{auth_token}}",
									"type": "string"
								}
							]
						},
						"method": "GET",
						"header": [],
						"url": {
							"raw": "{{base_url}}complaints/1",
							"host": [
								"{{base_url}}complaints"
							],
							"path": [
								"1"
							]
						}
					},
					"response": []
				},
				{
					"name": "Update Complaint By Id",
					"request": {
						"auth": {
							"type": "bearer",
							"bearer": [
								{
									"key": "token",
									"value": "{{auth_token}}",
									"type": "string"
								}
							]
						},
						"method": "PUT",
						"header": [],
						"url": {
							"raw": "{{base_url}}complaints/1?status=resolved",
							"host": [
								"{{base_url}}complaints"
							],
							"path": [
								"1"
							],
							"query": [
								{
									"key": "status",
									"value": "resolved",
									"description": "[pending, resolved]"
								}
							]
						}
					},
					"response": []
				}
			]
		},
		{
			"name": "Saved Addresses",
			"item": [
				{
					"name": "Get Address",
					"request": {
						"auth": {
							"type": "bearer",
							"bearer": [
								{
									"key": "token",
									"value": "{{auth_token}}",
									"type": "string"
								}
							]
						},
						"method": "GET",
						"header": [],
						"url": {
							"raw": "{{base_url}}address",
							"host": [
								"{{base_url}}address"
							]
						}
					},
					"response": []
				},
				{
					"name": "Add User Address",
					"request": {
						"auth": {
							"type": "bearer",
							"bearer": [
								{
									"key": "token",
									"value": "{{auth_token}}",
									"type": "string"
								}
							]
						},
						"method": "POST",
						"header": [],
						"body": {
							"mode": "formdata",
							"formdata": [
								{
									"key": "address",
									"value": "USA",
									"type": "text"
								},
								{
									"key": "latitude",
									"value": "24.25645165",
									"type": "text"
								},
								{
									"key": "longitude",
									"value": "67.126465",
									"type": "text"
								},
								{
									"key": "type",
									"value": "home",
									"description": "[home, office, other]",
									"type": "text"
								}
							]
						},
						"url": {
							"raw": "{{base_url}}address",
							"host": [
								"{{base_url}}address"
							]
						}
					},
					"response": []
				},
				{
					"name": "Update User Address",
					"request": {
						"auth": {
							"type": "bearer",
							"bearer": [
								{
									"key": "token",
									"value": "{{auth_token}}",
									"type": "string"
								}
							]
						},
						"method": "PUT",
						"header": [],
						"body": {
							"mode": "formdata",
							"formdata": []
						},
						"url": {
							"raw": "{{base_url}}address/8?address=USA&latitude=24.25645165&longitude=67.126465&type=home",
							"host": [
								"{{base_url}}address"
							],
							"path": [
								"8"
							],
							"query": [
								{
									"key": "address",
									"value": "USA"
								},
								{
									"key": "latitude",
									"value": "24.25645165"
								},
								{
									"key": "longitude",
									"value": "67.126465"
								},
								{
									"key": "type",
									"value": "home"
								}
							]
						}
					},
					"response": []
				}
			]
		},
		{
			"name": "Review & Ratings",
			"item": [
				{
					"name": "Get Reviews & Rating",
					"request": {
						"auth": {
							"type": "bearer",
							"bearer": [
								{
									"key": "token",
									"value": "{{auth_token}}",
									"type": "string"
								}
							]
						},
						"method": "GET",
						"header": [],
						"url": {
							"raw": "{{base_url}}ratings",
							"host": [
								"{{base_url}}ratings"
							]
						}
					},
					"response": []
				},
				{
					"name": "Add Review & rating",
					"request": {
						"auth": {
							"type": "bearer",
							"bearer": [
								{
									"key": "token",
									"value": "{{auth_token}}",
									"type": "string"
								}
							]
						},
						"method": "POST",
						"header": [],
						"body": {
							"mode": "formdata",
							"formdata": [
								{
									"key": "rating",
									"value": "3",
									"description": "not greater than 5",
									"type": "text"
								},
								{
									"key": "review",
									"value": "He is Good in her service",
									"type": "text"
								},
								{
									"key": "user_id",
									"value": "8",
									"type": "text"
								}
							]
						},
						"url": {
							"raw": "{{base_url}}ratings",
							"host": [
								"{{base_url}}ratings"
							]
						}
					},
					"response": []
				},
				{
					"name": "Update Review & rating",
					"request": {
						"auth": {
							"type": "bearer",
							"bearer": [
								{
									"key": "token",
									"value": "{{auth_token}}",
									"type": "string"
								}
							]
						},
						"method": "PUT",
						"header": [],
						"url": {
							"raw": "{{base_url}}ratings/1?rating=3&review=He is Good in her service",
							"host": [
								"{{base_url}}ratings"
							],
							"path": [
								"1"
							],
							"query": [
								{
									"key": "rating",
									"value": "3"
								},
								{
									"key": "review",
									"value": "He is Good in her service"
								}
							]
						}
					},
					"response": []
				},
				{
					"name": "Get Review & rating By Id",
					"request": {
						"auth": {
							"type": "bearer",
							"bearer": [
								{
									"key": "token",
									"value": "{{auth_token}}",
									"type": "string"
								}
							]
						},
						"method": "GET",
						"header": [],
						"url": {
							"raw": "{{base_url}}ratings/1",
							"host": [
								"{{base_url}}ratings"
							],
							"path": [
								"1"
							]
						}
					},
					"response": []
				},
				{
					"name": "Delete Review & rating By Id",
					"request": {
						"auth": {
							"type": "bearer",
							"bearer": [
								{
									"key": "token",
									"value": "{{auth_token}}",
									"type": "string"
								}
							]
						},
						"method": "DELETE",
						"header": [],
						"url": {
							"raw": "{{base_url}}ratings/1",
							"host": [
								"{{base_url}}ratings"
							],
							"path": [
								"1"
							]
						}
					},
					"response": []
				}
			]
		},
		{
			"name": "General Settings",
			"item": [
				{
					"name": "get Privacy Policy",
					"request": {
						"auth": {
							"type": "bearer",
							"bearer": [
								{
									"key": "token",
									"value": "{{auth_token}}",
									"type": "string"
								}
							]
						},
						"method": "GET",
						"header": [],
						"url": {
							"raw": "{{base_url}}settings/privacy-policy",
							"host": [
								"{{base_url}}settings"
							],
							"path": [
								"privacy-policy"
							]
						}
					},
					"response": []
				},
				{
					"name": "get Terms Condition",
					"request": {
						"auth": {
							"type": "bearer",
							"bearer": [
								{
									"key": "token",
									"value": "{{auth_token}}",
									"type": "string"
								}
							]
						},
						"method": "GET",
						"header": [],
						"url": {
							"raw": "{{base_url}}settings/terms-condition",
							"host": [
								"{{base_url}}settings"
							],
							"path": [
								"terms-condition"
							]
						}
					},
					"response": []
				},
				{
					"name": "FAQS",
					"request": {
						"method": "GET",
						"header": [],
						"url": {
							"raw": "{{base_url}}faqs",
							"host": [
								"{{base_url}}faqs"
							]
						}
					},
					"response": []
				}
			]
		}
	],
	"event": [
		{
			"listen": "prerequest",
			"script": {
				"type": "text/javascript",
				"exec": [
					""
				]
			}
		},
		{
			"listen": "test",
			"script": {
				"type": "text/javascript",
				"exec": [
					""
				]
			}
		}
	],
	"variable": [
		{
			"key": "base_url",
			"value": "http://127.0.0.1:8000/api/",
			"type": "default"
		},
		{
			"key": "auth_token",
			"value": "eyJ0eXAiOiJKV1QiLCJhbGciOiJSUzI1NiJ9.eyJhdWQiOiIzIiwianRpIjoiYjc0N2VjYzI0NTQ4NThmZTZlYjg2NGRiOTU5OGFhNWJmODc5MTg4NTdmZGM2OGUwM2ZmZDczMmE4ZTYwMDNjOTQyYTA2MDMyNjM4MmQwOTUiLCJpYXQiOjE2NzczMjYzMTIuNTYzNDEyLCJuYmYiOjE2NzczMjYzMTIuNTYzNDE1LCJleHAiOjE2OTI5NjQ3MTIuMTIyMzYyLCJzdWIiOiI0Iiwic2NvcGVzIjpbXX0.Qm39eJgpctsHtnWyJy5r1KqslTExQbFZa0edVT4Dl4xDGS7UJrdb4HWdOQbnL3iBrROziv3SAHV21yjxsxo1Xo1Na6OqpA_dMM8H_caSyO-KiCRWdwlhFxI4okVHFZrPLBmq65OZ-CFX-u6i89vfqWOvLUGFKds8wMeQcSOcah9l0sS9UHl15lAHwVMJrEqvxQ-qdI1j9RDg4Di5BRcWIBvMYOGo4ovMCJimOkIrqmsfMQajbxNaNTiS1qg-aJK1jfa8Zkbk2WYXMYjD0qK0jrZBSpPW8v5DrwFp8DeVJ9haOSo0TvXjg7I5u0ePD_hJiCezLaTMcEhOoNBGxM2fa6hPS-kyXAwcd13sQEFt94jOyoTzCrJkA29fOy6F-7281k9qN1DN_0hGbKuQr-7TC4CjpJOgnzOtQnV6UNT5bureamTlkfxpQ8vZo6rXJzgZE2zXW8DgHkPQN6p5hXr2tM7NghXVI99_mc0hwbztcG4R8uP2XgKPKiWEliRbp6OETtbgAhRcsJkBtu4tGcEDZdLAvHgqBLGCUR0OitUKpBMlyKWs6DZAoNG9EsHZLFIhg7ILqTijEA_yYEtTEaC9KZ4vsh75c_2WGO4Xx-bhJyn02yIU3rHPYSuPTxckC4B_SYH1sGhohNT5JcFX01lCe_Eb2tB2XXG-o3bo_1P416c",
			"type": "default"
		},
		{
			"key": "local",
			"value": "http://127.0.0.1:8000/api",
			"type": "string"
		}
	]
}
