G04 EAGLE Gerber X2 export*
%TF.Part,Single*%
%TF.FileFunction,Paste,Top*%
%TF.FilePolarity,Positive*%
%TF.GenerationSoftware,Autodesk,EAGLE,8.6.3*%
%TF.CreationDate,2018-03-21T20:53:09Z*%
G75*
%MOMM*%
%FSLAX34Y34*%
%LPD*%
%AMOC8*
5,1,8,0,0,1.08239X$1,22.5*%
G01*
%ADD10R,1.900000X1.300000*%
%ADD11R,1.500000X1.200000*%
%ADD12R,1.200000X1.500000*%
%ADD13R,1.300000X1.500000*%
%ADD14R,0.700000X0.750000*%
%ADD15R,1.500000X1.300000*%
%ADD16R,1.500000X0.200000*%
%ADD17R,0.200000X1.500000*%
%ADD18R,0.250000X0.500000*%
%ADD19R,0.500000X0.250000*%
%ADD20R,1.000000X1.100000*%


D10*
X375300Y243500D03*
X375300Y298500D03*
X343300Y298500D03*
X343300Y243500D03*
D11*
X580600Y207800D03*
X580600Y186800D03*
D12*
X307500Y93600D03*
X286500Y93600D03*
X180200Y220600D03*
X201200Y220600D03*
X180000Y201400D03*
X201000Y201400D03*
X228500Y263600D03*
X207500Y263600D03*
D11*
X292800Y263200D03*
X292800Y284200D03*
X247800Y263200D03*
X247800Y284200D03*
D13*
X548400Y254500D03*
X567400Y254500D03*
X166400Y428000D03*
X185400Y428000D03*
D12*
X200800Y182400D03*
X179800Y182400D03*
X373500Y165100D03*
X352500Y165100D03*
D11*
X273000Y284100D03*
X273000Y263100D03*
D12*
X307600Y112000D03*
X286600Y112000D03*
D14*
X202600Y303250D03*
X202600Y317750D03*
D15*
X473400Y229600D03*
X473400Y210600D03*
X447200Y251300D03*
X447200Y232300D03*
X447200Y183300D03*
X447200Y164300D03*
D13*
X227300Y282400D03*
X208300Y282400D03*
D15*
X419900Y306600D03*
X419900Y287600D03*
X448400Y306600D03*
X448400Y287600D03*
D13*
X490100Y164100D03*
X471100Y164100D03*
D15*
X418400Y243600D03*
X418400Y224600D03*
D13*
X469100Y141600D03*
X450100Y141600D03*
X469400Y118800D03*
X450400Y118800D03*
X423100Y186200D03*
X404100Y186200D03*
X396600Y206200D03*
X377600Y206200D03*
D16*
X322000Y161300D03*
X322000Y166300D03*
X322000Y171300D03*
X322000Y176300D03*
X322000Y181300D03*
X322000Y186300D03*
X322000Y191300D03*
X322000Y196300D03*
X322000Y201300D03*
X322000Y206300D03*
X322000Y211300D03*
X322000Y216300D03*
D17*
X307000Y231300D03*
X302000Y231300D03*
X297000Y231300D03*
X292000Y231300D03*
X287000Y231300D03*
X282000Y231300D03*
X277000Y231300D03*
X272000Y231300D03*
X267000Y231300D03*
X262000Y231300D03*
X257000Y231300D03*
X252000Y231300D03*
D16*
X237000Y216300D03*
X237000Y211300D03*
X237000Y206300D03*
X237000Y201300D03*
X237000Y196300D03*
X237000Y191300D03*
X237000Y186300D03*
X237000Y181300D03*
X237000Y176300D03*
X237000Y171300D03*
X237000Y166300D03*
X237000Y161300D03*
D17*
X252000Y146300D03*
X257000Y146300D03*
X262000Y146300D03*
X267000Y146300D03*
X272000Y146300D03*
X277000Y146300D03*
X282000Y146300D03*
X287000Y146300D03*
X292000Y146300D03*
X297000Y146300D03*
X302000Y146300D03*
X307000Y146300D03*
D18*
X545200Y227500D03*
X540200Y227500D03*
X535200Y227500D03*
X530200Y227500D03*
X525200Y227500D03*
D19*
X521700Y219000D03*
X521700Y214000D03*
X521700Y209000D03*
D18*
X525200Y200500D03*
X530200Y200500D03*
X535200Y200500D03*
X540200Y200500D03*
X545200Y200500D03*
D19*
X548700Y209000D03*
X548700Y214000D03*
X548700Y219000D03*
D20*
X323600Y264300D03*
X323600Y281300D03*
X394400Y264300D03*
X394400Y281300D03*
M02*
