<?xml version="1.0" encoding="UTF-8"?>
<testsuite xmlns:xsi="http://www.w3.org/2001/XMLSchema-instance" xsi:noNamespaceSchemaLocation="https://maven.apache.org/surefire/maven-surefire-plugin/xsd/surefire-test-report-3.0.xsd" version="3.0" name="dev.shebur.quarkus.tenant.resolver.test.TenantResolverDevModeTest" time="15.454" tests="1" errors="0" skipped="0" failures="0">
  <properties>
    <property name="java.specification.version" value="17"/>
    <property name="sun.cpu.isalist" value="amd64"/>
    <property name="sun.jnu.encoding" value="Cp1252"/>
    <property name="java.class.path" value="C:\andrey.shipilov\projects\shebur.cave\quarkus-tenant-resolver\deployment\target\test-classes;C:\andrey.shipilov\projects\shebur.cave\quarkus-tenant-resolver\deployment\target\classes;C:\Users\andreyshi\.m2\repository\io\quarkus\quarkus-arc-deployment\3.0.2.Final\quarkus-arc-deployment-3.0.2.Final.jar;C:\Users\andreyshi\.m2\repository\io\quarkus\quarkus-core-deployment\3.0.2.Final\quarkus-core-deployment-3.0.2.Final.jar;C:\Users\andreyshi\.m2\repository\org\aesh\readline\2.4\readline-2.4.jar;C:\Users\andreyshi\.m2\repository\org\fusesource\jansi\jansi\2.4.0\jansi-2.4.0.jar;C:\Users\andreyshi\.m2\repository\org\aesh\aesh\2.7\aesh-2.7.jar;C:\Users\andreyshi\.m2\repository\org\apache\commons\commons-lang3\3.12.0\commons-lang3-3.12.0.jar;C:\Users\andreyshi\.m2\repository\org\wildfly\common\wildfly-common\1.5.4.Final-format-001\wildfly-common-1.5.4.Final-format-001.jar;C:\Users\andreyshi\.m2\repository\io\quarkus\gizmo\gizmo\1.6.1.Final\gizmo-1.6.1.Final.jar;C:\Users\andreyshi\.m2\repository\org\ow2\asm\asm-util\9.5\asm-util-9.5.jar;C:\Users\andreyshi\.m2\repository\org\ow2\asm\asm-analysis\9.5\asm-analysis-9.5.jar;C:\Users\andreyshi\.m2\repository\io\smallrye\jandex\3.0.5\jandex-3.0.5.jar;C:\Users\andreyshi\.m2\repository\org\ow2\asm\asm\9.5\asm-9.5.jar;C:\Users\andreyshi\.m2\repository\org\ow2\asm\asm-commons\9.5\asm-commons-9.5.jar;C:\Users\andreyshi\.m2\repository\org\ow2\asm\asm-tree\9.5\asm-tree-9.5.jar;C:\Users\andreyshi\.m2\repository\io\quarkus\quarkus-development-mode-spi\3.0.2.Final\quarkus-development-mode-spi-3.0.2.Final.jar;C:\Users\andreyshi\.m2\repository\io\quarkus\quarkus-class-change-agent\3.0.2.Final\quarkus-class-change-agent-3.0.2.Final.jar;C:\Users\andreyshi\.m2\repository\io\quarkus\quarkus-bootstrap-core\3.0.2.Final\quarkus-bootstrap-core-3.0.2.Final.jar;C:\Users\andreyshi\.m2\repository\io\quarkus\quarkus-bootstrap-app-model\3.0.2.Final\quarkus-bootstrap-app-model-3.0.2.Final.jar;C:\Users\andreyshi\.m2\repository\io\smallrye\common\smallrye-common-io\2.1.0\smallrye-common-io-2.1.0.jar;C:\Users\andreyshi\.m2\repository\org\eclipse\sisu\org.eclipse.sisu.inject\0.3.5\org.eclipse.sisu.inject-0.3.5.jar;C:\Users\andreyshi\.m2\repository\io\quarkus\quarkus-builder\3.0.2.Final\quarkus-builder-3.0.2.Final.jar;C:\Users\andreyshi\.m2\repository\org\graalvm\sdk\graal-sdk\22.3.0\graal-sdk-22.3.0.jar;C:\Users\andreyshi\.m2\repository\org\junit\platform\junit-platform-launcher\1.9.2\junit-platform-launcher-1.9.2.jar;C:\Users\andreyshi\.m2\repository\org\junit\jupiter\junit-jupiter\5.9.2\junit-jupiter-5.9.2.jar;C:\Users\andreyshi\.m2\repository\io\quarkus\quarkus-smallrye-context-propagation-spi\3.0.2.Final\quarkus-smallrye-context-propagation-spi-3.0.2.Final.jar;C:\Users\andreyshi\.m2\repository\org\eclipse\microprofile\context-propagation\microprofile-context-propagation-api\1.3\microprofile-context-propagation-api-1.3.jar;C:\Users\andreyshi\.m2\repository\io\quarkus\quarkus-vertx-http-dev-console-spi\3.0.2.Final\quarkus-vertx-http-dev-console-spi-3.0.2.Final.jar;C:\Users\andreyshi\.m2\repository\io\quarkus\quarkus-vertx-http-dev-console-runtime-spi\3.0.2.Final\quarkus-vertx-http-dev-console-runtime-spi-3.0.2.Final.jar;C:\Users\andreyshi\.m2\repository\io\quarkus\arc\arc\3.0.2.Final\arc-3.0.2.Final.jar;C:\Users\andreyshi\.m2\repository\jakarta\transaction\jakarta.transaction-api\2.0.1\jakarta.transaction-api-2.0.1.jar;C:\Users\andreyshi\.m2\repository\io\vertx\vertx-web\4.4.1\vertx-web-4.4.1.jar;C:\Users\andreyshi\.m2\repository\io\vertx\vertx-web-common\4.4.1\vertx-web-common-4.4.1.jar;C:\Users\andreyshi\.m2\repository\io\vertx\vertx-auth-common\4.4.1\vertx-auth-common-4.4.1.jar;C:\Users\andreyshi\.m2\repository\io\vertx\vertx-bridge-common\4.4.1\vertx-bridge-common-4.4.1.jar;C:\Users\andreyshi\.m2\repository\io\vertx\vertx-core\4.4.1\vertx-core-4.4.1.jar;C:\Users\andreyshi\.m2\repository\io\netty\netty-handler-proxy\4.1.90.Final\netty-handler-proxy-4.1.90.Final.jar;C:\Users\andreyshi\.m2\repository\io\netty\netty-codec-socks\4.1.90.Final\netty-codec-socks-4.1.90.Final.jar;C:\Users\andreyshi\.m2\repository\io\netty\netty-resolver-dns\4.1.90.Final\netty-resolver-dns-4.1.90.Final.jar;C:\Users\andreyshi\.m2\repository\io\netty\netty-codec-dns\4.1.90.Final\netty-codec-dns-4.1.90.Final.jar;C:\Users\andreyshi\.m2\repository\io\quarkus\quarkus-vertx-http-dev-ui-spi\3.0.2.Final\quarkus-vertx-http-dev-ui-spi-3.0.2.Final.jar;C:\Users\andreyshi\.m2\repository\io\quarkus\quarkus-arc\3.0.2.Final\quarkus-arc-3.0.2.Final.jar;C:\Users\andreyshi\.m2\repository\io\quarkus\arc\arc-processor\3.0.2.Final\arc-processor-3.0.2.Final.jar;C:\Users\andreyshi\.m2\repository\org\jboss\logging\jboss-logging\3.5.0.Final\jboss-logging-3.5.0.Final.jar;C:\Users\andreyshi\.m2\repository\jakarta\annotation\jakarta.annotation-api\2.1.1\jakarta.annotation-api-2.1.1.jar;C:\Users\andreyshi\.m2\repository\io\quarkus\quarkus-oidc-deployment\3.0.2.Final\quarkus-oidc-deployment-3.0.2.Final.jar;C:\Users\andreyshi\.m2\repository\io\quarkus\quarkus-vertx-http-deployment\3.0.2.Final\quarkus-vertx-http-deployment-3.0.2.Final.jar;C:\Users\andreyshi\.m2\repository\io\quarkus\quarkus-vertx-http\3.0.2.Final\quarkus-vertx-http-3.0.2.Final.jar;C:\Users\andreyshi\.m2\repository\io\quarkus\quarkus-credentials\3.0.2.Final\quarkus-credentials-3.0.2.Final.jar;C:\Users\andreyshi\.m2\repository\io\quarkus\security\quarkus-security\2.0.2.Final\quarkus-security-2.0.2.Final.jar;C:\Users\andreyshi\.m2\repository\io\smallrye\reactive\smallrye-mutiny-vertx-web\3.3.0\smallrye-mutiny-vertx-web-3.3.0.jar;C:\Users\andreyshi\.m2\repository\io\smallrye\reactive\smallrye-mutiny-vertx-web-common\3.3.0\smallrye-mutiny-vertx-web-common-3.3.0.jar;C:\Users\andreyshi\.m2\repository\io\smallrye\reactive\smallrye-mutiny-vertx-auth-common\3.3.0\smallrye-mutiny-vertx-auth-common-3.3.0.jar;C:\Users\andreyshi\.m2\repository\io\smallrye\reactive\smallrye-mutiny-vertx-bridge-common\3.3.0\smallrye-mutiny-vertx-bridge-common-3.3.0.jar;C:\Users\andreyshi\.m2\repository\io\smallrye\reactive\smallrye-mutiny-vertx-uri-template\3.3.0\smallrye-mutiny-vertx-uri-template-3.3.0.jar;C:\Users\andreyshi\.m2\repository\io\vertx\vertx-uri-template\4.4.1\vertx-uri-template-4.4.1.jar;C:\Users\andreyshi\.m2\repository\io\github\crac\org-crac\0.1.3\org-crac-0.1.3.jar;C:\Users\andreyshi\.m2\repository\io\quarkus\quarkus-vertx-http-deployment-spi\3.0.2.Final\quarkus-vertx-http-deployment-spi-3.0.2.Final.jar;C:\Users\andreyshi\.m2\repository\io\quarkus\quarkus-kubernetes-spi\3.0.2.Final\quarkus-kubernetes-spi-3.0.2.Final.jar;C:\Users\andreyshi\.m2\repository\io\quarkus\quarkus-vertx-http-dev-ui-resources\3.0.2.Final\quarkus-vertx-http-dev-ui-resources-3.0.2.Final.jar;C:\Users\andreyshi\.m2\repository\org\mvnpm\at\vaadin\router\1.7.5\router-1.7.5.jar;C:\Users\andreyshi\.m2\repository\org\mvnpm\path-to-regexp\2.4.0\path-to-regexp-2.4.0.jar;C:\Users\andreyshi\.m2\repository\org\mvnpm\at\vaadin\app-layout\24.0.2\app-layout-24.0.2.jar;C:\Users\andreyshi\.m2\repository\org\mvnpm\at\vaadin\avatar-group\24.0.2\avatar-group-24.0.2.jar;C:\Users\andreyshi\.m2\repository\org\mvnpm\at\vaadin\icons\24.0.2\icons-24.0.2.jar;C:\Users\andreyshi\.m2\repository\org\mvnpm\at\vaadin\login\24.0.2\login-24.0.2.jar;C:\Users\andreyshi\.m2\repository\org\mvnpm\at\vaadin\integer-field\24.0.2\integer-field-24.0.2.jar;C:\Users\andreyshi\.m2\repository\org\mvnpm\at\vaadin\accordion\24.0.2\accordion-24.0.2.jar;C:\Users\andreyshi\.m2\repository\org\mvnpm\at\vaadin\avatar\24.0.2\avatar-24.0.2.jar;C:\Users\andreyshi\.m2\repository\org\mvnpm\at\vaadin\horizontal-layout\24.0.2\horizontal-layout-24.0.2.jar;C:\Users\andreyshi\.m2\repository\org\mvnpm\at\vaadin\button\24.0.2\button-24.0.2.jar;C:\Users\andreyshi\.m2\repository\org\mvnpm\at\vaadin\combo-box\24.0.2\combo-box-24.0.2.jar;C:\Users\andreyshi\.m2\repository\org\mvnpm\at\vaadin\confirm-dialog\24.0.2\confirm-dialog-24.0.2.jar;C:\Users\andreyshi\.m2\repository\org\mvnpm\at\vaadin\checkbox\24.0.2\checkbox-24.0.2.jar;C:\Users\andreyshi\.m2\repository\org\mvnpm\at\vaadin\checkbox-group\24.0.2\checkbox-group-24.0.2.jar;C:\Users\andreyshi\.m2\repository\org\mvnpm\at\vaadin\component-base\24.0.2\component-base-24.0.2.jar;C:\Users\andreyshi\.m2\repository\org\mvnpm\at\vaadin\context-menu\24.0.2\context-menu-24.0.2.jar;C:\Users\andreyshi\.m2\repository\org\mvnpm\at\vaadin\custom-field\24.0.2\custom-field-24.0.2.jar;C:\Users\andreyshi\.m2\repository\org\mvnpm\at\vaadin\date-picker\24.0.2\date-picker-24.0.2.jar;C:\Users\andreyshi\.m2\repository\org\mvnpm\at\vaadin\date-time-picker\24.0.2\date-time-picker-24.0.2.jar;C:\Users\andreyshi\.m2\repository\org\mvnpm\at\vaadin\time-picker\24.0.2\time-picker-24.0.2.jar;C:\Users\andreyshi\.m2\repository\org\mvnpm\at\vaadin\details\24.0.2\details-24.0.2.jar;C:\Users\andreyshi\.m2\repository\org\mvnpm\at\vaadin\dialog\24.0.2\dialog-24.0.2.jar;C:\Users\andreyshi\.m2\repository\org\mvnpm\at\vaadin\email-field\24.0.2\email-field-24.0.2.jar;C:\Users\andreyshi\.m2\repository\org\mvnpm\at\vaadin\password-field\24.0.2\password-field-24.0.2.jar;C:\Users\andreyshi\.m2\repository\org\mvnpm\at\vaadin\number-field\24.0.2\number-field-24.0.2.jar;C:\Users\andreyshi\.m2\repository\org\mvnpm\at\vaadin\field-base\24.0.2\field-base-24.0.2.jar;C:\Users\andreyshi\.m2\repository\org\mvnpm\at\vaadin\grid\24.0.2\grid-24.0.2.jar;C:\Users\andreyshi\.m2\repository\org\mvnpm\at\vaadin\input-container\24.0.2\input-container-24.0.2.jar;C:\Users\andreyshi\.m2\repository\org\mvnpm\at\vaadin\item\24.0.2\item-24.0.2.jar;C:\Users\andreyshi\.m2\repository\org\mvnpm\at\vaadin\list-box\24.0.2\list-box-24.0.2.jar;C:\Users\andreyshi\.m2\repository\org\mvnpm\at\vaadin\lit-renderer\24.0.2\lit-renderer-24.0.2.jar;C:\Users\andreyshi\.m2\repository\org\mvnpm\at\vaadin\menu-bar\24.0.2\menu-bar-24.0.2.jar;C:\Users\andreyshi\.m2\repository\org\mvnpm\at\vaadin\message-list\24.0.2\message-list-24.0.2.jar;C:\Users\andreyshi\.m2\repository\org\mvnpm\at\vaadin\message-input\24.0.2\message-input-24.0.2.jar;C:\Users\andreyshi\.m2\repository\org\mvnpm\at\vaadin\multi-select-combo-box\24.0.2\multi-select-combo-box-24.0.2.jar;C:\Users\andreyshi\.m2\repository\org\mvnpm\at\vaadin\radio-group\24.0.2\radio-group-24.0.2.jar;C:\Users\andreyshi\.m2\repository\org\mvnpm\at\vaadin\overlay\24.0.2\overlay-24.0.2.jar;C:\Users\andreyshi\.m2\repository\org\mvnpm\at\vaadin\progress-bar\24.0.2\progress-bar-24.0.2.jar;C:\Users\andreyshi\.m2\repository\org\mvnpm\at\vaadin\split-layout\24.0.2\split-layout-24.0.2.jar;C:\Users\andreyshi\.m2\repository\org\mvnpm\at\vaadin\text-area\24.0.2\text-area-24.0.2.jar;C:\Users\andreyshi\.m2\repository\org\mvnpm\at\vaadin\tooltip\24.0.2\tooltip-24.0.2.jar;C:\Users\andreyshi\.m2\repository\org\mvnpm\at\vaadin\vaadin-material-styles\24.0.2\vaadin-material-styles-24.0.2.jar;C:\Users\andreyshi\.m2\repository\org\mvnpm\at\vaadin\vaadin-themable-mixin\24.0.2\vaadin-themable-mixin-24.0.2.jar;C:\Users\andreyshi\.m2\repository\org\mvnpm\at\vaadin\vertical-layout\24.0.2\vertical-layout-24.0.2.jar;C:\Users\andreyshi\.m2\repository\org\mvnpm\at\vaadin\tabs\24.0.2\tabs-24.0.2.jar;C:\Users\andreyshi\.m2\repository\org\mvnpm\at\vaadin\scroller\24.0.2\scroller-24.0.2.jar;C:\Users\andreyshi\.m2\repository\org\mvnpm\at\vaadin\text-field\24.0.2\text-field-24.0.2.jar;C:\Users\andreyshi\.m2\repository\org\mvnpm\at\vaadin\form-layout\24.0.2\form-layout-24.0.2.jar;C:\Users\andreyshi\.m2\repository\org\mvnpm\at\vaadin\tabsheet\24.0.2\tabsheet-24.0.2.jar;C:\Users\andreyshi\.m2\repository\org\mvnpm\at\vaadin\select\24.0.2\select-24.0.2.jar;C:\Users\andreyshi\.m2\repository\org\mvnpm\at\vaadin\notification\24.0.2\notification-24.0.2.jar;C:\Users\andreyshi\.m2\repository\org\mvnpm\at\vaadin\upload\24.0.2\upload-24.0.2.jar;C:\Users\andreyshi\.m2\repository\org\mvnpm\at\vaadin\virtual-list\24.0.2\virtual-list-24.0.2.jar;C:\Users\andreyshi\.m2\repository\org\mvnpm\at\vaadin\icon\24.0.2\icon-24.0.2.jar;C:\Users\andreyshi\.m2\repository\org\mvnpm\at\vaadin\vaadin-lumo-styles\24.0.2\vaadin-lumo-styles-24.0.2.jar;C:\Users\andreyshi\.m2\repository\org\mvnpm\at\vaadin\vaadin-usage-statistics\2.1.2\vaadin-usage-statistics-2.1.2.jar;C:\Users\andreyshi\.m2\repository\org\mvnpm\at\vaadin\vaadin-development-mode-detector\2.0.6\vaadin-development-mode-detector-2.0.6.jar;C:\Users\andreyshi\.m2\repository\org\mvnpm\at\polymer\polymer\3.5.1\polymer-3.5.1.jar;C:\Users\andreyshi\.m2\repository\org\mvnpm\at\webcomponents\shadycss\1.11.2\shadycss-1.11.2.jar;C:\Users\andreyshi\.m2\repository\org\mvnpm\at\open-wc\dedupe-mixin\1.3.1\dedupe-mixin-1.3.1.jar;C:\Users\andreyshi\.m2\repository\org\mvnpm\lit\2.7.2\lit-2.7.2.jar;C:\Users\andreyshi\.m2\repository\org\mvnpm\at\lit\reactive-element\1.6.1\reactive-element-1.6.1.jar;C:\Users\andreyshi\.m2\repository\org\mvnpm\lit-element\3.3.1\lit-element-3.3.1.jar;C:\Users\andreyshi\.m2\repository\org\mvnpm\lit-html\2.7.2\lit-html-2.7.2.jar;C:\Users\andreyshi\.m2\repository\org\mvnpm\at\lit-labs\ssr-dom-shim\1.1.0\ssr-dom-shim-1.1.0.jar;C:\Users\andreyshi\.m2\repository\org\mvnpm\at\types\trusted-types\2.0.3\trusted-types-2.0.3.jar;C:\Users\andreyshi\.m2\repository\org\mvnpm\lit-element-state\1.7.0\lit-element-state-1.7.0.jar;C:\Users\andreyshi\.m2\repository\org\mvnpm\echarts\5.4.2\echarts-5.4.2.jar;C:\Users\andreyshi\.m2\repository\org\mvnpm\tslib\2.3.0\tslib-2.3.0.jar;C:\Users\andreyshi\.m2\repository\org\mvnpm\zrender\5.4.3\zrender-5.4.3.jar;C:\Users\andreyshi\.m2\repository\org\mvnpm\at\vanillawc\wc-codemirror\2.1.0\wc-codemirror-2.1.0.jar;C:\Users\andreyshi\.m2\repository\org\mvnpm\es-module-shims\1.7.1\es-module-shims-1.7.1.jar;C:\Users\andreyshi\.m2\repository\org\mvnpm\importmap\1.0.8\importmap-1.0.8.jar;C:\Users\andreyshi\.m2\repository\io\quarkus\qute\qute-core\3.0.2.Final\qute-core-3.0.2.Final.jar;C:\Users\andreyshi\.m2\repository\org\yaml\snakeyaml\2.0\snakeyaml-2.0.jar;C:\Users\andreyshi\.m2\repository\com\fasterxml\jackson\core\jackson-databind\2.14.2\jackson-databind-2.14.2.jar;C:\Users\andreyshi\.m2\repository\com\fasterxml\jackson\core\jackson-annotations\2.14.2\jackson-annotations-2.14.2.jar;C:\Users\andreyshi\.m2\repository\io\quarkus\quarkus-oidc\3.0.2.Final\quarkus-oidc-3.0.2.Final.jar;C:\Users\andreyshi\.m2\repository\io\quarkus\quarkus-security\3.0.2.Final\quarkus-security-3.0.2.Final.jar;C:\Users\andreyshi\.m2\repository\io\quarkus\quarkus-jsonp\3.0.2.Final\quarkus-jsonp-3.0.2.Final.jar;C:\Users\andreyshi\.m2\repository\org\eclipse\parsson\parsson\1.1.1\parsson-1.1.1.jar;C:\Users\andreyshi\.m2\repository\jakarta\json\jakarta.json-api\2.1.1\jakarta.json-api-2.1.1.jar;C:\Users\andreyshi\.m2\repository\io\quarkus\quarkus-oidc-common\3.0.2.Final\quarkus-oidc-common-3.0.2.Final.jar;C:\Users\andreyshi\.m2\repository\io\smallrye\reactive\smallrye-mutiny-vertx-web-client\3.3.0\smallrye-mutiny-vertx-web-client-3.3.0.jar;C:\Users\andreyshi\.m2\repository\io\vertx\vertx-web-client\4.4.1\vertx-web-client-4.4.1.jar;C:\Users\andreyshi\.m2\repository\io\quarkus\quarkus-smallrye-jwt-build\3.0.2.Final\quarkus-smallrye-jwt-build-3.0.2.Final.jar;C:\Users\andreyshi\.m2\repository\io\smallrye\smallrye-jwt-build\4.2.1\smallrye-jwt-build-4.2.1.jar;C:\Users\andreyshi\.m2\repository\io\smallrye\smallrye-jwt\4.2.1\smallrye-jwt-4.2.1.jar;C:\Users\andreyshi\.m2\repository\org\eclipse\microprofile\config\microprofile-config-api\3.0.3\microprofile-config-api-3.0.3.jar;C:\Users\andreyshi\.m2\repository\org\eclipse\microprofile\jwt\microprofile-jwt-auth-api\2.1\microprofile-jwt-auth-api-2.1.jar;C:\Users\andreyshi\.m2\repository\org\bitbucket\b_c\jose4j\0.9.3\jose4j-0.9.3.jar;C:\Users\andreyshi\.m2\repository\io\smallrye\smallrye-jwt-common\4.2.1\smallrye-jwt-common-4.2.1.jar;C:\Users\andreyshi\.m2\repository\io\quarkus\quarkus-oidc-common-deployment\3.0.2.Final\quarkus-oidc-common-deployment-3.0.2.Final.jar;C:\Users\andreyshi\.m2\repository\io\quarkus\quarkus-credentials-deployment\3.0.2.Final\quarkus-credentials-deployment-3.0.2.Final.jar;C:\Users\andreyshi\.m2\repository\io\quarkus\quarkus-smallrye-jwt-build-deployment\3.0.2.Final\quarkus-smallrye-jwt-build-deployment-3.0.2.Final.jar;C:\Users\andreyshi\.m2\repository\io\quarkus\quarkus-security-deployment\3.0.2.Final\quarkus-security-deployment-3.0.2.Final.jar;C:\Users\andreyshi\.m2\repository\io\quarkus\quarkus-security-runtime-spi\3.0.2.Final\quarkus-security-runtime-spi-3.0.2.Final.jar;C:\Users\andreyshi\.m2\repository\io\quarkus\quarkus-security-spi\3.0.2.Final\quarkus-security-spi-3.0.2.Final.jar;C:\Users\andreyshi\.m2\repository\io\quarkus\quarkus-devservices-deployment\3.0.2.Final\quarkus-devservices-deployment-3.0.2.Final.jar;C:\Users\andreyshi\.m2\repository\io\quarkus\quarkus-devservices-common\3.0.2.Final\quarkus-devservices-common-3.0.2.Final.jar;C:\Users\andreyshi\.m2\repository\io\quarkus\quarkus-jsonp-deployment\3.0.2.Final\quarkus-jsonp-deployment-3.0.2.Final.jar;C:\Users\andreyshi\.m2\repository\org\keycloak\keycloak-core\21.0.2\keycloak-core-21.0.2.jar;C:\Users\andreyshi\.m2\repository\org\keycloak\keycloak-common\21.0.2\keycloak-common-21.0.2.jar;C:\Users\andreyshi\.m2\repository\com\fasterxml\jackson\core\jackson-core\2.14.2\jackson-core-2.14.2.jar;C:\Users\andreyshi\.m2\repository\org\eclipse\angus\angus-activation\2.0.0\angus-activation-2.0.0.jar;C:\Users\andreyshi\.m2\repository\jakarta\activation\jakarta.activation-api\2.1.1\jakarta.activation-api-2.1.1.jar;C:\Users\andreyshi\.m2\repository\org\testcontainers\testcontainers\1.17.6\testcontainers-1.17.6.jar;C:\Users\andreyshi\.m2\repository\org\slf4j\slf4j-api\2.0.6\slf4j-api-2.0.6.jar;C:\Users\andreyshi\.m2\repository\org\apache\commons\commons-compress\1.23.0\commons-compress-1.23.0.jar;C:\Users\andreyshi\.m2\repository\org\rnorth\duct-tape\duct-tape\1.0.8\duct-tape-1.0.8.jar;C:\Users\andreyshi\.m2\repository\org\jetbrains\annotations\24.0.1\annotations-24.0.1.jar;C:\Users\andreyshi\.m2\repository\com\github\docker-java\docker-java-api\3.2.13\docker-java-api-3.2.13.jar;C:\Users\andreyshi\.m2\repository\com\github\docker-java\docker-java-transport-zerodep\3.2.13\docker-java-transport-zerodep-3.2.13.jar;C:\Users\andreyshi\.m2\repository\com\github\docker-java\docker-java-transport\3.2.13\docker-java-transport-3.2.13.jar;C:\Users\andreyshi\.m2\repository\net\java\dev\jna\jna\5.8.0\jna-5.8.0.jar;C:\Users\andreyshi\.m2\repository\io\quarkus\quarkus-junit4-mock\3.0.2.Final\quarkus-junit4-mock-3.0.2.Final.jar;C:\Users\andreyshi\.m2\repository\io\quarkus\quarkus-vertx-deployment\3.0.2.Final\quarkus-vertx-deployment-3.0.2.Final.jar;C:\Users\andreyshi\.m2\repository\io\quarkus\quarkus-vertx\3.0.2.Final\quarkus-vertx-3.0.2.Final.jar;C:\Users\andreyshi\.m2\repository\io\netty\netty-codec-haproxy\4.1.90.Final\netty-codec-haproxy-4.1.90.Final.jar;C:\Users\andreyshi\.m2\repository\io\netty\netty-buffer\4.1.90.Final\netty-buffer-4.1.90.Final.jar;C:\Users\andreyshi\.m2\repository\io\netty\netty-transport\4.1.90.Final\netty-transport-4.1.90.Final.jar;C:\Users\andreyshi\.m2\repository\io\smallrye\common\smallrye-common-annotation\2.1.0\smallrye-common-annotation-2.1.0.jar;C:\Users\andreyshi\.m2\repository\io\smallrye\common\smallrye-common-vertx-context\2.1.0\smallrye-common-vertx-context-2.1.0.jar;C:\Users\andreyshi\.m2\repository\io\smallrye\common\smallrye-common-constraint\2.1.0\smallrye-common-constraint-2.1.0.jar;C:\Users\andreyshi\.m2\repository\io\quarkus\quarkus-vertx-latebound-mdc-provider\3.0.2.Final\quarkus-vertx-latebound-mdc-provider-3.0.2.Final.jar;C:\Users\andreyshi\.m2\repository\io\smallrye\reactive\smallrye-mutiny-vertx-core\3.3.0\smallrye-mutiny-vertx-core-3.3.0.jar;C:\Users\andreyshi\.m2\repository\io\smallrye\reactive\smallrye-mutiny-vertx-runtime\3.3.0\smallrye-mutiny-vertx-runtime-3.3.0.jar;C:\Users\andreyshi\.m2\repository\io\smallrye\reactive\vertx-mutiny-generator\3.3.0\vertx-mutiny-generator-3.3.0.jar;C:\Users\andreyshi\.m2\repository\io\vertx\vertx-codegen\4.4.1\vertx-codegen-4.4.1.jar;C:\Users\andreyshi\.m2\repository\io\smallrye\smallrye-fault-tolerance-vertx\6.2.2\smallrye-fault-tolerance-vertx-6.2.2.jar;C:\Users\andreyshi\.m2\repository\io\quarkus\quarkus-netty-deployment\3.0.2.Final\quarkus-netty-deployment-3.0.2.Final.jar;C:\Users\andreyshi\.m2\repository\io\quarkus\quarkus-netty\3.0.2.Final\quarkus-netty-3.0.2.Final.jar;C:\Users\andreyshi\.m2\repository\io\netty\netty-codec\4.1.90.Final\netty-codec-4.1.90.Final.jar;C:\Users\andreyshi\.m2\repository\io\netty\netty-common\4.1.90.Final\netty-common-4.1.90.Final.jar;C:\Users\andreyshi\.m2\repository\io\netty\netty-codec-http\4.1.90.Final\netty-codec-http-4.1.90.Final.jar;C:\Users\andreyshi\.m2\repository\io\netty\netty-codec-http2\4.1.90.Final\netty-codec-http2-4.1.90.Final.jar;C:\Users\andreyshi\.m2\repository\io\netty\netty-handler\4.1.90.Final\netty-handler-4.1.90.Final.jar;C:\Users\andreyshi\.m2\repository\io\netty\netty-resolver\4.1.90.Final\netty-resolver-4.1.90.Final.jar;C:\Users\andreyshi\.m2\repository\io\netty\netty-transport-native-unix-common\4.1.90.Final\netty-transport-native-unix-common-4.1.90.Final.jar;C:\Users\andreyshi\.m2\repository\com\aayushatharva\brotli4j\brotli4j\1.11.0\brotli4j-1.11.0.jar;C:\Users\andreyshi\.m2\repository\com\aayushatharva\brotli4j\service\1.11.0\service-1.11.0.jar;C:\Users\andreyshi\.m2\repository\com\aayushatharva\brotli4j\native-windows-x86_64\1.11.0\native-windows-x86_64-1.11.0.jar;C:\Users\andreyshi\.m2\repository\io\quarkus\quarkus-mutiny-deployment\3.0.2.Final\quarkus-mutiny-deployment-3.0.2.Final.jar;C:\Users\andreyshi\.m2\repository\io\quarkus\quarkus-smallrye-context-propagation-deployment\3.0.2.Final\quarkus-smallrye-context-propagation-deployment-3.0.2.Final.jar;C:\Users\andreyshi\.m2\repository\io\quarkus\quarkus-smallrye-context-propagation\3.0.2.Final\quarkus-smallrye-context-propagation-3.0.2.Final.jar;C:\Users\andreyshi\.m2\repository\io\smallrye\smallrye-context-propagation\2.1.0\smallrye-context-propagation-2.1.0.jar;C:\Users\andreyshi\.m2\repository\io\smallrye\smallrye-context-propagation-api\2.1.0\smallrye-context-propagation-api-2.1.0.jar;C:\Users\andreyshi\.m2\repository\io\smallrye\smallrye-context-propagation-storage\2.1.0\smallrye-context-propagation-storage-2.1.0.jar;C:\Users\andreyshi\.m2\repository\io\quarkus\quarkus-mutiny\3.0.2.Final\quarkus-mutiny-3.0.2.Final.jar;C:\Users\andreyshi\.m2\repository\io\smallrye\reactive\mutiny\2.1.0\mutiny-2.1.0.jar;C:\Users\andreyshi\.m2\repository\io\smallrye\reactive\mutiny-smallrye-context-propagation\2.1.0\mutiny-smallrye-context-propagation-2.1.0.jar;C:\andrey.shipilov\projects\shebur.cave\quarkus-tenant-resolver\runtime\target\tenant-resolver-0.1-SNAPSHOT.jar;C:\Users\andreyshi\.m2\repository\com\google\guava\guava\31.1-jre\guava-31.1-jre.jar;C:\Users\andreyshi\.m2\repository\com\google\guava\failureaccess\1.0.1\failureaccess-1.0.1.jar;C:\Users\andreyshi\.m2\repository\org\checkerframework\checker-qual\3.32.0\checker-qual-3.32.0.jar;C:\Users\andreyshi\.m2\repository\com\google\errorprone\error_prone_annotations\2.18.0\error_prone_annotations-2.18.0.jar;C:\Users\andreyshi\.m2\repository\com\google\j2objc\j2objc-annotations\1.3\j2objc-annotations-1.3.jar;C:\Users\andreyshi\.m2\repository\io\quarkus\quarkus-junit5-internal\3.0.2.Final\quarkus-junit5-internal-3.0.2.Final.jar;C:\Users\andreyshi\.m2\repository\org\jboss\shrinkwrap\shrinkwrap-api\1.2.6\shrinkwrap-api-1.2.6.jar;C:\Users\andreyshi\.m2\repository\org\jboss\shrinkwrap\shrinkwrap-spi\1.2.6\shrinkwrap-spi-1.2.6.jar;C:\Users\andreyshi\.m2\repository\org\jboss\shrinkwrap\shrinkwrap-impl-base\1.2.6\shrinkwrap-impl-base-1.2.6.jar;C:\Users\andreyshi\.m2\repository\org\junit\jupiter\junit-jupiter-api\5.9.2\junit-jupiter-api-5.9.2.jar;C:\Users\andreyshi\.m2\repository\org\opentest4j\opentest4j\1.2.0\opentest4j-1.2.0.jar;C:\Users\andreyshi\.m2\repository\org\junit\platform\junit-platform-commons\1.9.2\junit-platform-commons-1.9.2.jar;C:\Users\andreyshi\.m2\repository\org\apiguardian\apiguardian-api\1.1.2\apiguardian-api-1.1.2.jar;C:\Users\andreyshi\.m2\repository\org\junit\jupiter\junit-jupiter-params\5.9.2\junit-jupiter-params-5.9.2.jar;C:\Users\andreyshi\.m2\repository\org\junit\jupiter\junit-jupiter-engine\5.9.2\junit-jupiter-engine-5.9.2.jar;C:\Users\andreyshi\.m2\repository\org\junit\platform\junit-platform-engine\1.9.2\junit-platform-engine-1.9.2.jar;C:\Users\andreyshi\.m2\repository\io\quarkus\quarkus-core\3.0.2.Final\quarkus-core-3.0.2.Final.jar;C:\Users\andreyshi\.m2\repository\jakarta\inject\jakarta.inject-api\2.0.1\jakarta.inject-api-2.0.1.jar;C:\Users\andreyshi\.m2\repository\io\smallrye\common\smallrye-common-os\2.1.0\smallrye-common-os-2.1.0.jar;C:\Users\andreyshi\.m2\repository\io\quarkus\quarkus-ide-launcher\3.0.2.Final\quarkus-ide-launcher-3.0.2.Final.jar;C:\Users\andreyshi\.m2\repository\io\smallrye\config\smallrye-config\3.2.1\smallrye-config-3.2.1.jar;C:\Users\andreyshi\.m2\repository\io\smallrye\config\smallrye-config-core\3.2.1\smallrye-config-core-3.2.1.jar;C:\Users\andreyshi\.m2\repository\io\smallrye\common\smallrye-common-expression\2.1.0\smallrye-common-expression-2.1.0.jar;C:\Users\andreyshi\.m2\repository\io\smallrye\common\smallrye-common-function\2.1.0\smallrye-common-function-2.1.0.jar;C:\Users\andreyshi\.m2\repository\io\smallrye\common\smallrye-common-classloader\2.1.0\smallrye-common-classloader-2.1.0.jar;C:\Users\andreyshi\.m2\repository\io\smallrye\config\smallrye-config-common\3.2.1\smallrye-config-common-3.2.1.jar;C:\Users\andreyshi\.m2\repository\org\jboss\logmanager\jboss-logmanager-embedded\1.1.1\jboss-logmanager-embedded-1.1.1.jar;C:\Users\andreyshi\.m2\repository\org\jboss\logging\jboss-logging-annotations\2.2.1.Final\jboss-logging-annotations-2.2.1.Final.jar;C:\Users\andreyshi\.m2\repository\org\jboss\threads\jboss-threads\3.5.0.Final\jboss-threads-3.5.0.Final.jar;C:\Users\andreyshi\.m2\repository\org\jboss\slf4j\slf4j-jboss-logmanager\2.0.0.Final\slf4j-jboss-logmanager-2.0.0.Final.jar;C:\Users\andreyshi\.m2\repository\io\quarkus\quarkus-bootstrap-runner\3.0.2.Final\quarkus-bootstrap-runner-3.0.2.Final.jar;C:\Users\andreyshi\.m2\repository\io\quarkus\quarkus-fs-util\0.0.9\quarkus-fs-util-0.0.9.jar;C:\Users\andreyshi\.m2\repository\io\quarkus\quarkus-test-common\3.0.2.Final\quarkus-test-common-3.0.2.Final.jar;C:\Users\andreyshi\.m2\repository\io\quarkus\quarkus-bootstrap-maven-resolver\3.0.2.Final\quarkus-bootstrap-maven-resolver-3.0.2.Final.jar;C:\Users\andreyshi\.m2\repository\io\smallrye\beanbag\smallrye-beanbag-maven\1.1.0\smallrye-beanbag-maven-1.1.0.jar;C:\Users\andreyshi\.m2\repository\io\smallrye\beanbag\smallrye-beanbag-sisu\1.1.0\smallrye-beanbag-sisu-1.1.0.jar;C:\Users\andreyshi\.m2\repository\io\smallrye\beanbag\smallrye-beanbag\1.1.0\smallrye-beanbag-1.1.0.jar;C:\Users\andreyshi\.m2\repository\commons-codec\commons-codec\1.15\commons-codec-1.15.jar;C:\Users\andreyshi\.m2\repository\javax\inject\javax.inject\1\javax.inject-1.jar;C:\Users\andreyshi\.m2\repository\org\apache\httpcomponents\httpclient\4.5.14\httpclient-4.5.14.jar;C:\Users\andreyshi\.m2\repository\org\apache\httpcomponents\httpcore\4.4.16\httpcore-4.4.16.jar;C:\Users\andreyshi\.m2\repository\org\apache\maven\maven-artifact\3.9.1\maven-artifact-3.9.1.jar;C:\Users\andreyshi\.m2\repository\org\apache\maven\maven-builder-support\3.9.1\maven-builder-support-3.9.1.jar;C:\Users\andreyshi\.m2\repository\org\apache\maven\maven-model\3.9.1\maven-model-3.9.1.jar;C:\Users\andreyshi\.m2\repository\org\apache\maven\maven-model-builder\3.9.1\maven-model-builder-3.9.1.jar;C:\Users\andreyshi\.m2\repository\org\apache\maven\maven-repository-metadata\3.9.1\maven-repository-metadata-3.9.1.jar;C:\Users\andreyshi\.m2\repository\org\apache\maven\maven-settings\3.9.1\maven-settings-3.9.1.jar;C:\Users\andreyshi\.m2\repository\org\apache\maven\resolver\maven-resolver-api\1.9.7\maven-resolver-api-1.9.7.jar;C:\Users\andreyshi\.m2\repository\org\apache\maven\resolver\maven-resolver-impl\1.9.7\maven-resolver-impl-1.9.7.jar;C:\Users\andreyshi\.m2\repository\org\apache\maven\resolver\maven-resolver-named-locks\1.9.7\maven-resolver-named-locks-1.9.7.jar;C:\Users\andreyshi\.m2\repository\org\apache\maven\resolver\maven-resolver-spi\1.9.7\maven-resolver-spi-1.9.7.jar;C:\Users\andreyshi\.m2\repository\org\apache\maven\resolver\maven-resolver-util\1.9.7\maven-resolver-util-1.9.7.jar;C:\Users\andreyshi\.m2\repository\org\apache\maven\wagon\wagon-provider-api\3.5.3\wagon-provider-api-3.5.3.jar;C:\Users\andreyshi\.m2\repository\org\apache\maven\wagon\wagon-http-lightweight\3.5.3\wagon-http-lightweight-3.5.3.jar;C:\Users\andreyshi\.m2\repository\org\apache\maven\wagon\wagon-http-shared\3.5.3\wagon-http-shared-3.5.3.jar;C:\Users\andreyshi\.m2\repository\org\codehaus\plexus\plexus-interpolation\1.26\plexus-interpolation-1.26.jar;C:\Users\andreyshi\.m2\repository\org\codehaus\plexus\plexus-utils\3.5.1\plexus-utils-3.5.1.jar;C:\Users\andreyshi\.m2\repository\org\sonatype\plexus\plexus-cipher\1.7\plexus-cipher-1.7.jar;C:\Users\andreyshi\.m2\repository\org\sonatype\plexus\plexus-sec-dispatcher\1.4\plexus-sec-dispatcher-1.4.jar;C:\Users\andreyshi\.m2\repository\org\apache\maven\maven-embedder\3.9.1\maven-embedder-3.9.1.jar;C:\Users\andreyshi\.m2\repository\org\apache\maven\maven-core\3.9.1\maven-core-3.9.1.jar;C:\Users\andreyshi\.m2\repository\org\codehaus\plexus\plexus-component-annotations\2.1.0\plexus-component-annotations-2.1.0.jar;C:\Users\andreyshi\.m2\repository\org\apache\maven\maven-plugin-api\3.9.1\maven-plugin-api-3.9.1.jar;C:\Users\andreyshi\.m2\repository\org\apache\maven\shared\maven-shared-utils\3.3.4\maven-shared-utils-3.3.4.jar;C:\Users\andreyshi\.m2\repository\com\google\inject\guice\5.1.0\guice-5.1.0.jar;C:\Users\andreyshi\.m2\repository\aopalliance\aopalliance\1.0\aopalliance-1.0.jar;C:\Users\andreyshi\.m2\repository\javax\annotation\javax.annotation-api\1.3.2\javax.annotation-api-1.3.2.jar;C:\Users\andreyshi\.m2\repository\org\codehaus\plexus\plexus-classworlds\2.6.0\plexus-classworlds-2.6.0.jar;C:\Users\andreyshi\.m2\repository\org\codehaus\plexus\plexus-sec-dispatcher\2.0\plexus-sec-dispatcher-2.0.jar;C:\Users\andreyshi\.m2\repository\org\codehaus\plexus\plexus-cipher\2.0\plexus-cipher-2.0.jar;C:\Users\andreyshi\.m2\repository\commons-cli\commons-cli\1.4\commons-cli-1.4.jar;C:\Users\andreyshi\.m2\repository\org\eclipse\sisu\org.eclipse.sisu.plexus\0.3.5\org.eclipse.sisu.plexus-0.3.5.jar;C:\Users\andreyshi\.m2\repository\org\apache\maven\maven-settings-builder\3.9.1\maven-settings-builder-3.9.1.jar;C:\Users\andreyshi\.m2\repository\org\apache\maven\maven-resolver-provider\3.9.1\maven-resolver-provider-3.9.1.jar;C:\Users\andreyshi\.m2\repository\org\apache\maven\resolver\maven-resolver-connector-basic\1.9.7\maven-resolver-connector-basic-1.9.7.jar;C:\Users\andreyshi\.m2\repository\org\apache\maven\resolver\maven-resolver-transport-wagon\1.9.7\maven-resolver-transport-wagon-1.9.7.jar;C:\Users\andreyshi\.m2\repository\org\apache\maven\wagon\wagon-http\3.5.3\wagon-http-3.5.3.jar;C:\Users\andreyshi\.m2\repository\org\apache\maven\wagon\wagon-file\3.5.3\wagon-file-3.5.3.jar;C:\Users\andreyshi\.m2\repository\io\quarkus\quarkus-bootstrap-gradle-resolver\3.0.2.Final\quarkus-bootstrap-gradle-resolver-3.0.2.Final.jar;C:\Users\andreyshi\.m2\repository\commons-io\commons-io\2.11.0\commons-io-2.11.0.jar;C:\Users\andreyshi\.m2\repository\org\jboss\logging\commons-logging-jboss-logging\1.0.0.Final\commons-logging-jboss-logging-1.0.0.Final.jar;C:\Users\andreyshi\.m2\repository\jakarta\enterprise\jakarta.enterprise.cdi-api\4.0.1\jakarta.enterprise.cdi-api-4.0.1.jar;C:\Users\andreyshi\.m2\repository\jakarta\enterprise\jakarta.enterprise.lang-model\4.0.1\jakarta.enterprise.lang-model-4.0.1.jar;C:\Users\andreyshi\.m2\repository\jakarta\el\jakarta.el-api\5.0.1\jakarta.el-api-5.0.1.jar;C:\Users\andreyshi\.m2\repository\jakarta\interceptor\jakarta.interceptor-api\2.1.0\jakarta.interceptor-api-2.1.0.jar;C:\Users\andreyshi\.m2\repository\io\quarkus\quarkus-devtools-utilities\3.0.2.Final\quarkus-devtools-utilities-3.0.2.Final.jar;C:\Users\andreyshi\.m2\repository\org\awaitility\awaitility\4.2.0\awaitility-4.2.0.jar;C:\Users\andreyshi\.m2\repository\org\hamcrest\hamcrest\2.1\hamcrest-2.1.jar;"/>
    <property name="java.vm.vendor" value="Amazon.com Inc."/>
    <property name="sun.arch.data.model" value="64"/>
    <property name="user.variant" value=""/>
    <property name="java.vendor.url" value="https://aws.amazon.com/corretto/"/>
    <property name="user.timezone" value="Europe/Helsinki"/>
    <property name="user.country.format" value="FI"/>
    <property name="logging.initial-configurator.min-level" value="500"/>
    <property name="os.name" value="Windows 11"/>
    <property name="java.vm.specification.version" value="17"/>
    <property name="sun.java.launcher" value="SUN_STANDARD"/>
    <property name="user.country" value="US"/>
    <property name="sun.boot.library.path" value="C:\Users\andreyshi\.jdks\corretto-17.0.6\bin"/>
    <property name="sun.java.command" value="C:\Users\andreyshi\AppData\Local\Temp\surefire17940764677339221454\surefirebooter-20230512225209351_8.jar C:\Users\andreyshi\AppData\Local\Temp\surefire17940764677339221454 2023-05-12T22-51-49_042-jvmRun1 surefire-20230512225209351_6tmp surefire_1-20230512225209351_7tmp"/>
    <property name="jdk.debug" value="release"/>
    <property name="maven.home" value="C:\Program Files\JetBrains\IntelliJ IDEA 2022.2.2\plugins\maven\lib\maven3"/>
    <property name="surefire.test.class.path" value="C:\andrey.shipilov\projects\shebur.cave\quarkus-tenant-resolver\deployment\target\test-classes;C:\andrey.shipilov\projects\shebur.cave\quarkus-tenant-resolver\deployment\target\classes;C:\Users\andreyshi\.m2\repository\io\quarkus\quarkus-arc-deployment\3.0.2.Final\quarkus-arc-deployment-3.0.2.Final.jar;C:\Users\andreyshi\.m2\repository\io\quarkus\quarkus-core-deployment\3.0.2.Final\quarkus-core-deployment-3.0.2.Final.jar;C:\Users\andreyshi\.m2\repository\org\aesh\readline\2.4\readline-2.4.jar;C:\Users\andreyshi\.m2\repository\org\fusesource\jansi\jansi\2.4.0\jansi-2.4.0.jar;C:\Users\andreyshi\.m2\repository\org\aesh\aesh\2.7\aesh-2.7.jar;C:\Users\andreyshi\.m2\repository\org\apache\commons\commons-lang3\3.12.0\commons-lang3-3.12.0.jar;C:\Users\andreyshi\.m2\repository\org\wildfly\common\wildfly-common\1.5.4.Final-format-001\wildfly-common-1.5.4.Final-format-001.jar;C:\Users\andreyshi\.m2\repository\io\quarkus\gizmo\gizmo\1.6.1.Final\gizmo-1.6.1.Final.jar;C:\Users\andreyshi\.m2\repository\org\ow2\asm\asm-util\9.5\asm-util-9.5.jar;C:\Users\andreyshi\.m2\repository\org\ow2\asm\asm-analysis\9.5\asm-analysis-9.5.jar;C:\Users\andreyshi\.m2\repository\io\smallrye\jandex\3.0.5\jandex-3.0.5.jar;C:\Users\andreyshi\.m2\repository\org\ow2\asm\asm\9.5\asm-9.5.jar;C:\Users\andreyshi\.m2\repository\org\ow2\asm\asm-commons\9.5\asm-commons-9.5.jar;C:\Users\andreyshi\.m2\repository\org\ow2\asm\asm-tree\9.5\asm-tree-9.5.jar;C:\Users\andreyshi\.m2\repository\io\quarkus\quarkus-development-mode-spi\3.0.2.Final\quarkus-development-mode-spi-3.0.2.Final.jar;C:\Users\andreyshi\.m2\repository\io\quarkus\quarkus-class-change-agent\3.0.2.Final\quarkus-class-change-agent-3.0.2.Final.jar;C:\Users\andreyshi\.m2\repository\io\quarkus\quarkus-bootstrap-core\3.0.2.Final\quarkus-bootstrap-core-3.0.2.Final.jar;C:\Users\andreyshi\.m2\repository\io\quarkus\quarkus-bootstrap-app-model\3.0.2.Final\quarkus-bootstrap-app-model-3.0.2.Final.jar;C:\Users\andreyshi\.m2\repository\io\smallrye\common\smallrye-common-io\2.1.0\smallrye-common-io-2.1.0.jar;C:\Users\andreyshi\.m2\repository\org\eclipse\sisu\org.eclipse.sisu.inject\0.3.5\org.eclipse.sisu.inject-0.3.5.jar;C:\Users\andreyshi\.m2\repository\io\quarkus\quarkus-builder\3.0.2.Final\quarkus-builder-3.0.2.Final.jar;C:\Users\andreyshi\.m2\repository\org\graalvm\sdk\graal-sdk\22.3.0\graal-sdk-22.3.0.jar;C:\Users\andreyshi\.m2\repository\org\junit\platform\junit-platform-launcher\1.9.2\junit-platform-launcher-1.9.2.jar;C:\Users\andreyshi\.m2\repository\org\junit\jupiter\junit-jupiter\5.9.2\junit-jupiter-5.9.2.jar;C:\Users\andreyshi\.m2\repository\io\quarkus\quarkus-smallrye-context-propagation-spi\3.0.2.Final\quarkus-smallrye-context-propagation-spi-3.0.2.Final.jar;C:\Users\andreyshi\.m2\repository\org\eclipse\microprofile\context-propagation\microprofile-context-propagation-api\1.3\microprofile-context-propagation-api-1.3.jar;C:\Users\andreyshi\.m2\repository\io\quarkus\quarkus-vertx-http-dev-console-spi\3.0.2.Final\quarkus-vertx-http-dev-console-spi-3.0.2.Final.jar;C:\Users\andreyshi\.m2\repository\io\quarkus\quarkus-vertx-http-dev-console-runtime-spi\3.0.2.Final\quarkus-vertx-http-dev-console-runtime-spi-3.0.2.Final.jar;C:\Users\andreyshi\.m2\repository\io\quarkus\arc\arc\3.0.2.Final\arc-3.0.2.Final.jar;C:\Users\andreyshi\.m2\repository\jakarta\transaction\jakarta.transaction-api\2.0.1\jakarta.transaction-api-2.0.1.jar;C:\Users\andreyshi\.m2\repository\io\vertx\vertx-web\4.4.1\vertx-web-4.4.1.jar;C:\Users\andreyshi\.m2\repository\io\vertx\vertx-web-common\4.4.1\vertx-web-common-4.4.1.jar;C:\Users\andreyshi\.m2\repository\io\vertx\vertx-auth-common\4.4.1\vertx-auth-common-4.4.1.jar;C:\Users\andreyshi\.m2\repository\io\vertx\vertx-bridge-common\4.4.1\vertx-bridge-common-4.4.1.jar;C:\Users\andreyshi\.m2\repository\io\vertx\vertx-core\4.4.1\vertx-core-4.4.1.jar;C:\Users\andreyshi\.m2\repository\io\netty\netty-handler-proxy\4.1.90.Final\netty-handler-proxy-4.1.90.Final.jar;C:\Users\andreyshi\.m2\repository\io\netty\netty-codec-socks\4.1.90.Final\netty-codec-socks-4.1.90.Final.jar;C:\Users\andreyshi\.m2\repository\io\netty\netty-resolver-dns\4.1.90.Final\netty-resolver-dns-4.1.90.Final.jar;C:\Users\andreyshi\.m2\repository\io\netty\netty-codec-dns\4.1.90.Final\netty-codec-dns-4.1.90.Final.jar;C:\Users\andreyshi\.m2\repository\io\quarkus\quarkus-vertx-http-dev-ui-spi\3.0.2.Final\quarkus-vertx-http-dev-ui-spi-3.0.2.Final.jar;C:\Users\andreyshi\.m2\repository\io\quarkus\quarkus-arc\3.0.2.Final\quarkus-arc-3.0.2.Final.jar;C:\Users\andreyshi\.m2\repository\io\quarkus\arc\arc-processor\3.0.2.Final\arc-processor-3.0.2.Final.jar;C:\Users\andreyshi\.m2\repository\org\jboss\logging\jboss-logging\3.5.0.Final\jboss-logging-3.5.0.Final.jar;C:\Users\andreyshi\.m2\repository\jakarta\annotation\jakarta.annotation-api\2.1.1\jakarta.annotation-api-2.1.1.jar;C:\Users\andreyshi\.m2\repository\io\quarkus\quarkus-oidc-deployment\3.0.2.Final\quarkus-oidc-deployment-3.0.2.Final.jar;C:\Users\andreyshi\.m2\repository\io\quarkus\quarkus-vertx-http-deployment\3.0.2.Final\quarkus-vertx-http-deployment-3.0.2.Final.jar;C:\Users\andreyshi\.m2\repository\io\quarkus\quarkus-vertx-http\3.0.2.Final\quarkus-vertx-http-3.0.2.Final.jar;C:\Users\andreyshi\.m2\repository\io\quarkus\quarkus-credentials\3.0.2.Final\quarkus-credentials-3.0.2.Final.jar;C:\Users\andreyshi\.m2\repository\io\quarkus\security\quarkus-security\2.0.2.Final\quarkus-security-2.0.2.Final.jar;C:\Users\andreyshi\.m2\repository\io\smallrye\reactive\smallrye-mutiny-vertx-web\3.3.0\smallrye-mutiny-vertx-web-3.3.0.jar;C:\Users\andreyshi\.m2\repository\io\smallrye\reactive\smallrye-mutiny-vertx-web-common\3.3.0\smallrye-mutiny-vertx-web-common-3.3.0.jar;C:\Users\andreyshi\.m2\repository\io\smallrye\reactive\smallrye-mutiny-vertx-auth-common\3.3.0\smallrye-mutiny-vertx-auth-common-3.3.0.jar;C:\Users\andreyshi\.m2\repository\io\smallrye\reactive\smallrye-mutiny-vertx-bridge-common\3.3.0\smallrye-mutiny-vertx-bridge-common-3.3.0.jar;C:\Users\andreyshi\.m2\repository\io\smallrye\reactive\smallrye-mutiny-vertx-uri-template\3.3.0\smallrye-mutiny-vertx-uri-template-3.3.0.jar;C:\Users\andreyshi\.m2\repository\io\vertx\vertx-uri-template\4.4.1\vertx-uri-template-4.4.1.jar;C:\Users\andreyshi\.m2\repository\io\github\crac\org-crac\0.1.3\org-crac-0.1.3.jar;C:\Users\andreyshi\.m2\repository\io\quarkus\quarkus-vertx-http-deployment-spi\3.0.2.Final\quarkus-vertx-http-deployment-spi-3.0.2.Final.jar;C:\Users\andreyshi\.m2\repository\io\quarkus\quarkus-kubernetes-spi\3.0.2.Final\quarkus-kubernetes-spi-3.0.2.Final.jar;C:\Users\andreyshi\.m2\repository\io\quarkus\quarkus-vertx-http-dev-ui-resources\3.0.2.Final\quarkus-vertx-http-dev-ui-resources-3.0.2.Final.jar;C:\Users\andreyshi\.m2\repository\org\mvnpm\at\vaadin\router\1.7.5\router-1.7.5.jar;C:\Users\andreyshi\.m2\repository\org\mvnpm\path-to-regexp\2.4.0\path-to-regexp-2.4.0.jar;C:\Users\andreyshi\.m2\repository\org\mvnpm\at\vaadin\app-layout\24.0.2\app-layout-24.0.2.jar;C:\Users\andreyshi\.m2\repository\org\mvnpm\at\vaadin\avatar-group\24.0.2\avatar-group-24.0.2.jar;C:\Users\andreyshi\.m2\repository\org\mvnpm\at\vaadin\icons\24.0.2\icons-24.0.2.jar;C:\Users\andreyshi\.m2\repository\org\mvnpm\at\vaadin\login\24.0.2\login-24.0.2.jar;C:\Users\andreyshi\.m2\repository\org\mvnpm\at\vaadin\integer-field\24.0.2\integer-field-24.0.2.jar;C:\Users\andreyshi\.m2\repository\org\mvnpm\at\vaadin\accordion\24.0.2\accordion-24.0.2.jar;C:\Users\andreyshi\.m2\repository\org\mvnpm\at\vaadin\avatar\24.0.2\avatar-24.0.2.jar;C:\Users\andreyshi\.m2\repository\org\mvnpm\at\vaadin\horizontal-layout\24.0.2\horizontal-layout-24.0.2.jar;C:\Users\andreyshi\.m2\repository\org\mvnpm\at\vaadin\button\24.0.2\button-24.0.2.jar;C:\Users\andreyshi\.m2\repository\org\mvnpm\at\vaadin\combo-box\24.0.2\combo-box-24.0.2.jar;C:\Users\andreyshi\.m2\repository\org\mvnpm\at\vaadin\confirm-dialog\24.0.2\confirm-dialog-24.0.2.jar;C:\Users\andreyshi\.m2\repository\org\mvnpm\at\vaadin\checkbox\24.0.2\checkbox-24.0.2.jar;C:\Users\andreyshi\.m2\repository\org\mvnpm\at\vaadin\checkbox-group\24.0.2\checkbox-group-24.0.2.jar;C:\Users\andreyshi\.m2\repository\org\mvnpm\at\vaadin\component-base\24.0.2\component-base-24.0.2.jar;C:\Users\andreyshi\.m2\repository\org\mvnpm\at\vaadin\context-menu\24.0.2\context-menu-24.0.2.jar;C:\Users\andreyshi\.m2\repository\org\mvnpm\at\vaadin\custom-field\24.0.2\custom-field-24.0.2.jar;C:\Users\andreyshi\.m2\repository\org\mvnpm\at\vaadin\date-picker\24.0.2\date-picker-24.0.2.jar;C:\Users\andreyshi\.m2\repository\org\mvnpm\at\vaadin\date-time-picker\24.0.2\date-time-picker-24.0.2.jar;C:\Users\andreyshi\.m2\repository\org\mvnpm\at\vaadin\time-picker\24.0.2\time-picker-24.0.2.jar;C:\Users\andreyshi\.m2\repository\org\mvnpm\at\vaadin\details\24.0.2\details-24.0.2.jar;C:\Users\andreyshi\.m2\repository\org\mvnpm\at\vaadin\dialog\24.0.2\dialog-24.0.2.jar;C:\Users\andreyshi\.m2\repository\org\mvnpm\at\vaadin\email-field\24.0.2\email-field-24.0.2.jar;C:\Users\andreyshi\.m2\repository\org\mvnpm\at\vaadin\password-field\24.0.2\password-field-24.0.2.jar;C:\Users\andreyshi\.m2\repository\org\mvnpm\at\vaadin\number-field\24.0.2\number-field-24.0.2.jar;C:\Users\andreyshi\.m2\repository\org\mvnpm\at\vaadin\field-base\24.0.2\field-base-24.0.2.jar;C:\Users\andreyshi\.m2\repository\org\mvnpm\at\vaadin\grid\24.0.2\grid-24.0.2.jar;C:\Users\andreyshi\.m2\repository\org\mvnpm\at\vaadin\input-container\24.0.2\input-container-24.0.2.jar;C:\Users\andreyshi\.m2\repository\org\mvnpm\at\vaadin\item\24.0.2\item-24.0.2.jar;C:\Users\andreyshi\.m2\repository\org\mvnpm\at\vaadin\list-box\24.0.2\list-box-24.0.2.jar;C:\Users\andreyshi\.m2\repository\org\mvnpm\at\vaadin\lit-renderer\24.0.2\lit-renderer-24.0.2.jar;C:\Users\andreyshi\.m2\repository\org\mvnpm\at\vaadin\menu-bar\24.0.2\menu-bar-24.0.2.jar;C:\Users\andreyshi\.m2\repository\org\mvnpm\at\vaadin\message-list\24.0.2\message-list-24.0.2.jar;C:\Users\andreyshi\.m2\repository\org\mvnpm\at\vaadin\message-input\24.0.2\message-input-24.0.2.jar;C:\Users\andreyshi\.m2\repository\org\mvnpm\at\vaadin\multi-select-combo-box\24.0.2\multi-select-combo-box-24.0.2.jar;C:\Users\andreyshi\.m2\repository\org\mvnpm\at\vaadin\radio-group\24.0.2\radio-group-24.0.2.jar;C:\Users\andreyshi\.m2\repository\org\mvnpm\at\vaadin\overlay\24.0.2\overlay-24.0.2.jar;C:\Users\andreyshi\.m2\repository\org\mvnpm\at\vaadin\progress-bar\24.0.2\progress-bar-24.0.2.jar;C:\Users\andreyshi\.m2\repository\org\mvnpm\at\vaadin\split-layout\24.0.2\split-layout-24.0.2.jar;C:\Users\andreyshi\.m2\repository\org\mvnpm\at\vaadin\text-area\24.0.2\text-area-24.0.2.jar;C:\Users\andreyshi\.m2\repository\org\mvnpm\at\vaadin\tooltip\24.0.2\tooltip-24.0.2.jar;C:\Users\andreyshi\.m2\repository\org\mvnpm\at\vaadin\vaadin-material-styles\24.0.2\vaadin-material-styles-24.0.2.jar;C:\Users\andreyshi\.m2\repository\org\mvnpm\at\vaadin\vaadin-themable-mixin\24.0.2\vaadin-themable-mixin-24.0.2.jar;C:\Users\andreyshi\.m2\repository\org\mvnpm\at\vaadin\vertical-layout\24.0.2\vertical-layout-24.0.2.jar;C:\Users\andreyshi\.m2\repository\org\mvnpm\at\vaadin\tabs\24.0.2\tabs-24.0.2.jar;C:\Users\andreyshi\.m2\repository\org\mvnpm\at\vaadin\scroller\24.0.2\scroller-24.0.2.jar;C:\Users\andreyshi\.m2\repository\org\mvnpm\at\vaadin\text-field\24.0.2\text-field-24.0.2.jar;C:\Users\andreyshi\.m2\repository\org\mvnpm\at\vaadin\form-layout\24.0.2\form-layout-24.0.2.jar;C:\Users\andreyshi\.m2\repository\org\mvnpm\at\vaadin\tabsheet\24.0.2\tabsheet-24.0.2.jar;C:\Users\andreyshi\.m2\repository\org\mvnpm\at\vaadin\select\24.0.2\select-24.0.2.jar;C:\Users\andreyshi\.m2\repository\org\mvnpm\at\vaadin\notification\24.0.2\notification-24.0.2.jar;C:\Users\andreyshi\.m2\repository\org\mvnpm\at\vaadin\upload\24.0.2\upload-24.0.2.jar;C:\Users\andreyshi\.m2\repository\org\mvnpm\at\vaadin\virtual-list\24.0.2\virtual-list-24.0.2.jar;C:\Users\andreyshi\.m2\repository\org\mvnpm\at\vaadin\icon\24.0.2\icon-24.0.2.jar;C:\Users\andreyshi\.m2\repository\org\mvnpm\at\vaadin\vaadin-lumo-styles\24.0.2\vaadin-lumo-styles-24.0.2.jar;C:\Users\andreyshi\.m2\repository\org\mvnpm\at\vaadin\vaadin-usage-statistics\2.1.2\vaadin-usage-statistics-2.1.2.jar;C:\Users\andreyshi\.m2\repository\org\mvnpm\at\vaadin\vaadin-development-mode-detector\2.0.6\vaadin-development-mode-detector-2.0.6.jar;C:\Users\andreyshi\.m2\repository\org\mvnpm\at\polymer\polymer\3.5.1\polymer-3.5.1.jar;C:\Users\andreyshi\.m2\repository\org\mvnpm\at\webcomponents\shadycss\1.11.2\shadycss-1.11.2.jar;C:\Users\andreyshi\.m2\repository\org\mvnpm\at\open-wc\dedupe-mixin\1.3.1\dedupe-mixin-1.3.1.jar;C:\Users\andreyshi\.m2\repository\org\mvnpm\lit\2.7.2\lit-2.7.2.jar;C:\Users\andreyshi\.m2\repository\org\mvnpm\at\lit\reactive-element\1.6.1\reactive-element-1.6.1.jar;C:\Users\andreyshi\.m2\repository\org\mvnpm\lit-element\3.3.1\lit-element-3.3.1.jar;C:\Users\andreyshi\.m2\repository\org\mvnpm\lit-html\2.7.2\lit-html-2.7.2.jar;C:\Users\andreyshi\.m2\repository\org\mvnpm\at\lit-labs\ssr-dom-shim\1.1.0\ssr-dom-shim-1.1.0.jar;C:\Users\andreyshi\.m2\repository\org\mvnpm\at\types\trusted-types\2.0.3\trusted-types-2.0.3.jar;C:\Users\andreyshi\.m2\repository\org\mvnpm\lit-element-state\1.7.0\lit-element-state-1.7.0.jar;C:\Users\andreyshi\.m2\repository\org\mvnpm\echarts\5.4.2\echarts-5.4.2.jar;C:\Users\andreyshi\.m2\repository\org\mvnpm\tslib\2.3.0\tslib-2.3.0.jar;C:\Users\andreyshi\.m2\repository\org\mvnpm\zrender\5.4.3\zrender-5.4.3.jar;C:\Users\andreyshi\.m2\repository\org\mvnpm\at\vanillawc\wc-codemirror\2.1.0\wc-codemirror-2.1.0.jar;C:\Users\andreyshi\.m2\repository\org\mvnpm\es-module-shims\1.7.1\es-module-shims-1.7.1.jar;C:\Users\andreyshi\.m2\repository\org\mvnpm\importmap\1.0.8\importmap-1.0.8.jar;C:\Users\andreyshi\.m2\repository\io\quarkus\qute\qute-core\3.0.2.Final\qute-core-3.0.2.Final.jar;C:\Users\andreyshi\.m2\repository\org\yaml\snakeyaml\2.0\snakeyaml-2.0.jar;C:\Users\andreyshi\.m2\repository\com\fasterxml\jackson\core\jackson-databind\2.14.2\jackson-databind-2.14.2.jar;C:\Users\andreyshi\.m2\repository\com\fasterxml\jackson\core\jackson-annotations\2.14.2\jackson-annotations-2.14.2.jar;C:\Users\andreyshi\.m2\repository\io\quarkus\quarkus-oidc\3.0.2.Final\quarkus-oidc-3.0.2.Final.jar;C:\Users\andreyshi\.m2\repository\io\quarkus\quarkus-security\3.0.2.Final\quarkus-security-3.0.2.Final.jar;C:\Users\andreyshi\.m2\repository\io\quarkus\quarkus-jsonp\3.0.2.Final\quarkus-jsonp-3.0.2.Final.jar;C:\Users\andreyshi\.m2\repository\org\eclipse\parsson\parsson\1.1.1\parsson-1.1.1.jar;C:\Users\andreyshi\.m2\repository\jakarta\json\jakarta.json-api\2.1.1\jakarta.json-api-2.1.1.jar;C:\Users\andreyshi\.m2\repository\io\quarkus\quarkus-oidc-common\3.0.2.Final\quarkus-oidc-common-3.0.2.Final.jar;C:\Users\andreyshi\.m2\repository\io\smallrye\reactive\smallrye-mutiny-vertx-web-client\3.3.0\smallrye-mutiny-vertx-web-client-3.3.0.jar;C:\Users\andreyshi\.m2\repository\io\vertx\vertx-web-client\4.4.1\vertx-web-client-4.4.1.jar;C:\Users\andreyshi\.m2\repository\io\quarkus\quarkus-smallrye-jwt-build\3.0.2.Final\quarkus-smallrye-jwt-build-3.0.2.Final.jar;C:\Users\andreyshi\.m2\repository\io\smallrye\smallrye-jwt-build\4.2.1\smallrye-jwt-build-4.2.1.jar;C:\Users\andreyshi\.m2\repository\io\smallrye\smallrye-jwt\4.2.1\smallrye-jwt-4.2.1.jar;C:\Users\andreyshi\.m2\repository\org\eclipse\microprofile\config\microprofile-config-api\3.0.3\microprofile-config-api-3.0.3.jar;C:\Users\andreyshi\.m2\repository\org\eclipse\microprofile\jwt\microprofile-jwt-auth-api\2.1\microprofile-jwt-auth-api-2.1.jar;C:\Users\andreyshi\.m2\repository\org\bitbucket\b_c\jose4j\0.9.3\jose4j-0.9.3.jar;C:\Users\andreyshi\.m2\repository\io\smallrye\smallrye-jwt-common\4.2.1\smallrye-jwt-common-4.2.1.jar;C:\Users\andreyshi\.m2\repository\io\quarkus\quarkus-oidc-common-deployment\3.0.2.Final\quarkus-oidc-common-deployment-3.0.2.Final.jar;C:\Users\andreyshi\.m2\repository\io\quarkus\quarkus-credentials-deployment\3.0.2.Final\quarkus-credentials-deployment-3.0.2.Final.jar;C:\Users\andreyshi\.m2\repository\io\quarkus\quarkus-smallrye-jwt-build-deployment\3.0.2.Final\quarkus-smallrye-jwt-build-deployment-3.0.2.Final.jar;C:\Users\andreyshi\.m2\repository\io\quarkus\quarkus-security-deployment\3.0.2.Final\quarkus-security-deployment-3.0.2.Final.jar;C:\Users\andreyshi\.m2\repository\io\quarkus\quarkus-security-runtime-spi\3.0.2.Final\quarkus-security-runtime-spi-3.0.2.Final.jar;C:\Users\andreyshi\.m2\repository\io\quarkus\quarkus-security-spi\3.0.2.Final\quarkus-security-spi-3.0.2.Final.jar;C:\Users\andreyshi\.m2\repository\io\quarkus\quarkus-devservices-deployment\3.0.2.Final\quarkus-devservices-deployment-3.0.2.Final.jar;C:\Users\andreyshi\.m2\repository\io\quarkus\quarkus-devservices-common\3.0.2.Final\quarkus-devservices-common-3.0.2.Final.jar;C:\Users\andreyshi\.m2\repository\io\quarkus\quarkus-jsonp-deployment\3.0.2.Final\quarkus-jsonp-deployment-3.0.2.Final.jar;C:\Users\andreyshi\.m2\repository\org\keycloak\keycloak-core\21.0.2\keycloak-core-21.0.2.jar;C:\Users\andreyshi\.m2\repository\org\keycloak\keycloak-common\21.0.2\keycloak-common-21.0.2.jar;C:\Users\andreyshi\.m2\repository\com\fasterxml\jackson\core\jackson-core\2.14.2\jackson-core-2.14.2.jar;C:\Users\andreyshi\.m2\repository\org\eclipse\angus\angus-activation\2.0.0\angus-activation-2.0.0.jar;C:\Users\andreyshi\.m2\repository\jakarta\activation\jakarta.activation-api\2.1.1\jakarta.activation-api-2.1.1.jar;C:\Users\andreyshi\.m2\repository\org\testcontainers\testcontainers\1.17.6\testcontainers-1.17.6.jar;C:\Users\andreyshi\.m2\repository\org\slf4j\slf4j-api\2.0.6\slf4j-api-2.0.6.jar;C:\Users\andreyshi\.m2\repository\org\apache\commons\commons-compress\1.23.0\commons-compress-1.23.0.jar;C:\Users\andreyshi\.m2\repository\org\rnorth\duct-tape\duct-tape\1.0.8\duct-tape-1.0.8.jar;C:\Users\andreyshi\.m2\repository\org\jetbrains\annotations\24.0.1\annotations-24.0.1.jar;C:\Users\andreyshi\.m2\repository\com\github\docker-java\docker-java-api\3.2.13\docker-java-api-3.2.13.jar;C:\Users\andreyshi\.m2\repository\com\github\docker-java\docker-java-transport-zerodep\3.2.13\docker-java-transport-zerodep-3.2.13.jar;C:\Users\andreyshi\.m2\repository\com\github\docker-java\docker-java-transport\3.2.13\docker-java-transport-3.2.13.jar;C:\Users\andreyshi\.m2\repository\net\java\dev\jna\jna\5.8.0\jna-5.8.0.jar;C:\Users\andreyshi\.m2\repository\io\quarkus\quarkus-junit4-mock\3.0.2.Final\quarkus-junit4-mock-3.0.2.Final.jar;C:\Users\andreyshi\.m2\repository\io\quarkus\quarkus-vertx-deployment\3.0.2.Final\quarkus-vertx-deployment-3.0.2.Final.jar;C:\Users\andreyshi\.m2\repository\io\quarkus\quarkus-vertx\3.0.2.Final\quarkus-vertx-3.0.2.Final.jar;C:\Users\andreyshi\.m2\repository\io\netty\netty-codec-haproxy\4.1.90.Final\netty-codec-haproxy-4.1.90.Final.jar;C:\Users\andreyshi\.m2\repository\io\netty\netty-buffer\4.1.90.Final\netty-buffer-4.1.90.Final.jar;C:\Users\andreyshi\.m2\repository\io\netty\netty-transport\4.1.90.Final\netty-transport-4.1.90.Final.jar;C:\Users\andreyshi\.m2\repository\io\smallrye\common\smallrye-common-annotation\2.1.0\smallrye-common-annotation-2.1.0.jar;C:\Users\andreyshi\.m2\repository\io\smallrye\common\smallrye-common-vertx-context\2.1.0\smallrye-common-vertx-context-2.1.0.jar;C:\Users\andreyshi\.m2\repository\io\smallrye\common\smallrye-common-constraint\2.1.0\smallrye-common-constraint-2.1.0.jar;C:\Users\andreyshi\.m2\repository\io\quarkus\quarkus-vertx-latebound-mdc-provider\3.0.2.Final\quarkus-vertx-latebound-mdc-provider-3.0.2.Final.jar;C:\Users\andreyshi\.m2\repository\io\smallrye\reactive\smallrye-mutiny-vertx-core\3.3.0\smallrye-mutiny-vertx-core-3.3.0.jar;C:\Users\andreyshi\.m2\repository\io\smallrye\reactive\smallrye-mutiny-vertx-runtime\3.3.0\smallrye-mutiny-vertx-runtime-3.3.0.jar;C:\Users\andreyshi\.m2\repository\io\smallrye\reactive\vertx-mutiny-generator\3.3.0\vertx-mutiny-generator-3.3.0.jar;C:\Users\andreyshi\.m2\repository\io\vertx\vertx-codegen\4.4.1\vertx-codegen-4.4.1.jar;C:\Users\andreyshi\.m2\repository\io\smallrye\smallrye-fault-tolerance-vertx\6.2.2\smallrye-fault-tolerance-vertx-6.2.2.jar;C:\Users\andreyshi\.m2\repository\io\quarkus\quarkus-netty-deployment\3.0.2.Final\quarkus-netty-deployment-3.0.2.Final.jar;C:\Users\andreyshi\.m2\repository\io\quarkus\quarkus-netty\3.0.2.Final\quarkus-netty-3.0.2.Final.jar;C:\Users\andreyshi\.m2\repository\io\netty\netty-codec\4.1.90.Final\netty-codec-4.1.90.Final.jar;C:\Users\andreyshi\.m2\repository\io\netty\netty-common\4.1.90.Final\netty-common-4.1.90.Final.jar;C:\Users\andreyshi\.m2\repository\io\netty\netty-codec-http\4.1.90.Final\netty-codec-http-4.1.90.Final.jar;C:\Users\andreyshi\.m2\repository\io\netty\netty-codec-http2\4.1.90.Final\netty-codec-http2-4.1.90.Final.jar;C:\Users\andreyshi\.m2\repository\io\netty\netty-handler\4.1.90.Final\netty-handler-4.1.90.Final.jar;C:\Users\andreyshi\.m2\repository\io\netty\netty-resolver\4.1.90.Final\netty-resolver-4.1.90.Final.jar;C:\Users\andreyshi\.m2\repository\io\netty\netty-transport-native-unix-common\4.1.90.Final\netty-transport-native-unix-common-4.1.90.Final.jar;C:\Users\andreyshi\.m2\repository\com\aayushatharva\brotli4j\brotli4j\1.11.0\brotli4j-1.11.0.jar;C:\Users\andreyshi\.m2\repository\com\aayushatharva\brotli4j\service\1.11.0\service-1.11.0.jar;C:\Users\andreyshi\.m2\repository\com\aayushatharva\brotli4j\native-windows-x86_64\1.11.0\native-windows-x86_64-1.11.0.jar;C:\Users\andreyshi\.m2\repository\io\quarkus\quarkus-mutiny-deployment\3.0.2.Final\quarkus-mutiny-deployment-3.0.2.Final.jar;C:\Users\andreyshi\.m2\repository\io\quarkus\quarkus-smallrye-context-propagation-deployment\3.0.2.Final\quarkus-smallrye-context-propagation-deployment-3.0.2.Final.jar;C:\Users\andreyshi\.m2\repository\io\quarkus\quarkus-smallrye-context-propagation\3.0.2.Final\quarkus-smallrye-context-propagation-3.0.2.Final.jar;C:\Users\andreyshi\.m2\repository\io\smallrye\smallrye-context-propagation\2.1.0\smallrye-context-propagation-2.1.0.jar;C:\Users\andreyshi\.m2\repository\io\smallrye\smallrye-context-propagation-api\2.1.0\smallrye-context-propagation-api-2.1.0.jar;C:\Users\andreyshi\.m2\repository\io\smallrye\smallrye-context-propagation-storage\2.1.0\smallrye-context-propagation-storage-2.1.0.jar;C:\Users\andreyshi\.m2\repository\io\quarkus\quarkus-mutiny\3.0.2.Final\quarkus-mutiny-3.0.2.Final.jar;C:\Users\andreyshi\.m2\repository\io\smallrye\reactive\mutiny\2.1.0\mutiny-2.1.0.jar;C:\Users\andreyshi\.m2\repository\io\smallrye\reactive\mutiny-smallrye-context-propagation\2.1.0\mutiny-smallrye-context-propagation-2.1.0.jar;C:\andrey.shipilov\projects\shebur.cave\quarkus-tenant-resolver\runtime\target\tenant-resolver-0.1-SNAPSHOT.jar;C:\Users\andreyshi\.m2\repository\com\google\guava\guava\31.1-jre\guava-31.1-jre.jar;C:\Users\andreyshi\.m2\repository\com\google\guava\failureaccess\1.0.1\failureaccess-1.0.1.jar;C:\Users\andreyshi\.m2\repository\org\checkerframework\checker-qual\3.32.0\checker-qual-3.32.0.jar;C:\Users\andreyshi\.m2\repository\com\google\errorprone\error_prone_annotations\2.18.0\error_prone_annotations-2.18.0.jar;C:\Users\andreyshi\.m2\repository\com\google\j2objc\j2objc-annotations\1.3\j2objc-annotations-1.3.jar;C:\Users\andreyshi\.m2\repository\io\quarkus\quarkus-junit5-internal\3.0.2.Final\quarkus-junit5-internal-3.0.2.Final.jar;C:\Users\andreyshi\.m2\repository\org\jboss\shrinkwrap\shrinkwrap-api\1.2.6\shrinkwrap-api-1.2.6.jar;C:\Users\andreyshi\.m2\repository\org\jboss\shrinkwrap\shrinkwrap-spi\1.2.6\shrinkwrap-spi-1.2.6.jar;C:\Users\andreyshi\.m2\repository\org\jboss\shrinkwrap\shrinkwrap-impl-base\1.2.6\shrinkwrap-impl-base-1.2.6.jar;C:\Users\andreyshi\.m2\repository\org\junit\jupiter\junit-jupiter-api\5.9.2\junit-jupiter-api-5.9.2.jar;C:\Users\andreyshi\.m2\repository\org\opentest4j\opentest4j\1.2.0\opentest4j-1.2.0.jar;C:\Users\andreyshi\.m2\repository\org\junit\platform\junit-platform-commons\1.9.2\junit-platform-commons-1.9.2.jar;C:\Users\andreyshi\.m2\repository\org\apiguardian\apiguardian-api\1.1.2\apiguardian-api-1.1.2.jar;C:\Users\andreyshi\.m2\repository\org\junit\jupiter\junit-jupiter-params\5.9.2\junit-jupiter-params-5.9.2.jar;C:\Users\andreyshi\.m2\repository\org\junit\jupiter\junit-jupiter-engine\5.9.2\junit-jupiter-engine-5.9.2.jar;C:\Users\andreyshi\.m2\repository\org\junit\platform\junit-platform-engine\1.9.2\junit-platform-engine-1.9.2.jar;C:\Users\andreyshi\.m2\repository\io\quarkus\quarkus-core\3.0.2.Final\quarkus-core-3.0.2.Final.jar;C:\Users\andreyshi\.m2\repository\jakarta\inject\jakarta.inject-api\2.0.1\jakarta.inject-api-2.0.1.jar;C:\Users\andreyshi\.m2\repository\io\smallrye\common\smallrye-common-os\2.1.0\smallrye-common-os-2.1.0.jar;C:\Users\andreyshi\.m2\repository\io\quarkus\quarkus-ide-launcher\3.0.2.Final\quarkus-ide-launcher-3.0.2.Final.jar;C:\Users\andreyshi\.m2\repository\io\smallrye\config\smallrye-config\3.2.1\smallrye-config-3.2.1.jar;C:\Users\andreyshi\.m2\repository\io\smallrye\config\smallrye-config-core\3.2.1\smallrye-config-core-3.2.1.jar;C:\Users\andreyshi\.m2\repository\io\smallrye\common\smallrye-common-expression\2.1.0\smallrye-common-expression-2.1.0.jar;C:\Users\andreyshi\.m2\repository\io\smallrye\common\smallrye-common-function\2.1.0\smallrye-common-function-2.1.0.jar;C:\Users\andreyshi\.m2\repository\io\smallrye\common\smallrye-common-classloader\2.1.0\smallrye-common-classloader-2.1.0.jar;C:\Users\andreyshi\.m2\repository\io\smallrye\config\smallrye-config-common\3.2.1\smallrye-config-common-3.2.1.jar;C:\Users\andreyshi\.m2\repository\org\jboss\logmanager\jboss-logmanager-embedded\1.1.1\jboss-logmanager-embedded-1.1.1.jar;C:\Users\andreyshi\.m2\repository\org\jboss\logging\jboss-logging-annotations\2.2.1.Final\jboss-logging-annotations-2.2.1.Final.jar;C:\Users\andreyshi\.m2\repository\org\jboss\threads\jboss-threads\3.5.0.Final\jboss-threads-3.5.0.Final.jar;C:\Users\andreyshi\.m2\repository\org\jboss\slf4j\slf4j-jboss-logmanager\2.0.0.Final\slf4j-jboss-logmanager-2.0.0.Final.jar;C:\Users\andreyshi\.m2\repository\io\quarkus\quarkus-bootstrap-runner\3.0.2.Final\quarkus-bootstrap-runner-3.0.2.Final.jar;C:\Users\andreyshi\.m2\repository\io\quarkus\quarkus-fs-util\0.0.9\quarkus-fs-util-0.0.9.jar;C:\Users\andreyshi\.m2\repository\io\quarkus\quarkus-test-common\3.0.2.Final\quarkus-test-common-3.0.2.Final.jar;C:\Users\andreyshi\.m2\repository\io\quarkus\quarkus-bootstrap-maven-resolver\3.0.2.Final\quarkus-bootstrap-maven-resolver-3.0.2.Final.jar;C:\Users\andreyshi\.m2\repository\io\smallrye\beanbag\smallrye-beanbag-maven\1.1.0\smallrye-beanbag-maven-1.1.0.jar;C:\Users\andreyshi\.m2\repository\io\smallrye\beanbag\smallrye-beanbag-sisu\1.1.0\smallrye-beanbag-sisu-1.1.0.jar;C:\Users\andreyshi\.m2\repository\io\smallrye\beanbag\smallrye-beanbag\1.1.0\smallrye-beanbag-1.1.0.jar;C:\Users\andreyshi\.m2\repository\commons-codec\commons-codec\1.15\commons-codec-1.15.jar;C:\Users\andreyshi\.m2\repository\javax\inject\javax.inject\1\javax.inject-1.jar;C:\Users\andreyshi\.m2\repository\org\apache\httpcomponents\httpclient\4.5.14\httpclient-4.5.14.jar;C:\Users\andreyshi\.m2\repository\org\apache\httpcomponents\httpcore\4.4.16\httpcore-4.4.16.jar;C:\Users\andreyshi\.m2\repository\org\apache\maven\maven-artifact\3.9.1\maven-artifact-3.9.1.jar;C:\Users\andreyshi\.m2\repository\org\apache\maven\maven-builder-support\3.9.1\maven-builder-support-3.9.1.jar;C:\Users\andreyshi\.m2\repository\org\apache\maven\maven-model\3.9.1\maven-model-3.9.1.jar;C:\Users\andreyshi\.m2\repository\org\apache\maven\maven-model-builder\3.9.1\maven-model-builder-3.9.1.jar;C:\Users\andreyshi\.m2\repository\org\apache\maven\maven-repository-metadata\3.9.1\maven-repository-metadata-3.9.1.jar;C:\Users\andreyshi\.m2\repository\org\apache\maven\maven-settings\3.9.1\maven-settings-3.9.1.jar;C:\Users\andreyshi\.m2\repository\org\apache\maven\resolver\maven-resolver-api\1.9.7\maven-resolver-api-1.9.7.jar;C:\Users\andreyshi\.m2\repository\org\apache\maven\resolver\maven-resolver-impl\1.9.7\maven-resolver-impl-1.9.7.jar;C:\Users\andreyshi\.m2\repository\org\apache\maven\resolver\maven-resolver-named-locks\1.9.7\maven-resolver-named-locks-1.9.7.jar;C:\Users\andreyshi\.m2\repository\org\apache\maven\resolver\maven-resolver-spi\1.9.7\maven-resolver-spi-1.9.7.jar;C:\Users\andreyshi\.m2\repository\org\apache\maven\resolver\maven-resolver-util\1.9.7\maven-resolver-util-1.9.7.jar;C:\Users\andreyshi\.m2\repository\org\apache\maven\wagon\wagon-provider-api\3.5.3\wagon-provider-api-3.5.3.jar;C:\Users\andreyshi\.m2\repository\org\apache\maven\wagon\wagon-http-lightweight\3.5.3\wagon-http-lightweight-3.5.3.jar;C:\Users\andreyshi\.m2\repository\org\apache\maven\wagon\wagon-http-shared\3.5.3\wagon-http-shared-3.5.3.jar;C:\Users\andreyshi\.m2\repository\org\codehaus\plexus\plexus-interpolation\1.26\plexus-interpolation-1.26.jar;C:\Users\andreyshi\.m2\repository\org\codehaus\plexus\plexus-utils\3.5.1\plexus-utils-3.5.1.jar;C:\Users\andreyshi\.m2\repository\org\sonatype\plexus\plexus-cipher\1.7\plexus-cipher-1.7.jar;C:\Users\andreyshi\.m2\repository\org\sonatype\plexus\plexus-sec-dispatcher\1.4\plexus-sec-dispatcher-1.4.jar;C:\Users\andreyshi\.m2\repository\org\apache\maven\maven-embedder\3.9.1\maven-embedder-3.9.1.jar;C:\Users\andreyshi\.m2\repository\org\apache\maven\maven-core\3.9.1\maven-core-3.9.1.jar;C:\Users\andreyshi\.m2\repository\org\codehaus\plexus\plexus-component-annotations\2.1.0\plexus-component-annotations-2.1.0.jar;C:\Users\andreyshi\.m2\repository\org\apache\maven\maven-plugin-api\3.9.1\maven-plugin-api-3.9.1.jar;C:\Users\andreyshi\.m2\repository\org\apache\maven\shared\maven-shared-utils\3.3.4\maven-shared-utils-3.3.4.jar;C:\Users\andreyshi\.m2\repository\com\google\inject\guice\5.1.0\guice-5.1.0.jar;C:\Users\andreyshi\.m2\repository\aopalliance\aopalliance\1.0\aopalliance-1.0.jar;C:\Users\andreyshi\.m2\repository\javax\annotation\javax.annotation-api\1.3.2\javax.annotation-api-1.3.2.jar;C:\Users\andreyshi\.m2\repository\org\codehaus\plexus\plexus-classworlds\2.6.0\plexus-classworlds-2.6.0.jar;C:\Users\andreyshi\.m2\repository\org\codehaus\plexus\plexus-sec-dispatcher\2.0\plexus-sec-dispatcher-2.0.jar;C:\Users\andreyshi\.m2\repository\org\codehaus\plexus\plexus-cipher\2.0\plexus-cipher-2.0.jar;C:\Users\andreyshi\.m2\repository\commons-cli\commons-cli\1.4\commons-cli-1.4.jar;C:\Users\andreyshi\.m2\repository\org\eclipse\sisu\org.eclipse.sisu.plexus\0.3.5\org.eclipse.sisu.plexus-0.3.5.jar;C:\Users\andreyshi\.m2\repository\org\apache\maven\maven-settings-builder\3.9.1\maven-settings-builder-3.9.1.jar;C:\Users\andreyshi\.m2\repository\org\apache\maven\maven-resolver-provider\3.9.1\maven-resolver-provider-3.9.1.jar;C:\Users\andreyshi\.m2\repository\org\apache\maven\resolver\maven-resolver-connector-basic\1.9.7\maven-resolver-connector-basic-1.9.7.jar;C:\Users\andreyshi\.m2\repository\org\apache\maven\resolver\maven-resolver-transport-wagon\1.9.7\maven-resolver-transport-wagon-1.9.7.jar;C:\Users\andreyshi\.m2\repository\org\apache\maven\wagon\wagon-http\3.5.3\wagon-http-3.5.3.jar;C:\Users\andreyshi\.m2\repository\org\apache\maven\wagon\wagon-file\3.5.3\wagon-file-3.5.3.jar;C:\Users\andreyshi\.m2\repository\io\quarkus\quarkus-bootstrap-gradle-resolver\3.0.2.Final\quarkus-bootstrap-gradle-resolver-3.0.2.Final.jar;C:\Users\andreyshi\.m2\repository\commons-io\commons-io\2.11.0\commons-io-2.11.0.jar;C:\Users\andreyshi\.m2\repository\org\jboss\logging\commons-logging-jboss-logging\1.0.0.Final\commons-logging-jboss-logging-1.0.0.Final.jar;C:\Users\andreyshi\.m2\repository\jakarta\enterprise\jakarta.enterprise.cdi-api\4.0.1\jakarta.enterprise.cdi-api-4.0.1.jar;C:\Users\andreyshi\.m2\repository\jakarta\enterprise\jakarta.enterprise.lang-model\4.0.1\jakarta.enterprise.lang-model-4.0.1.jar;C:\Users\andreyshi\.m2\repository\jakarta\el\jakarta.el-api\5.0.1\jakarta.el-api-5.0.1.jar;C:\Users\andreyshi\.m2\repository\jakarta\interceptor\jakarta.interceptor-api\2.1.0\jakarta.interceptor-api-2.1.0.jar;C:\Users\andreyshi\.m2\repository\io\quarkus\quarkus-devtools-utilities\3.0.2.Final\quarkus-devtools-utilities-3.0.2.Final.jar;C:\Users\andreyshi\.m2\repository\org\awaitility\awaitility\4.2.0\awaitility-4.2.0.jar;C:\Users\andreyshi\.m2\repository\org\hamcrest\hamcrest\2.1\hamcrest-2.1.jar;"/>
    <property name="sun.cpu.endian" value="little"/>
    <property name="vertx.disableWebsockets" value="true"/>
    <property name="user.home" value="C:\Users\andreyshi"/>
    <property name="user.language" value="en"/>
    <property name="vertxweb.environment" value="dev"/>
    <property name="jboss.log-version" value="false"/>
    <property name="java.specification.vendor" value="Oracle Corporation"/>
    <property name="io.netty.allocator.maxOrder" value="3"/>
    <property name="java.version.date" value="2023-01-17"/>
    <property name="java.home" value="C:\Users\andreyshi\.jdks\corretto-17.0.6"/>
    <property name="file.separator" value="\"/>
    <property name="maven.repo" value="C:\Users\andreyshi\.m2\repository"/>
    <property name="basedir" value="C:\andrey.shipilov\projects\shebur.cave\quarkus-tenant-resolver\deployment"/>
    <property name="java.vm.compressedOopsMode" value="Zero based"/>
    <property name="line.separator" value="&#10;"/>
    <property name="java.vm.specification.vendor" value="Oracle Corporation"/>
    <property name="java.specification.name" value="Java Platform API Specification"/>
    <property name="java.nio.channels.DefaultThreadPool.threadFactory" value="io.quarkus.dev.io.NioThreadPoolThreadFactory"/>
    <property name="surefire.real.class.path" value="C:\Users\andreyshi\AppData\Local\Temp\surefire17940764677339221454\surefirebooter-20230512225209351_8.jar"/>
    <property name="user.script" value=""/>
    <property name="sun.management.compiler" value="HotSpot 64-Bit Tiered Compilers"/>
    <property name="java.runtime.version" value="17.0.6+10-LTS"/>
    <property name="user.name" value="andreyshi"/>
    <property name="path.separator" value=";"/>
    <property name="os.version" value="10.0"/>
    <property name="java.runtime.name" value="OpenJDK Runtime Environment"/>
    <property name="file.encoding" value="Cp1252"/>
    <property name="java.vm.name" value="OpenJDK 64-Bit Server VM"/>
    <property name="java.vendor.version" value="Corretto-17.0.6.10.1"/>
    <property name="localRepository" value="C:\Users\andreyshi\.m2\repository"/>
    <property name="java.vendor.url.bug" value="https://github.com/corretto/corretto-17/issues/"/>
    <property name="java.io.tmpdir" value="C:\Users\ANDREY~1\AppData\Local\Temp\"/>
    <property name="quarkus.log.file.path" value="target\quarkus.log"/>
    <property name="idea.version" value="2022.2.2"/>
    <property name="java.version" value="17.0.6"/>
    <property name="java.util.concurrent.ForkJoinPool.common.threadFactory" value="io.quarkus.bootstrap.forkjoin.QuarkusForkJoinWorkerThreadFactory"/>
    <property name="user.dir" value="C:\andrey.shipilov\projects\shebur.cave\quarkus-tenant-resolver\deployment"/>
    <property name="os.arch" value="amd64"/>
    <property name="java.vm.specification.name" value="Java Virtual Machine Specification"/>
    <property name="vertx.disableDnsResolver" value="true"/>
    <property name="user.language.format" value="fi"/>
    <property name="sun.os.patch.level" value=""/>
    <property name="native.encoding" value="Cp1252"/>
    <property name="java.util.logging.manager" value="org.jboss.logmanager.LogManager"/>
    <property name="java.library.path" value="C:\Users\andreyshi\.jdks\corretto-17.0.6\bin;C:\WINDOWS\Sun\Java\bin;C:\WINDOWS\system32;C:\WINDOWS;C:\WINDOWS\system32;C:\WINDOWS;C:\WINDOWS\System32\Wbem;C:\WINDOWS\System32\WindowsPowerShell\v1.0\;C:\WINDOWS\System32\OpenSSH\;C:\andrey.shipilov\apps\nvm;C:\andrey.shipilov\apps\nodejs;C:\andrey.shipilov\apps\nvm\v17.6.0;C:\andrey.shipilov\apps\awscli\;C:\Program Files\Amazon\SessionManagerPlugin\bin\;C:\Users\andreyshi\.jdks\corretto-1.8.0_362\bin;C:\andrey.shipilov\apps\python3;C:\andrey.shipilov\apps\python3\Scripts;C:\Users\andreyshi\AppData\Local\Android\Sdk\platform-tools;C:\andrey.shipilov\apps\Apache\maven\3.9.0\bin;C:\Program Files\PuTTY\;C:\andrey.shipilov\apps\php\8.1.12;C:\ProgramData\ComposerSetup\bin;C:\andrey.shipilov\apps\perl\c\bin;C:\andrey.shipilov\apps\perl\perl\site\bin;C:\andrey.shipilov\apps\perl\perl\bin;C:\andrey.shipilov\apps\GraalVM\bin;C:\andrey.shipilov\apps\hugo;C:\Program Files\dotnet\;C:\Program Files\PowerShell\7\;C:\Program Files\RedHat\Podman\;C:\ProgramData\chocolatey\bin;C:\Users\andreyshi\AppData\Local\Microsoft\WindowsApps;C:\andrey.shipilov\apps\Git\cmd;C:\andrey.shipilov\apps\Microsoft VS Code\bin;;."/>
    <property name="java.vm.info" value="mixed mode, sharing"/>
    <property name="java.vendor" value="Amazon.com Inc."/>
    <property name="vertx.disableTCCL" value="true"/>
    <property name="java.vm.version" value="17.0.6+10-LTS"/>
    <property name="sun.io.unicode.encoding" value="UnicodeLittle"/>
    <property name="io.netty.machineId" value="ba:d6:e5:41:b0:f6:38:cd"/>
    <property name="java.class.version" value="61.0"/>
  </properties>
  <testcase name="writeYourOwnDevModeTest" classname="dev.shebur.quarkus.tenant.resolver.test.TenantResolverDevModeTest" time="15.407">
    <system-out><![CDATA[&amp#27;[94mTests paused&amp#27;[39m
2023-05-12 22:52:10,835 WARN  [io.qua.boo.BootstrapAppModelFactory] (main) Expected project directory C:\Users\ANDREY~1\AppData\Local\Temp\quarkus-dev-mode-test16177137882662226690 does not match current project directory C:\andrey.shipilov\projects\shebur.cave\quarkus-tenant-resolver\deployment
2023-05-12 22:52:25,414 WARN  [io.qua.oid.com.run.OidcCommonUtils] (vert.x-eventloop-thread-1) OIDC Server is not available:: io.netty.channel.AbstractChannel$AnnotatedConnectException: Connection refused: no further information: localhost/127.0.0.1:8080
Caused by: java.net.ConnectException: Connection refused: no further information
	at java.base/sun.nio.ch.Net.pollConnect(Native Method)
	at java.base/sun.nio.ch.Net.pollConnectNow(Net.java:672)
	at java.base/sun.nio.ch.SocketChannelImpl.finishConnect(SocketChannelImpl.java:946)
	at io.netty.channel.socket.nio.NioSocketChannel.doFinishConnect(NioSocketChannel.java:337)
	at io.netty.channel.nio.AbstractNioChannel$AbstractNioUnsafe.finishConnect(AbstractNioChannel.java:334)
	at io.netty.channel.nio.NioEventLoop.processSelectedKey(NioEventLoop.java:776)
	at io.netty.channel.nio.NioEventLoop.processSelectedKeysOptimized(NioEventLoop.java:724)
	at io.netty.channel.nio.NioEventLoop.processSelectedKeys(NioEventLoop.java:650)
	at io.netty.channel.nio.NioEventLoop.run(NioEventLoop.java:562)
	at io.netty.util.concurrent.SingleThreadEventExecutor$4.run(SingleThreadEventExecutor.java:997)
	at io.netty.util.internal.ThreadExecutorMap$2.run(ThreadExecutorMap.java:74)
	at io.netty.util.concurrent.FastThreadLocalRunnable.run(FastThreadLocalRunnable.java:30)
	at java.base/java.lang.Thread.run(Thread.java:833)

2023-05-12 22:52:25,423 WARN  [io.qua.oid.run.OidcRecorder] (vert.x-eventloop-thread-1) OIDC server is not available at the 'https://localhost:8080/realms/quarkus' URL. Please make sure it is correct. Note it has to end with a realm value if you work with Keycloak, for example: 'https://localhost:8180/auth/realms/quarkus'
2023-05-12 22:52:25,423 WARN  [io.qua.oid.run.OidcRecorder] (vert.x-eventloop-thread-1) Tenant 'Default': 'OIDC Server is not available'. OIDC server is not available yet, an attempt to connect will be made duiring the first request. Access to resources protected by this tenant may fail if OIDC server will not become available
2023-05-12 22:52:25,591 INFO  [io.quarkus] (Quarkus Main Thread) tenant-resolver-deployment 0.1-SNAPSHOT on JVM (powered by Quarkus 3.0.2.Final) started in 9.406s. Listening on: http://localhost:8080
2023-05-12 22:52:25,596 INFO  [io.quarkus] (Quarkus Main Thread) Profile dev activated. Live Coding activated.
2023-05-12 22:52:25,596 INFO  [io.quarkus] (Quarkus Main Thread) Installed features: [cdi, oidc, security, smallrye-context-propagation, tenant-resolver, vertx]
2023-05-12 22:52:25,653 INFO  [io.quarkus] (Quarkus Main Thread) tenant-resolver-deployment stopped in 0.029s
]]></system-out>
  </testcase>
</testsuite>