Division,WeightClassKg,Place,Name,Team,BodyweightKg,Best3SquatKg,Best3BenchKg,Best3DeadliftKg,TotalKg,Equipment,Event,Sex,BirthDate
Boys,51.71,1,Pedro Garza,Carrizo Springs,50.8,77.11,38.56,102.06,217.72,Single-ply,SBD,M,
Boys,51.71,2,Bryson Haak,Poteet,39.92,61.23,34.02,90.72,185.97,Single-ply,SBD,M,
Boys,51.71,DQ,Josh Ramirez,Somerset,51.71,90.72,,,,Single-ply,SBD,M,
Boys,55.79,1,Jonah Lopez,San Antonio Memorial,55.34,172.37,83.91,154.22,410.5,Single-ply,SBD,M,
Boys,59.87,1,Claude Faulkenberry,Crystal City,58.97,131.54,70.31,156.49,358.34,Single-ply,SBD,M,
Boys,59.87,2,Jordan Perez,Crystal City,59.87,133.81,63.5,142.88,340.19,Single-ply,SBD,M,
Boys,59.87,DQ,Joshua Bazan,Castroville Medina Valley,58.51,,,,,Single-ply,SBD,M,
Boys,59.87,DQ,Nico Uballe,La Pryor,59.87,142.88,95.25,,,Single-ply,SBD,M,
Boys,59.87,DQ,Devin Garza,Pearsall,59.87,,,,,Single-ply,SBD,M,
Boys,59.87,DQ,Leo Esparza,Pearsall,58.51,,,,,Single-ply,SBD,M,
Boys,59.87,DQ,Zachary Alvarez,Uvalde,59.87,,,,,Single-ply,SBD,M,
Boys,67.13,1,Joseph Bazan,Castroville Medina Valley,66.22,204.12,120.2,192.78,517.1,Single-ply,SBD,M,
Boys,67.13,2,Kingston Martinez,Pearsall,66.22,176.9,104.33,199.58,480.81,Single-ply,SBD,M,
Boys,67.13,3,Samuel Flores,Del Rio,67.13,183.7,115.67,179.17,478.54,Single-ply,SBD,M,
Boys,67.13,4,Alex Cardenas,Del Rio,64.86,156.49,120.2,195.04,471.74,Single-ply,SBD,M,
Boys,67.13,5,Jayden Ibarra,Poteet,66.22,179.17,102.06,179.17,460.4,Single-ply,SBD,M,
Boys,67.13,6,Noah Garcia,Somerset,64.86,170.1,102.06,154.22,426.38,Single-ply,SBD,M,
Boys,67.13,7,Gerardo Martinez,Uvalde,66.68,163.29,92.99,167.83,424.11,Single-ply,SBD,M,
Boys,67.13,8,Jaiden Maldonado,Crystal City,67.13,149.69,88.45,170.1,408.23,Single-ply,SBD,M,
Boys,67.13,9,Robert Longoria,Pearsall,61.23,136.08,79.38,179.17,394.63,Single-ply,SBD,M,
Boys,67.13,10,Zach Taylor,Del Rio,67.13,129.27,74.84,151.95,356.07,Single-ply,SBD,M,
Boys,67.13,DQ,Blake Frye,Somerset,63.05,142.88,,,,Single-ply,SBD,M,
Boys,74.84,1,Valentin Garza,La Pryor,74.39,251.74,147.42,260.82,659.98,Single-ply,SBD,M,
Boys,74.84,2,Josiah Lugo,Somerset,72.12,226.8,124.74,183.7,535.24,Single-ply,SBD,M,
Boys,74.84,3,Alex Villareal,San Antonio Memorial,74.84,215.46,113.4,190.51,519.36,Single-ply,SBD,M,
Boys,74.84,4,Patrick Jass,Castroville Medina Valley,73.94,183.7,104.33,210.92,498.95,Single-ply,SBD,M,
Boys,74.84,5,Luis Uballe,La Pryor,70.76,174.63,115.67,192.78,483.08,Single-ply,SBD,M,
Boys,74.84,6,Taylor Garcia,Uvalde,74.39,167.83,104.33,183.7,455.86,Single-ply,SBD,M,
Boys,74.84,7,Joseph Luna,Crystal City,74.39,181.44,88.45,183.7,453.59,Single-ply,SBD,M,
Boys,74.84,8,Raymond Hernandez,Crystal City,73.48,154.22,79.38,142.88,376.48,Single-ply,SBD,M,
Boys,74.84,9,Christian Lopez,La Pryor,73.94,131.54,77.11,156.49,365.14,Single-ply,SBD,M,
Boys,74.84,10,Matthew Rodriguez,Crystal City,74.84,142.88,77.11,133.81,353.8,Single-ply,SBD,M,
Boys,74.84,11,Michael Reyes,Carrizo Springs,73.94,113.4,79.38,149.69,342.46,Single-ply,SBD,M,
Boys,74.84,12,Carlos Salazar,Carrizo Springs,72.57,102.06,61.23,138.35,301.64,Single-ply,SBD,M,
Boys,74.84,13,Micah Villa,Hondo,68.49,95.25,52.16,115.67,263.08,Single-ply,SBD,M,
Boys,74.84,DQ,Adrian Cardenas,Del Rio,69.85,208.65,,,,Single-ply,SBD,M,
Boys,82.1,1,Ariel Hernandez,Pearsall,80.74,238.14,147.42,213.19,598.74,Single-ply,SBD,M,
Boys,82.1,2,Jarrett Gest,Carrizo Springs,82.1,215.46,142.88,208.65,566.99,Single-ply,SBD,M,
Boys,82.1,3,Robert Olivarez,Uvalde,81.65,199.58,145.15,183.7,528.44,Single-ply,SBD,M,
Boys,82.1,4,Brandon Perez,Crystal City,81.65,217.72,122.47,183.7,523.9,Single-ply,SBD,M,
Boys,82.1,5,Seth Dunn,Poteet,79.83,188.24,117.93,204.12,510.29,Single-ply,SBD,M,
Boys,82.1,6,Arturo Gonzalez,La Pryor,79.83,183.7,124.74,195.04,503.49,Single-ply,SBD,M,
Boys,82.1,7,Rene Carrasco,Del Rio,78.47,192.78,111.13,183.7,487.61,Single-ply,SBD,M,
Boys,82.1,8,Chuy Vasquez,Uvalde,81.65,179.17,115.67,188.24,483.08,Single-ply,SBD,M,
Boys,82.1,9,Zach Heilig,Hondo,80.29,172.37,99.79,190.51,462.66,Single-ply,SBD,M,
Boys,82.1,10,Erik Coronado,Poteet,77.11,170.1,97.52,192.78,460.4,Single-ply,SBD,M,
Boys,82.1,11,Richard Gonzales,Castroville Medina Valley,79.38,183.7,83.91,192.78,460.4,Single-ply,SBD,M,
Boys,82.1,12,Felipe Lopez,Del Rio,79.38,145.15,102.06,154.22,401.43,Single-ply,SBD,M,
Boys,82.1,13,Hector Garcia,Carrizo Springs,76.66,142.88,88.45,167.83,399.16,Single-ply,SBD,M,
Boys,82.1,14,Daedyn Rodriguez,Hondo,75.75,165.56,70.31,138.35,374.21,Single-ply,SBD,M,
Boys,82.1,15,Joshua Rath,Castroville Medina Valley,76.66,124.74,102.06,142.88,369.68,Single-ply,SBD,M,
Boys,82.1,16,Aaron Sanchez,Crystal City,79.38,142.88,81.65,142.88,367.41,Single-ply,SBD,M,
Boys,89.81,1,Raul Maldonado,Crystal City,87.54,222.26,147.42,224.53,594.21,Single-ply,SBD,M,
Boys,89.81,2,Gabriel Guajardo,Hondo,88.9,197.31,127.01,215.46,539.77,Single-ply,SBD,M,
Boys,89.81,3,Rodolfo Reyes,Uvalde,87.09,206.38,111.13,206.38,523.9,Single-ply,SBD,M,
Boys,89.81,4,Augustine Aviles,Uvalde,88.45,183.7,133.81,192.78,510.29,Single-ply,SBD,M,
Boys,89.81,5,Ricky Torres,Del Rio,88.45,188.24,111.13,199.58,498.95,Single-ply,SBD,M,
Boys,89.81,6,Isreal Reyes,Pearsall,87.54,183.7,113.4,195.04,492.15,Single-ply,SBD,M,
Boys,89.81,7,Saul Ramos,La Pryor,86.18,190.51,117.93,174.63,483.08,Single-ply,SBD,M,
Boys,89.81,8,Alec Arguijo,Poteet,86.18,170.1,97.52,185.97,453.59,Single-ply,SBD,M,
Boys,89.81,9,Brady Forman,Castroville Medina Valley,84.82,156.49,113.4,172.37,442.25,Single-ply,SBD,M,
Boys,89.81,10,Joshua Camancho,Uvalde,89.36,149.69,120.2,172.37,442.25,Single-ply,SBD,M,
Boys,89.81,11,Andrew Lozano,La Pryor,86.64,136.08,99.79,163.29,399.16,Single-ply,SBD,M,
Boys,99.79,1,Cesar Diaz,Del Rio,97.98,210.92,133.81,206.38,551.11,Single-ply,SBD,M,
Boys,99.79,2,Jesus Tellez,Crystal City,99.79,204.12,124.74,195.04,523.9,Single-ply,SBD,M,
Boys,99.79,3,Tex Anderson,Poteet,92.08,174.63,111.13,172.37,458.13,Single-ply,SBD,M,
Boys,99.79,4,Salvador Sanchez,Somerset,94.8,183.7,113.4,161.03,458.13,Single-ply,SBD,M,
Boys,99.79,5,George Avalos,Del Rio,98.43,167.83,88.45,197.31,453.59,Single-ply,SBD,M,
Boys,99.79,6,Isaiah Mena,Castroville Medina Valley,95.25,185.97,97.52,147.42,430.91,Single-ply,SBD,M,
Boys,99.79,7,Jared Hale,La Pryor,92.53,172.37,83.91,170.1,426.38,Single-ply,SBD,M,
Boys,99.79,8,Christian Nevarez,Castroville Medina Valley,99.79,176.9,99.79,149.69,426.38,Single-ply,SBD,M,
Boys,99.79,9,Zach Robles,La Pryor,93.89,161.03,97.52,147.42,405.97,Single-ply,SBD,M,
Boys,99.79,10,Lucio Ramirez,Pearsall,98.88,183.7,92.99,124.74,401.43,Single-ply,SBD,M,
Boys,99.79,11,Santana Ayala,Castroville Medina Valley,92.08,138.35,92.99,136.08,367.41,Single-ply,SBD,M,
Boys,99.79,12,Julio Jimenez,Carrizo Springs,98.43,90.72,79.38,138.35,308.44,Single-ply,SBD,M,
Boys,99.79,DQ,Jordan Trujillo,Carrizo Springs,99.79,97.52,,,,Single-ply,SBD,M,
Boys,99.79,DQ,Kenneth Taylor,Pearsall,96.16,124.74,,,,Single-ply,SBD,M,
Boys,109.77,1,Alfredo Segura,Carrizo Springs,108.86,306.17,165.56,278.96,750.7,Single-ply,SBD,M,
Boys,109.77,2,Isaiah Garay,Somerset,108.86,265.35,226.8,197.31,689.46,Single-ply,SBD,M,
Boys,109.77,3,Gerardo Cantu,Somerset,105.69,249.48,131.54,215.46,596.47,Single-ply,SBD,M,
Boys,109.77,4,Felipe Cuellar,Hondo,101.6,217.72,133.81,222.26,573.79,Single-ply,SBD,M,
Boys,109.77,5,Corbin Dunn,Poteet,101.6,206.38,149.69,201.85,557.92,Single-ply,SBD,M,
Boys,109.77,6,Timothy Rios,Castroville Medina Valley,109.77,183.7,142.88,183.7,510.29,Single-ply,SBD,M,
Boys,109.77,7,Luis Perez,Crystal City,109.77,197.31,127.01,181.44,505.76,Single-ply,SBD,M,
Boys,109.77,8,Sebastian Carrillo,Pearsall,106.14,199.58,104.33,183.7,487.61,Single-ply,SBD,M,
Boys,109.77,9,Gabriel Sanchez,Del Rio,103.87,183.7,111.13,183.7,478.54,Single-ply,SBD,M,
Boys,109.77,10,Marcos Garcia,Carrizo Springs,100.7,149.69,83.91,170.1,403.7,Single-ply,SBD,M,
Boys,109.77,11,Manuel Gutierrez,Carrizo Springs,103.42,97.52,65.77,104.33,267.62,Single-ply,SBD,M,
Boys,109.77,DQ,Steven Terazzas,Somerset,109.77,,,,,Single-ply,SBD,M,
Boys,124.74,1,Gabriel Gutierrez,Pearsall,116.57,331.12,176.9,276.69,784.71,Single-ply,SBD,M,
Boys,124.74,2,Frankie Castillo,Somerset,120.66,272.16,154.22,217.72,644.1,Single-ply,SBD,M,
Boys,124.74,3,Raymundo Ardano,San Antonio Memorial,112.04,240.4,136.08,210.92,587.4,Single-ply,SBD,M,
Boys,124.74,4,Adolfo Flores,La Pryor,117.93,235.87,133.81,210.92,580.6,Single-ply,SBD,M,
Boys,124.74,5,Aaron Graves,Uvalde,118.84,215.46,156.49,197.31,569.26,Single-ply,SBD,M,
Boys,124.74,6,Julio Obregon,Hondo,118.39,215.46,147.42,195.04,557.92,Single-ply,SBD,M,
Boys,124.74,7,Caleb Rodriguez,Del Rio,123.38,226.8,111.13,192.78,530.7,Single-ply,SBD,M,
Boys,124.74,8,Mason Winecoff,Castroville Medina Valley,124.28,208.65,136.08,183.7,528.44,Single-ply,SBD,M,
Boys,124.74,9,David Narvaez,San Antonio Memorial,114.76,195.04,131.54,190.51,517.1,Single-ply,SBD,M,
Boys,124.74,10,Dustin Jackson,La Pryor,124.74,165.56,88.45,179.17,433.18,Single-ply,SBD,M,
Boys,124.74,11,Andrew Torres,Carrizo Springs,118.84,158.76,99.79,158.76,417.3,Single-ply,SBD,M,
Boys,124.74,DQ,Ismael Gonzales,Pearsall,117.93,138.35,,,,Single-ply,SBD,M,
Boys,124.74,DQ,Malaki Lara,Uvalde,113.4,206.38,,,,Single-ply,SBD,M,
Boys,139.71,1,Anthony Huizar,Del Rio,126.55,272.16,161.03,238.14,671.32,Single-ply,SBD,M,
Boys,139.71,2,Abraham Vasquez,Somerset,134.26,272.16,147.42,251.74,671.32,Single-ply,SBD,M,
Boys,139.71,3,Ivan Garcia,San Antonio Memorial,138.8,254.01,158.76,213.19,625.96,Single-ply,SBD,M,
Boys,139.71,4,Ryan Hughes,Pearsall,126.1,215.46,120.2,174.63,510.29,Single-ply,SBD,M,
Boys,139.71,5,Ezra Aranda,La Pryor,135.17,172.37,117.93,208.65,498.95,Single-ply,SBD,M,
Boys,139.71,6,Dominik Martinez,Poteet,135.62,170.1,111.13,167.83,449.06,Single-ply,SBD,M,
Boys,139.71+,1,Manuel Belmarez,San Antonio Memorial,145.15,235.87,142.88,201.85,580.6,Single-ply,SBD,M,
Boys,139.71+,2,Javier Adams,Somerset,175.09,183.7,124.74,206.38,514.83,Single-ply,SBD,M,
