Division,WeightClassKg,Place,Name,Team,BodyweightKg,Best3SquatKg,Best3BenchKg,Best3DeadliftKg,TotalKg,Equipment,Event,Sex,BirthDate
Boys,51.71,1,Kam Wright,Jasper,50.8,120.2,70.31,120.2,310.71,Single-ply,SBD,M,
Boys,55.79,1,Austin Walker,Kirbyville,55.34,122.47,65.77,133.81,322.05,Single-ply,SBD,M,
Boys,59.87,1,Kierstin Danna,Kirbyville,58.97,145.15,106.59,158.76,410.5,Single-ply,SBD,M,
Boys,67.13,1,Jacovian Adams,Jasper,63.5,145.15,90.72,165.56,401.43,Single-ply,SBD,M,
Boys,67.13,2,Blade Siau,Newton,65.77,129.27,92.99,165.56,387.82,Single-ply,SBD,M,
Boys,67.13,3,Jace Gore,Kirbyville,65.77,138.35,86.18,151.95,376.48,Single-ply,SBD,M,
Boys,67.13,4,Alex Butler #3,Kirbyville,61.23,122.47,79.38,136.08,337.93,Single-ply,SBD,M,
Boys,67.13,5,Trevoughn Simmons,Jasper,63.05,117.93,68.04,142.88,328.85,Single-ply,SBD,M,
Boys,67.13,6,Ethan Hudson,Newton,61.69,97.52,54.43,142.88,294.84,Single-ply,SBD,M,
Boys,67.13,DQ,Maliek Woods,Newton,66.68,131.54,81.65,,,Single-ply,SBD,M,
Boys,74.84,1,Marcus Parnell,Jasper,70.76,170.1,120.2,190.51,480.81,Single-ply,SBD,M,
Boys,74.84,2,Keyvon Fertile,Newton,68.95,170.1,97.52,174.63,442.25,Single-ply,SBD,M,
Boys,74.84,3,Reese Obannion,Kirbyville,73.48,156.49,88.45,167.83,412.77,Single-ply,SBD,M,
Boys,74.84,DQ,Jatarius Hanks,Newton,69.85,145.15,83.91,,,Single-ply,SBD,M,
Boys,74.84,DQ,Xavier Smith,Newton,73.94,145.15,68.04,,,Single-ply,SBD,M,
Boys,74.84,DQ,Clinton Foster,Newton,71.67,158.76,77.11,,,Single-ply,SBD,M,
Boys,82.1,1,Kaleb Sells,Jasper,76.2,163.29,115.67,190.51,469.47,Single-ply,SBD,M,
Boys,82.1,2,Gage Myer,Newton,78.02,136.08,74.84,163.29,374.21,Single-ply,SBD,M,
Boys,82.1,DQ,Hico Malone,Newton,82.1,,,,,Single-ply,SBD,M,
Boys,89.81,1,Leighton Foster,Newton,86.64,204.12,115.67,210.92,530.7,Single-ply,SBD,M,
Boys,89.81,2,Kayden Caraway,Jasper,87.09,204.12,92.99,215.46,512.56,Single-ply,SBD,M,
Boys,89.81,3,Jacob Kelley,Kirbyville,87.54,199.58,120.2,185.97,505.76,Single-ply,SBD,M,
Boys,89.81,4,Jayden Hunter #2,Newton,83.91,181.44,95.25,183.7,460.4,Single-ply,SBD,M,
Boys,89.81,5,Dyllen Brown,Kirbyville,86.64,120.2,79.38,127.01,326.59,Single-ply,SBD,M,
Boys,99.79,1,Jonathan Kennebrew,Newton,90.72,215.46,124.74,260.82,601.01,Single-ply,SBD,M,
Boys,99.79,2,Sam Justice,Jasper,97.07,176.9,127.01,170.1,474,Single-ply,SBD,M,
Boys,99.79,3,Ja'Marion Hanks,Newton,92.99,156.49,108.86,197.31,462.66,Single-ply,SBD,M,
Boys,99.79,4,Ethan Dunman,Jasper,94.35,154.22,99.79,165.56,419.57,Single-ply,SBD,M,
Boys,99.79,5,Brayden Ludd,Newton,99.34,151.95,79.38,179.17,410.5,Single-ply,SBD,M,
Boys,99.79,6,Danin Spikes,Newton,99.79,165.56,81.65,145.15,392.36,Single-ply,SBD,M,
Boys,99.79,7,Hunter Pyle,Jasper,94.35,124.74,65.77,124.74,315.25,Single-ply,SBD,M,
Boys,109.77,1,Antrevion Gatson,Newton,108.41,183.7,106.59,204.12,494.42,Single-ply,SBD,M,
Boys,109.77,DQ,Al Adams,Jasper,108.86,174.63,124.74,,,Single-ply,SBD,M,
Boys,124.74,1,Noah Nava,Newton,116.12,197.31,142.88,208.65,548.85,Single-ply,SBD,M,
Boys,124.74,2,Tyler Cochran,Newton,117.03,210.92,120.2,208.65,539.77,Single-ply,SBD,M,
Boys,124.74,3,Ethan Lott,Newton,121.11,170.1,113.4,183.7,467.2,Single-ply,SBD,M,
Boys,124.74,DQ,Jarron Roden,Kirbyville,115.67,,,,,Single-ply,SBD,M,
Boys,139.71,1,Emmanuel Hernandez,Newton,130.63,229.06,142.88,240.4,612.35,Single-ply,SBD,M,
Boys,139.71,2,Bryson Mansfield,Newton,129.73,238.14,127.01,238.14,603.28,Single-ply,SBD,M,
Boys,139.71,3,Hunter Williams,Newton,130.63,215.46,122.47,231.33,569.26,Single-ply,SBD,M,
Boys,139.71+,1,J'Kwon Brumley,Kirbyville,148.32,267.62,167.83,235.87,671.32,Single-ply,SBD,M,
Boys,139.71+,2,Chris Phifer,Newton,145.15,197.31,97.52,183.7,478.54,Single-ply,SBD,M,
