Division,WeightClassKg,Place,Name,Team,BodyweightKg,Best3SquatKg,Best3BenchKg,Best3DeadliftKg,TotalKg,Equipment,Event,Sex,BirthDate
Boys,51.71,1,Damion Gonzales,Lockney,50.98,185.97,104.33,163.29,453.59,Single-ply,SBD,M,
Boys,51.71,2,Robert Noriega,Kress,50.53,136.08,88.45,170.1,394.63,Single-ply,SBD,M,
Boys,51.71,3,Michael Salazar,Sundown,50.8,140.61,74.84,170.1,385.55,Single-ply,SBD,M,
Boys,51.71,4,Peyton Langhor,Iraan,50.71,142.88,63.5,131.54,337.93,Single-ply,SBD,M,
Boys,51.71,5,Chris Minor,Ralls,51.44,113.4,72.57,127.01,312.98,Single-ply,SBD,M,
Boys,51.71,6,Xavier Ellis,Kress,45.36,102.06,65.77,127.01,294.84,Single-ply,SBD,M,
Boys,51.71,7,Jaidyn DeMarse,New Home,51.07,106.59,65.77,113.4,285.76,Single-ply,SBD,M,
Boys,51.71,8,Davian Castilleja,Kress,51.62,97.52,68.04,117.93,283.5,Single-ply,SBD,M,
Boys,51.71,9,Jaime Reyna,Olton,43.36,99.79,54.43,127.01,281.23,Single-ply,SBD,M,
Boys,51.71,10,Auggie Salas,Forsan,49.44,97.52,61.23,120.2,278.96,Single-ply,SBD,M,
Boys,51.71,11,Trace Price,Post,50.35,99.79,58.97,113.4,272.16,Single-ply,SBD,M,
Boys,51.71,12,Joe Zermeno,Olton,48.99,92.99,58.97,104.33,256.28,Single-ply,SBD,M,
Boys,55.79,1,Caden Rocha,Panhandle,55.7,174.63,102.06,165.56,442.25,Single-ply,SBD,M,
Boys,55.79,2,Fabian Viernes,Bovina,55.07,147.42,97.52,154.22,399.16,Single-ply,SBD,M,
Boys,55.79,3,Devin Russell,Olton,55.25,124.74,79.38,142.88,347,Single-ply,SBD,M,
Boys,55.79,4,Ceasar Amaya,Bovina,55.25,124.74,74.84,131.54,331.12,Single-ply,SBD,M,
Boys,55.79,5,Ty Dutton,New Home,55.25,102.06,72.57,111.13,285.76,Single-ply,SBD,M,
Boys,55.79,6,Chris Olguin,Whiteface,54.79,104.33,54.43,122.47,281.23,Single-ply,SBD,M,
Boys,55.79,7,Riley Rodriguez,Whiteface,54.52,81.65,63.5,113.4,258.55,Single-ply,SBD,M,
Boys,55.79,NS,David Hester,Ropesville Ropes,,,,,,Single-ply,SBD,M,
Boys,55.79,NS,Boyzz Stillwell,Forsan,,,,,,Single-ply,SBD,M,
Boys,55.79,DQ,Bronson Putman,Ropesville Ropes,51.8,,,,,Single-ply,SBD,M,
Boys,55.79,DQ,Gavin Baker,Whiteface,54.43,,,,,Single-ply,SBD,M,
Boys,59.87,1,Kyndle Esparza,Seagraves,58.69,165.56,83.91,174.63,424.11,Single-ply,SBD,M,
Boys,59.87,2,Jhoan Menjivar,Plains,59.69,145.15,81.65,158.76,385.55,Single-ply,SBD,M,
Boys,59.87,3,Jovany Salazar,Bovina,58.51,133.81,81.65,156.49,371.95,Single-ply,SBD,M,
Boys,59.87,4,Miguel Lopez,Bovina,59.33,120.2,90.72,129.27,340.19,Single-ply,SBD,M,
Boys,59.87,5,Diego Cedillo,Kress,57.61,115.67,68.04,127.01,310.71,Single-ply,SBD,M,
Boys,59.87,6,Victor Avendando,Olton,59.33,86.18,74.84,145.15,306.17,Single-ply,SBD,M,
Boys,59.87,7,Wyatt Stamps,Panhandle,57.06,111.13,72.57,115.67,299.37,Single-ply,SBD,M,
Boys,59.87,8,Kyler Neill,Wellman-Union,59.87,106.59,58.97,113.4,278.96,Single-ply,SBD,M,
Boys,59.87,NS,Jason Granillo,Olton,,,,,,Single-ply,SBD,M,
Boys,59.87,NS,Josh Granillo,Olton,,,,,,Single-ply,SBD,M,
Boys,59.87,DQ,Marcus Gonzales,Plains,57.33,90.72,52.16,,,Single-ply,SBD,M,
Boys,59.87,DQ,Edgar Gallegos,Sunray,58.79,127.01,,,,Single-ply,SBD,M,
Boys,67.13,1,Kit Macina,Shamrock,65.14,217.72,122.47,208.65,548.85,Single-ply,SBD,M,
Boys,67.13,2,Mark Rubalcava,Sundown,65.5,197.31,115.67,210.92,523.9,Single-ply,SBD,M,
Boys,67.13,3,Daniel Estrada,New Home,66.86,199.58,124.74,199.58,523.9,Single-ply,SBD,M,
Boys,67.13,4,Rickey Melendez,Sundown,66.77,219.99,108.86,185.97,514.83,Single-ply,SBD,M,
Boys,67.13,5,Caden Peevey,Shamrock,65.32,183.7,111.13,195.04,489.88,Single-ply,SBD,M,
Boys,67.13,6,Matt Rosas,McCamey,65.14,195.04,99.79,192.78,487.61,Single-ply,SBD,M,
Boys,67.13,7,Jesus Montoya,Post,66.59,183.7,106.59,172.37,462.66,Single-ply,SBD,M,
Boys,67.13,8,Dominic Casares,Sunray,66.59,176.9,106.59,176.9,460.4,Single-ply,SBD,M,
Boys,67.13,9,Josh Cervantes,Forsan,65.86,142.88,120.2,172.37,435.45,Single-ply,SBD,M,
Boys,67.13,NS,Diego Gallegos,Olton,,,,,,Single-ply,SBD,M,
Boys,67.13,DQ,Trae Zavala III,Ralls,63.14,,,,,Single-ply,SBD,M,
Boys,67.13,DQ,Alec Vasquez,New Home,66.77,163.29,,,,Single-ply,SBD,M,
Boys,74.84,1,Steve Salazar,Ralls,74.84,204.12,124.74,210.92,539.77,Single-ply,SBD,M,
Boys,74.84,2,Dylan Davis,Panhandle,72.3,219.99,115.67,199.58,535.24,Single-ply,SBD,M,
Boys,74.84,3,Daniel Martinez,Shamrock,73.75,192.78,115.67,183.7,492.15,Single-ply,SBD,M,
Boys,74.84,4,Jaden Noriega,Kress,73.3,181.44,120.2,176.9,478.54,Single-ply,SBD,M,
Boys,74.84,5,Michael Guzman,Kress,72.3,170.1,111.13,190.51,471.74,Single-ply,SBD,M,
Boys,74.84,6,Hunter Tindol,Sundown,73.57,165.56,106.59,185.97,458.13,Single-ply,SBD,M,
Boys,74.84,7,Kaden Taylor,Forsan,70.67,158.76,106.59,176.9,442.25,Single-ply,SBD,M,
Boys,74.84,8,Lee Savage,Memphis,74.21,165.56,95.25,174.63,435.45,Single-ply,SBD,M,
Boys,74.84,9,Christian Enriquez,Morton,67.95,149.69,113.4,165.56,428.64,Single-ply,SBD,M,
Boys,74.84,10,Damian Marquez,Olton,73.48,136.08,113.4,176.9,426.38,Single-ply,SBD,M,
Boys,74.84,11,Stephen Hernandez,Tahoka,70.22,165.56,99.79,,265.35,Single-ply,SB,M,
Boys,74.84,NS,Eric Casadillas,Sunray,,,,,,Single-ply,SBD,M,
Boys,82.1,1,Kevin Garcia,Sundown,80.47,260.82,176.9,231.33,669.05,Single-ply,SBD,M,
Boys,82.1,2,EJ Hernandez,Sundown,79.2,233.6,154.22,224.53,612.35,Single-ply,SBD,M,
Boys,82.1,3,Omar Rodriguez,Hart,80.01,219.99,149.69,190.51,560.19,Single-ply,SBD,M,
Boys,82.1,4,Isiah Flores,Sundown,81.01,210.92,102.06,208.65,521.63,Single-ply,SBD,M,
Boys,82.1,5,Mike Theis,Panhandle,81.01,183.7,140.61,190.51,514.83,Single-ply,SBD,M,
Boys,82.1,6,Brody Black,Vega,78.11,206.38,106.59,192.78,505.76,Single-ply,SBD,M,
Boys,82.1,7,Nathan Ceniceros,Lockney,77.75,172.37,106.59,210.92,489.88,Single-ply,SBD,M,
Boys,82.1,8,Harrison Weeks,Plains,80.29,183.7,104.33,174.63,462.66,Single-ply,SBD,M,
Boys,82.1,9,Jose Mota,McCamey,78.29,197.31,97.52,165.56,460.4,Single-ply,SBD,M,
Boys,82.1,10,Grady Roberts,Olton,79.65,154.22,117.93,176.9,449.06,Single-ply,SBD,M,
Boys,82.1,DQ,Michael Acosta,McCamey,78.93,,,,,Single-ply,SBD,M,
Boys,82.1,DQ,Sergio Salinas,Ralls,79.92,,,,,Single-ply,SBD,M,
Boys,89.81,1,Diego Hernandez,Sundown,87.09,242.67,147.42,229.06,619.15,Single-ply,SBD,M,
Boys,89.81,2,Luke Brooker,Whiteface,83.28,201.85,142.88,192.78,537.51,Single-ply,SBD,M,
Boys,89.81,3,Tobi Bernal,Ropesville Ropes,84.73,197.31,113.4,210.92,521.63,Single-ply,SBD,M,
Boys,89.81,4,Jaden Conley,Sudan,88.27,185.97,108.86,226.8,521.63,Single-ply,SBD,M,
Boys,89.81,5,Adan Sanchez,Iraan,83.64,197.31,136.08,183.7,517.1,Single-ply,SBD,M,
Boys,89.81,6,Miguel Sanchez,McCamey,84.73,201.85,113.4,188.24,503.49,Single-ply,SBD,M,
Boys,89.81,7,Anthony Unger,Wellman-Union,85.37,210.92,108.86,181.44,501.22,Single-ply,SBD,M,
Boys,89.81,8,Darian DeLaRosa,Bovina,87.09,197.31,104.33,197.31,498.95,Single-ply,SBD,M,
Boys,89.81,9,McCade Smith,Panhandle,87.09,179.17,102.06,204.12,485.34,Single-ply,SBD,M,
Boys,89.81,10,David Espinoza,Memphis,83.82,188.24,104.33,181.44,474,Single-ply,SBD,M,
Boys,89.81,DQ,Jose Castillo,Kress,88.27,197.31,124.74,,,Single-ply,SBD,M,
Boys,89.81,DQ,Andrew Suarez,Floydada,82.37,,,,,Single-ply,SBD,M,
Boys,99.79,1,Andrew Hernandez,Sundown,95.71,290.3,176.9,210.92,678.12,Single-ply,SBD,M,
Boys,99.79,2,Isaac Tovar,Sunray,98.88,233.6,138.35,206.38,578.33,Single-ply,SBD,M,
Boys,99.79,3,Eli Alvarez,Lockney,99.43,231.33,145.15,197.31,573.79,Single-ply,SBD,M,
Boys,99.79,4,Armando Cruz,Floydada,94.89,226.8,129.27,199.58,555.65,Single-ply,SBD,M,
Boys,99.79,5,Alejandro Rodriguez,Post,92.08,215.46,138.35,197.31,551.11,Single-ply,SBD,M,
Boys,99.79,6,Rigo Molina,McCamey,96.34,238.14,104.33,195.04,537.51,Single-ply,SBD,M,
Boys,99.79,7,Nolan Park,Forsan,92.9,190.51,129.27,213.19,532.97,Single-ply,SBD,M,
Boys,99.79,8,Zed Mendez,Whiteface,98.7,226.8,120.2,181.44,528.44,Single-ply,SBD,M,
Boys,99.79,9,Damian Casteneda,Whiteface,98.07,195.04,117.93,213.19,526.17,Single-ply,SBD,M,
Boys,99.79,10,Marcus Collins,Floydada,94.89,204.12,113.4,188.24,505.76,Single-ply,SBD,M,
Boys,99.79,11,Hayden Forbes,Panhandle,98.79,195.04,104.33,181.44,480.81,Single-ply,SBD,M,
Boys,99.79,12,Abel Vizcarra,Morton,99.79,188.24,106.59,183.7,478.54,Single-ply,SBD,M,
Boys,99.79,13,Dustin Medina,Panhandle,91.17,183.7,95.25,185.97,464.93,Single-ply,SBD,M,
Boys,109.77,1,Andy Castillo,Sundown,108.41,278.96,174.63,272.16,725.75,Single-ply,SBD,M,
Boys,109.77,2,Dekota Golightly,Sundown,109.04,254.01,158.76,226.8,639.57,Single-ply,SBD,M,
Boys,109.77,3,Jesse Putnam,Wink,108.14,229.06,167.83,229.06,625.96,Single-ply,SBD,M,
Boys,109.77,4,Auggie Cervantes,Forsan,106.23,217.72,136.08,231.33,585.13,Single-ply,SBD,M,
Boys,109.77,5,Xavyn Garcia,Sundown,108.41,233.6,145.15,192.78,571.53,Single-ply,SBD,M,
Boys,109.77,6,Logan Castaneda,Meadow,104.42,215.46,120.2,195.04,530.7,Single-ply,SBD,M,
Boys,109.77,7,Jesus Carrillo,Wink,103.78,204.12,136.08,183.7,523.9,Single-ply,SBD,M,
Boys,109.77,8,Nathan Pena,Marfa,109.68,176.9,145.15,199.58,521.63,Single-ply,SBD,M,
Boys,109.77,9,Rudy Jimenez,Lockney,108.5,204.12,124.74,188.24,517.1,Single-ply,SBD,M,
Boys,109.77,10,Michael Sanchez,Whiteface,100.15,170.1,104.33,192.78,467.2,Single-ply,SBD,M,
Boys,109.77,11,Jesus Sanchez,Memphis,107.5,142.88,120.2,158.76,421.84,Single-ply,SBD,M,
Boys,109.77,DQ,Angel Lozano,Plains,108.95,183.7,120.2,,,Single-ply,SBD,M,
Boys,124.74,1,Chris Castillo,Sundown,119.84,251.74,170.1,233.6,655.44,Single-ply,SBD,M,
Boys,124.74,2,Jeffery Rodriguez,Sundown,114.58,254.01,158.76,240.4,653.17,Single-ply,SBD,M,
Boys,124.74,3,Isaiah Garcia,McCamey,122.83,269.89,136.08,226.8,632.76,Single-ply,SBD,M,
Boys,124.74,4,Ivan Mendoza,Iraan,117.03,222.26,106.59,217.72,546.58,Single-ply,SBD,M,
Boys,124.74,5,Landon Hair,Post,120.84,210.92,140.61,190.51,542.04,Single-ply,SBD,M,
Boys,124.74,6,Ethan Turegano,Wink,111.13,181.44,138.35,188.24,508.02,Single-ply,SBD,M,
Boys,124.74,7,Beau Brewer,Whiteface,114.49,201.85,108.86,192.78,503.49,Single-ply,SBD,M,
Boys,124.74,8,Zane Mendez,Ralls,114.49,215.46,95.25,183.7,494.42,Single-ply,SBD,M,
Boys,124.74,9,Gabe Perez,Post,115.67,199.58,102.06,185.97,487.61,Single-ply,SBD,M,
Boys,124.74,10,Chris Arrington,Tahoka,110.68,185.97,99.79,192.78,478.54,Single-ply,SBD,M,
Boys,124.74,11,Raymond Epley,Wink,118.39,,95.25,165.56,260.82,Single-ply,BD,M,
Boys,124.74,DQ,Jon Conley,Sudan,116.85,215.46,117.93,,,Single-ply,SBD,M,
Boys,139.71,1,Niko Castaneda,Meadow,133.08,319.78,174.63,256.28,750.7,Single-ply,SBD,M,
Boys,139.71,2,Jacob Hernandez,Vega,131.36,297.1,172.37,238.14,707.6,Single-ply,SBD,M,
Boys,139.71,3,Caden Pritchard,Lockney,134.99,215.46,140.61,176.9,532.97,Single-ply,SBD,M,
Boys,139.71,4,Koldin Averette,Forsan,136.71,195.04,122.47,190.51,508.02,Single-ply,SBD,M,
Boys,139.71,5,Skylen Copeland,Wink,129.09,208.65,127.01,165.56,501.22,Single-ply,SBD,M,
Boys,139.71,6,Nathaniel Norgaard,Ralls,131,136.08,79.38,129.27,344.73,Single-ply,SBD,M,
Boys,139.71,7,Anthony Kent,Sunray,135.62,108.86,81.65,131.54,322.05,Single-ply,SBD,M,
Boys,139.71+,1,Konar Alaman,Sundown,164.02,272.16,181.44,226.8,680.39,Single-ply,SBD,M,
Boys,139.71+,2,Jalen Ramirez,Wink,153.68,267.62,147.42,251.74,666.78,Single-ply,SBD,M,
Boys,139.71+,3,Wes Putman,Shamrock,140.61,263.08,151.95,233.6,648.64,Single-ply,SBD,M,
Boys,139.71+,4,Gavin Nazario,Clarendon,149.59,238.14,170.1,226.8,635.03,Single-ply,SBD,M,
Boys,139.71+,5,Julius Alaniz,Wellman-Union,145.24,290.3,131.54,208.65,630.49,Single-ply,SBD,M,
Boys,139.71+,6,Jesus Rodriguez,Sundown,142.34,231.33,129.27,208.65,569.26,Single-ply,SBD,M,
Boys,139.71+,7,Alfonso Chapa,Kress,155.85,179.17,83.91,142.88,405.97,Single-ply,SBD,M,
