Place,Sex,Name,Event,Division,WeightClassKg,Equipment,Team,State,BodyweightKg,Squat1Kg,Squat2Kg,Squat3Kg,Best3SquatKg,Bench1Kg,Bench2Kg,Bench3Kg,Best3BenchKg,Deadlift1Kg,Deadlift2Kg,Deadlift3Kg,Best3DeadliftKg,TotalKg,BirthYear
1,M,Michael West,B,MR-M2a,120,Raw,SSP,WA,115.1,,,,,82.5,87.5,90,90,,,,,90,1962
1,M,Charles Silva,B,MR-M3a,105,Raw,,WA,103.7,,,,,142.5,-155,-155,142.5,,,,,142.5,1956
1,M,Ray Horak,B,MR-M4a,120,Raw,,WA,110.5,,,,,-105,112.5,-117.5,112.5,,,,,112.5,1946
1,M,Zachary Ellis,B,MR-O,93,Raw,,WA,91.3,,,,,135,-145,-150,135,,,,,135,1992
1,M,Sean Meneses,B,MR-O,66,Raw,,WA,65.6,,,,,117.5,120,122.5,122.5,,,,,122.5,1990
1,M,Jessie Figueroa,B,MR-O,93,Raw,,WA,91.4,,,,,-135,-137.5,137.5,137.5,,,,,137.5,1978
1,M,Dillon Ofoia,B,MR-O,105,Raw,,WA,102.7,,,,,185,-195,195,195,,,,,195,1985
2,M,Andrei Conovalov,B,MR-O,105,Raw,,WA,99.5,,,,,125,132.5,137.5,137.5,,,,,137.5,1990
1,M,Dan Murray,B,MR-O,120,Raw,,WA,115,,,,,170,182.5,-187.5,182.5,,,,,182.5,1983
2,M,Sean Gilliland,B,MR-O,120,Raw,,WA,110.1,,,,,145,155,160,160,,,,,160,1977
DQ,M,Umar Abdullah,B,MR-O,120+,Raw,,WA,171.7,,,,,-210,-220,-222.5,,,,,,,1979
1,M,Yoshiki Bell,B,MR-T3,74,Raw,,WA,69.4,,,,,85,95,102.5,102.5,,,,,102.5,1996
1,F,Christa Kollman,B,FR-M1a,72,Raw,,WA,69.4,,,,,52.5,55,-60,55,,,,,55,1976
DQ,F,Susanna White,B,FR-O,63,Raw,,WA,62.3,,,,,-67.5,-67.5,-67.5,,,,,,,1977
1,F,Samantha LaRue,B,FR-T3,84+,Raw,,WA,94.7,,,,,-72.5,72.5,-77.5,72.5,,,,,72.5,1997
1,M,Leamon Woodley,D,M-M2b,83,Single-ply,,WA,81.3,,,,,,,,,282.5,-292.5,292.5,292.5,292.5,1957
1,M,Charles Mount,D,MR-M1a,93,Raw,,WA,92.4,,,,,,,,,255,265,-275,265,265,1974
1,M,Michael West,D,MR-M2a,120,Raw,SSP,WA,115.1,,,,,,,,,132.5,142.5,-152.5,142.5,142.5,1962
1,M,Sean Meneses,D,MR-O,66,Raw,,WA,65.6,,,,,,,,,205,-210,-210,205,205,1990
1,M,Andrei Conovalov,D,MR-O,105,Raw,,WA,99.5,,,,,,,,,-272.5,272.5,-287.5,272.5,272.5,1990
2,M,Dillon Ofoia,D,MR-O,105,Raw,,WA,102.7,,,,,,,,,230,247.5,-260,247.5,247.5,1985
1,M,Sean Gilliland,D,MR-O,120,Raw,,WA,110.1,,,,,,,,,210,227.5,-242.5,227.5,227.5,1977
1,M,James Crabtree,D,MR-O,120+,Raw,,WA,121.6,,,,,,,,,-230,230,-250,230,230,1979
1,M,Yoshiki Bell,D,MR-T3,74,Raw,,WA,69.4,,,,,,,,,165,180,195,195,195,1996
1,F,Christa Kollman,D,FR-M1a,72,Raw,,WA,69.4,,,,,,,,,100,105,-115,105,105,1976
1,F,Dorene DeMars,D,FR-M2a,84,Raw,,WA,83.2,,,,,,,,,112.5,115,-117.5,115,115,1966
1,F,Samantha LaRue,D,FR-T3,84+,Raw,,WA,94.7,,,,,,,,,85,90,95,95,95,1997
1,M,Jack Rankin,SBD,M-M3b,83,Single-ply,SSP,WA,82.2,180,-190,-190,180,87.5,92.5,-95,92.5,192.5,-197.5,197.5,197.5,470,1947
1,M,Rajjat Chauhan,SBD,M-O,66,Single-ply,,WA,65.1,190,200,-205,200,-95,100,112.5,112.5,190,205,-212.5,205,517.5,1997
1,M,Khemarintr Suwanchote Nuk,SBD,MR-Jr,59,Raw,SOS,WA,58.9,127.5,137.5,-142.5,137.5,110,115,117.5,117.5,195,215,-217.5,215,470,1993
1,M,Hugo Baixeras,SBD,MR-Jr,66,Raw,SSP,WA,66,152.5,-162.5,-162.5,152.5,92.5,97.5,100,100,197.5,207.5,-215,207.5,460,1992
2,M,Promepetch Suwanchote Nut,SBD,MR-Jr,66,Raw,SOS,WA,64.3,137.5,150,-155,150,92.5,100,105,105,182.5,192.5,-200,192.5,447.5,1994
3,M,Josh Crawford,SBD,MR-Jr,66,Raw,,WA,64.4,157.5,170,-180,170,92.5,95,-97.5,95,167.5,175,182.5,182.5,447.5,1995
4,M,Gustavo Gonzalez #1,SBD,MR-Jr,66,Raw,SOS,WA,64.8,125,-132.5,137.5,137.5,-85,85,-92.5,85,155,172.5,182.5,182.5,405,1995
5,M,Matthew Alvarez,SBD,MR-Jr,66,Raw,SOS,WA,66,102.5,125,-142.5,125,-75,85,95,95,142.5,-167.5,167.5,167.5,387.5,1994
6,M,Yen Le,SBD,MR-Jr,66,Raw,SOS,WA,64.8,125,130,135,135,80,85,-87.5,85,145,150,155,155,375,1995
1,M,Carlos Camacho,SBD,MR-Jr,74,Raw,,WA,71.8,-182.5,182.5,190,190,102.5,105,107.5,107.5,240,250,-260,250,547.5,1995
2,M,Rodney Sutherland,SBD,MR-Jr,74,Raw,REG,WA,74,185,-197.5,197.5,197.5,110,117.5,125,125,185,197.5,212.5,212.5,535,1994
3,M,Alex Orozco,SBD,MR-Jr,74,Raw,SOS,WA,74,175,185,-190,185,117.5,-130,-130,117.5,197.5,-215,-215,197.5,500,1992
4,M,Chester Padriquilla,SBD,MR-Jr,74,Raw,,WA,73.1,162.5,172.5,-182.5,172.5,97.5,102.5,110,110,170,175,187.5,187.5,470,1993
5,M,Joseph Dillon,SBD,MR-Jr,74,Raw,,WA,73,115,-125,125,125,85,92.5,-102.5,92.5,125,140,157.5,157.5,375,1992
6,M,Joseph Dillon,SBD,MR-Jr,74,Raw,,WA,73,115,-125,125,125,85,92.5,-102.5,92.5,125,140,157.5,157.5,375,1992
1,M,Mike Sedy,SBD,MR-Jr,83,Raw,,WA,81.5,205,227.5,-235,227.5,125,132.5,-135,132.5,227.5,240,245,245,605,1994
2,M,Kyungryul Kim,SBD,MR-Jr,83,Raw,,WA,82.1,-170,185,-190,185,135,-142.5,-142.5,135,222.5,232.5,237.5,237.5,557.5,1995
3,M,Austin Garrod,SBD,MR-Jr,83,Raw,,WA,81.6,195,200,212.5,212.5,-112.5,122.5,-130,122.5,205,-220,-220,205,540,1995
4,M,Tyler D Nguyen,SBD,MR-Jr,83,Raw,,WA,79.8,147.5,157.5,165,165,95,105,-112.5,105,185,192.5,207.5,207.5,477.5,1995
1,M,Jacob Fery,SBD,MR-Jr,93,Raw,,OR,92.2,200,210,220,220,140,147.5,-157.5,147.5,220,235,247.5,247.5,615,1994
2,M,Albert Kim,SBD,MR-Jr,93,Raw,,WA,87.4,207.5,217.5,-227.5,217.5,107.5,115,117.5,117.5,227.5,237.5,-240,237.5,572.5,1993
1,M,Peter Paul Paragas,SBD,MR-Jr,105,Raw,,WA,104.2,137.5,-147.5,-147.5,137.5,127.5,135,-140,135,102.5,125,-127.5,125,397.5,1995
1,M,Dan Neal,SBD,MR-M1a,74,Raw,,WA,72.6,-130,130,145,145,95,105,112.5,112.5,170,180,187.5,187.5,445,1975
2,M,Eden Brandeis,SBD,MR-M1a,74,Raw,,WA,73.3,125,135,145,145,80,85,-90,85,160,175,-190,175,405,1976
1,M,Jason Cruz,SBD,MR-M1a,83,Raw,,WA,81.1,117.5,130,137.5,137.5,125,135,-137.5,135,175,185,195,195,467.5,1975
1,M,Kevin Daniel,SBD,MR-M1a,105,Raw,,WA,104.3,160,182.5,-192.5,182.5,132.5,-137.5,-137.5,132.5,227.5,-242.5,247.5,247.5,562.5,1972
1,M,John Cardwell,SBD,MR-M1a,120+,Raw,TP2,WA,131,240,247.5,257.5,257.5,170,175,182.5,182.5,260,280,-290,280,720,1974
2,M,Troy Morse,SBD,MR-M1a,120+,Raw,,WA,122.9,205,220,227.5,227.5,130,140,147.5,147.5,220,232.5,240,240,615,1975
1,M,Ken Creta,SBD,MR-M1b,105,Raw,TP2,WA,97.6,192.5,205,215,215,142.5,150,157.5,157.5,250,257.5,262.5,262.5,635,1968
1,M,Chris Knauer,SBD,MR-M1b,120,Raw,,WA,117.6,102.5,160,182.5,182.5,172.5,-192.5,-192.5,172.5,102.5,182.5,227.5,227.5,582.5,1969
1,M,Todd Haltiner,SBD,MR-M1b,120+,Raw,TP2,WA,122.4,212.5,217.5,227.5,227.5,137.5,142.5,-147.5,142.5,227.5,242.5,-250,242.5,612.5,1969
1,M,Matt Muraoka,SBD,MR-M2a,66,Raw,,WA,64.6,107.5,112.5,117.5,117.5,107.5,-112.5,112.5,112.5,150,157.5,-162.5,157.5,387.5,1965
1,M,Wade Craig,SBD,MR-M2a,105,Raw,,WA,101.7,180,-200,200,200,130,142.5,150,150,195,215,240,240,590,1963
2,M,Brett Robbins,SBD,MR-M2a,105,Raw,TP2,WA,104.4,125,137.5,-140,137.5,115,120,122.5,122.5,190,192.5,205,205,465,1963
1,M,Dennis Dinning,SBD,MR-M2b,120+,Raw,,WA,128.9,-125,150,160,160,142.5,-155,-155,142.5,150,165,-180,165,467.5,1958
1,M,Daniel Rohrbach,SBD,MR-M3b,66,Raw,,WA,64,110,-115,115,115,80,82.5,-85,82.5,132.5,137.5,140,140,337.5,1947
1,M,Alan Tepper,SBD,MR-M4a,83,Raw,SSP,WA,82.1,142.5,-152.5,152.5,152.5,102.5,107.5,-112.5,107.5,190,200,205,205,465,1945
1,M,Robert Gilmore,SBD,MR-M5a,105,Raw,TP2,WA,104.2,47.5,-52.5,-57.5,47.5,70,75,77.5,77.5,70,90,-92.5,90,215,1935
1,M,Ronico Barin,SBD,MR-Jr,83,Raw,REG,WA,80.2,192.5,-205,-205,192.5,122.5,130,140,140,237.5,255,-262.5,255,587.5,1993
1,M,George Gentry,SBD,MR-M1a,105,Raw,WT,WA,95.8,145,160,170,170,-105,115,127.5,127.5,190,207.5,215,215,512.5,1976
1,M,Shane Shorter,SBD,MR-M1b,83,Raw,WT,WA,80.8,-125,-135,135,135,90,-95,95,95,182.5,197.5,200,200,430,1969
1,M,John Wood,SBD,MR-O,66,Raw,,WA,64.8,130,-132.5,132.5,132.5,102.5,107.5,-112.5,107.5,132.5,142.5,-152.5,142.5,382.5,1978
1,M,Ronico Barin,SBD,MR-O,83,Raw,REG,WA,80.2,192.5,-205,-205,192.5,122.5,130,140,140,237.5,255,-262.5,255,587.5,1993
1,M,Jesse Spear,SBD,MR-O,93,Raw,WT,WA,92.9,205,212.5,222.5,222.5,140,-145,-150,140,205,215,232.5,232.5,595,1981
2,M,Donald Rogers,SBD,MR-O,93,Raw,REG,WA,91.4,172.5,185,192.5,192.5,120,127.5,137.5,137.5,245,260,-272.5,260,590,1992
3,M,Johann Hindert,SBD,MR-O,93,Raw,WT,WA,86.4,160,-172.5,185,185,112.5,120,125,125,200,210,227.5,227.5,537.5,1980
1,M,Kyle Smith #11,SBD,MR-O,105,Raw,,WA,100.3,-212.5,227.5,230,230,127.5,137.5,147.5,147.5,215,230,240,240,617.5,1984
2,M,Tim Brown,SBD,MR-O,105,Raw,TP2,WA,103.5,192.5,205,-210,205,167.5,175,-180,175,217.5,227.5,-245,227.5,607.5,1986
3,M,Anders Hamlin,SBD,MR-O,105,Raw,WT,WA,98.1,135,145,155,155,100,107.5,-115,107.5,150,165,182.5,182.5,445,1983
1,M,Jacob Nelson,SBD,MR-O,120,Raw,WT,WA,117.3,227.5,237.5,245,245,122.5,127.5,137.5,137.5,-272.5,280,-290,280,662.5,1995
1,M,Choong Min,SBD,MR-O,59,Raw,,WA,59,105,115,120,120,65,67.5,-72.5,67.5,115,125,-130,125,312.5,1986
1,M,Rodney Sutherland,SBD,MR-O,74,Raw,REG,WA,74,185,-197.5,197.5,197.5,110,117.5,125,125,185,197.5,212.5,212.5,535,1994
2,M,Mikhail Seril,SBD,MR-O,74,Raw,,WA,72.8,175,180,-187.5,180,130,-132.5,-132.5,130,217.5,222.5,-227.5,222.5,532.5,1991
3,M,Justin Cadwell,SBD,MR-O,74,Raw,,WA,73.9,165,177.5,-187.5,177.5,102.5,115,-127.5,115,205,-220,220,220,512.5,1990
4,M,Martin Nguyen #2,SBD,MR-O,74,Raw,,WA,73,-155,157.5,-175,157.5,97.5,107.5,-112.5,107.5,197.5,207.5,-215,207.5,472.5,1985
5,M,Kevin Greene,SBD,MR-O,74,Raw,,WA,73.4,-162.5,172.5,-185,172.5,92.5,100,107.5,107.5,167.5,182.5,-190,182.5,462.5,1990
1,M,Justin Smith #5,SBD,MR-O,83,Raw,,WA,81.5,187.5,200,207.5,207.5,127.5,137.5,-140,137.5,207.5,227.5,235,235,580,1985
2,M,John Lawrence,SBD,MR-O,83,Raw,GCB,WA,81.5,192.5,205,-212.5,205,-110,110,-122.5,110,225,237.5,-245,237.5,552.5,1985
3,M,Sun Ly,SBD,MR-O,83,Raw,,WA,82.9,-210,-215,215,215,102.5,,,102.5,227.5,-245,-245,227.5,545,1991
4,M,Jaehun Paik,SBD,MR-O,83,Raw,,WA,79.4,142.5,155,165,165,-100,110,-112.5,110,190,207.5,225,225,500,1991
1,M,Ben Rice,SBD,MR-O,93,Raw,,WA,90.9,-260,260,272.5,272.5,155,162.5,167.5,167.5,310,327.5,-335,327.5,767.5,1989
2,M,Yerang Park,SBD,MR-O,93,Raw,,WA,90.2,207.5,217.5,230,230,127.5,137.5,142.5,142.5,225,242.5,255,255,627.5,1989
3,M,Daniel Colon,SBD,MR-O,93,Raw,,WA,89.7,200,215,227.5,227.5,125,135,142.5,142.5,205,220,235,235,605,1990
4,M,Trevor Bebee,SBD,MR-O,93,Raw,SSP,WA,92.9,197.5,205,210,210,122.5,130,-132.5,130,217.5,232.5,-240,232.5,572.5,1987
5,M,Alex Wellington-Fahey,SBD,MR-O,93,Raw,,WA,90,-175,187.5,-192.5,187.5,125,137.5,-150,137.5,215,222.5,232.5,232.5,557.5,1989
6,M,Tristan Honn,SBD,MR-O,93,Raw,TP2,WA,90.9,110,117.5,125,125,77.5,80,92.5,92.5,150,170,182.5,182.5,400,1987
7,M,Evan McAfee,SBD,MR-O,93,Raw,,WA,88.8,112.5,122.5,-137.5,122.5,-92.5,100,-112.5,100,142.5,162.5,-177.5,162.5,385,1983
1,M,Carlos Arbelaez,SBD,MR-O,105,Raw,TP2,WA,104.1,245,255,265,265,155,167.5,-175,167.5,265,272.5,287.5,287.5,720,1987
2,M,Luke Nilo,SBD,MR-O,105,Raw,TST,WA,100.9,237.5,252.5,-257.5,252.5,150,-160,160,160,240,260,270,270,682.5,1984
3,M,Rob Larson,SBD,MR-O,105,Raw,,WA,97.4,-192.5,197.5,207.5,207.5,170,-180,180,180,270,280,287.5,287.5,675,1983
4,M,Brandon Senn,SBD,MR-O,105,Raw,,OR,102.7,237.5,-247.5,-247.5,237.5,145,152.5,157.5,157.5,252.5,260,-292.5,260,655,1990
5,M,Micah Loucks,SBD,MR-O,105,Raw,TST,WA,103.1,-200,-212.5,215,215,137.5,145,147.5,147.5,247.5,272.5,280,280,642.5,1987
6,M,George Tramountanas,SBD,MR-O,105,Raw,,WA,103.5,195,205,-215,205,145,-157.5,-157.5,145,205,222.5,232.5,232.5,582.5,1985
7,M,Brett Wise,SBD,MR-O,105,Raw,TP2,WA,99.9,165,185,200,200,142.5,150,-155,150,185,200,227.5,227.5,577.5,1981
8,M,Michael Morris #3,SBD,MR-O,105,Raw,,WA,101.7,175,190,-205,190,130,135,-140,135,220,230,-242.5,230,555,1982
9,M,Oliver Parkinson,SBD,MR-O,105,Raw,,WA,99.2,160,170,182.5,182.5,155,-160,-165,155,200,212.5,-227.5,212.5,550,1980
10,M,Patrick Tuohy,SBD,MR-O,105,Raw,,WA,103.5,147.5,155,160,160,120,-130,-130,120,207.5,222.5,-232.5,222.5,502.5,1979
1,M,James Pearson,SBD,MR-O,120,Raw,,WA,118,282.5,292.5,300,300,192.5,200,205,205,300,322.5,-327.5,322.5,827.5,1984
2,M,Nathan Alexander #1,SBD,MR-O,120,Raw,,WA,117,245,260,-272.5,260,165,-175,-175,165,327.5,-347.5,-347.5,327.5,752.5,1982
3,M,Eli Perez,SBD,MR-O,120,Raw,,WA,119,245,257.5,272.5,272.5,195,-205,-205,195,272.5,-295,-295,272.5,740,1990
4,M,Glenn May,SBD,MR-O,120,Raw,TP2,WA,116.4,247.5,257.5,-272.5,257.5,155,160,165,165,260,275,-277.5,275,697.5,1981
5,M,Murphy Busek,SBD,MR-O,120,Raw,,WA,118.6,202.5,212.5,227.5,227.5,160,167.5,-170,167.5,277.5,292.5,-307.5,292.5,687.5,1989
6,M,David Shaw,SBD,MR-O,120,Raw,GCB,WA,107.7,142.5,-155,162.5,162.5,87.5,97.5,107.5,107.5,155,170,182.5,182.5,452.5,1986
7,M,Joseph McKinley,SBD,MR-O,120,Raw,,WA,114.4,140,147.5,160,160,97.5,-105,110,110,165,182.5,-187.5,182.5,452.5,1991
1,M,Gabriel Jackson,SBD,MR-O,120+,Raw,,WA,151.2,220,227.5,242.5,242.5,167.5,-182.5,182.5,182.5,312.5,-330,330,330,755,1982
2,M,Heriberto Martinez,SBD,MR-O,120+,Raw,,WA,134.7,227.5,-250,-250,227.5,167.5,182.5,197.5,197.5,250,-272.5,-272.5,250,675,1988
3,M,Issac Howard,SBD,MR-O,120+,Raw,REG,WA,126.7,195,205,207.5,207.5,150,-165,-165,150,230,240,245,245,602.5,1981
4,M,Nick Honomichl,SBD,MR-O,120+,Raw,SSP,WA,125.4,190,205,215,215,102.5,110,-115,110,222.5,240,-250,240,565,1978
DQ,M,James Crabtree,SBD,MR-O,120+,Raw,,WA,121.6,185,215,230,230,-130,-130,-130,,-230,230,-250,230,,1979
1,M,Kellan Cerrillo,SBD,MR-T1,66,Raw,,WA,59.3,72.5,-80,85,85,-55,57.5,60,60,92.5,-97.5,102.5,102.5,247.5,2002
1,M,Spencer Claque,SBD,MR-T2,74,Raw,TST,WA,72.8,160,182.5,185,185,105,-115,-115,105,190,-215,-227.5,190,480,1998
1,M,Samuel Shethar,SBD,MR-T2,83,Raw,,WA,80.6,-175,192.5,205,205,125,137.5,-147.5,137.5,185,212.5,235,235,577.5,1998
1,M,Travis Hagan,SBD,MR-T2,93,Raw,TP2,WA,84.6,137.5,155,-160,155,65,72.5,-85,72.5,160,175,182.5,182.5,410,1999
2,M,Tyler Hagan,SBD,MR-T2,93,Raw,TP2,WA,91.2,125,137.5,155,155,77.5,85,-92.5,85,137.5,160,-175,160,400,1999
1,M,Kody West,SBD,MR-T3,66,Raw,,WA,61.6,-205,205,-227.5,205,105,112.5,120,120,172.5,182.5,190,190,515,1996
2,M,Phuc Le,SBD,MR-T3,66,Raw,,WA,61.5,130,142.5,-155,142.5,-57.5,60,-62.5,60,170,182.5,192.5,192.5,395,1997
3,M,Zach Schnautz,SBD,MR-T3,66,Raw,,WA,64.1,-125,125,135,135,87.5,-97.5,-97.5,87.5,152.5,160,165,165,387.5,1997
1,M,Tyler T Nguyen,SBD,MR-T3,93,Raw,,WA,91.7,180,-187.5,-187.5,180,142.5,150,-155,150,182.5,192.5,202.5,202.5,532.5,1997
2,M,Ariel Garcia #2,SBD,MR-T3,93,Raw,SOS,WA,92.8,-150,157.5,167.5,167.5,115,-122.5,127.5,127.5,182.5,192.5,200,200,495,1996
3,M,Emilio Juarez,SBD,MR-T3,93,Raw,,WA,90,135,150,165,165,110,115,120,120,170,182.5,192.5,192.5,477.5,1997
4,M,Joshua Arriola,SBD,MR-T3,93,Raw,SOS,WA,88.8,140,150,155,155,-105,110,-112.5,110,182.5,192.5,200,200,465,1996
5,M,Abdullah Aldhahi,SBD,MR-T3,93,Raw,SOS,WA,92.6,140,147.5,157.5,157.5,102.5,-107.5,-107.5,102.5,182.5,192.5,-205,192.5,452.5,1997
6,M,Anthony Walsh,SBD,MR-T3,93,Raw,TP2,WA,88.7,65,77.5,-100,77.5,70,75,-80,75,85,100,137.5,137.5,290,1998
1,M,Kyle Harr,SBD,MR-Y2,35,Raw,,WA,33.2,50,-52.5,55,55,25,-30,30,30,70,75,80,80,165,2004
1,M,Andrew Creta,SBD,MR-Y3,74,Raw,TP2,WA,70.4,75,87.5,95,95,52.5,57.5,-65,57.5,100,115,-125,115,267.5,2002
1,M,Tyler Gilliland,SBD,MR-Y3,83,Raw,TP2,WA,81.1,82.5,92.5,102.5,102.5,60,67.5,-72.5,67.5,105,117.5,127.5,127.5,297.5,2002
1,M,Rajjat Chauhan,SBD,M-T3,66,Single-ply,,WA,65.1,190,200,-205,200,-95,100,112.5,112.5,190,205,-212.5,205,517.5,1997
1,M,Hudson Lonborg,SBD,M-T3,120+,Single-ply,TP2,WA,157.6,222.5,230,245,245,135,150,-165,150,265,292.5,-297.5,292.5,687.5,1997
1,F,Regina White,SBD,F-M1a,84+,Single-ply,TP1,WA,87.7,-165,165,170,170,85,97.5,-102.5,97.5,165,175,182.5,182.5,450,1975
1,F,Colleen Hansford,SBD,F-M1b,72,Single-ply,TP1,WA,71.3,-155,155,160,160,85,92.5,-100,92.5,160,167.5,-170,167.5,420,1968
DQ,F,Alma Kimura,SBD,F-M3a,72,Single-ply,SSP,WA,70.1,-137.5,-137.5,-137.5,,50,-55,-55,50,125,142.5,-150,142.5,,1954
1,F,Ailson McWeeny,SBD,F-O,63,Single-ply,TP1,WA,58.1,-35,35,40,40,47.5,55,-62.5,55,67.5,72.5,-82.5,72.5,167.5,1988
1,F,Andrea Page,SBD,F-O,84+,Single-ply,TP1,WA,111,205,215,-227.5,215,120,125,-137.5,125,192.5,205,-227.5,205,545,1977
1,F,Maily Ly,SBD,FR-Jr,57,Raw,,WA,56.5,62.5,70,-80,70,25,30,32.5,32.5,70,80,85,85,187.5,1995
2,F,Maily Ly,SBD,FR-Jr,57,Raw,,WA,56.5,62.5,70,-80,70,25,30,32.5,32.5,70,80,85,85,187.5,1995
1,F,Katherine Chinn,SBD,FR-Jr,63,Raw,,WA,60.6,85,87.5,-92.5,87.5,40,-43,45,45,87.5,95,-100.5,95,227.5,1992
1,F,Ashley Su'a,SBD,FR-Jr,84+,Raw,,WA,105.4,125,-132.5,-145,125,60,65,70,70,135,145,-157.5,145,340,1992
1,F,Amy Fischer,SBD,FR-M1a,47,Raw,TP1,WA,46,32.5,-37.5,-37.5,32.5,27.5,-37.5,-37.5,27.5,40,-47.5,-47.5,40,100,1975
1,F,Lisa Luckini,SBD,FR-M1a,72,Raw,TP1,WA,63.4,95,-102.5,-102.5,95,57.5,65,-70,65,110,117.5,120,120,280,1974
1,F,Rebecca Meister,SBD,FR-M1a,84+,Raw,TP1,WA,96,115,125,142.5,142.5,-57.5,57.5,65,65,137.5,145,-150,145,352.5,1976
2,F,Tobie Tyler,SBD,FR-M1a,84+,Raw,,WA,111.5,115,-120,-120,115,70,75,80,80,135,145,150,150,345,1976
3,F,Tobie Tyler,SBD,FR-M1a,84+,Raw,,WA,111.5,115,-120,-120,115,70,75,80,80,135,145,150,150,345,1976
1,F,April Harr,SBD,FR-M1b,47,Raw,,WA,46.7,-65,65,67.5,67.5,52.5,55,-57.5,55,82.5,90,95,95,217.5,1971
1,F,Marlina Velasco,SBD,FR-M1b,57,Raw,TP1,WA,57,47.5,60,-62.5,60,45,47.5,-52.5,47.5,75,80,92.5,92.5,200,1970
1,F,Isabelle Iliev,SBD,FR-M1b,63,Raw,,WA,62.4,112.5,117.5,122.5,122.5,75,80,-85,80,135,140,-145,140,342.5,1967
1,F,Raina Haltiner,SBD,FR-M1b,72,Raw,TP1,WA,71.4,107.5,112.5,117.5,117.5,67.5,70,-75,70,132.5,145,-150,145,332.5,1970
2,F,Cathy Belben,SBD,FR-M1b,72,Raw,TP1,WA,68.6,-45,45,52.5,52.5,47.5,52.5,-55,52.5,77.5,85,92.5,92.5,197.5,1967
1,F,Wendy Thomaston,SBD,FR-M1b,84+,Raw,,WA,120.8,-82.5,82.5,-85,82.5,62.5,65,67.5,67.5,127.5,-137.5,-137.5,127.5,277.5,1969
1,F,Roberta Carlson #1,SBD,FR-M2a,72,Raw,,WA,66.8,-105,105,112.5,112.5,55,62.5,-65,62.5,130,137.5,145,145,320,1965
1,F,Cindy Goodrich,SBD,FR-M2b,52,Raw,TP1,WA,50.2,57.5,60,65,65,52.5,-55,-55,52.5,92.5,100,105,105,222.5,1957
1,F,Denise Johnson,SBD,FR-M3b,52,Raw,SSP,WA,51.3,47.5,-52.5,57.5,57.5,35,37.5,40,40,80,-87.5,-87.5,80,177.5,1947
1,F,Leslie Macko,SBD,FR-M3b,63,Raw,,WA,61.7,-60,-60,60,60,32.5,37.5,-42.5,37.5,82.5,92.5,-97.5,92.5,190,1949
1,F,Bebe Burns,SBD,FR-M4a,52,Raw,SSP,WA,51,45,52.5,55,55,32.5,35,-40.5,35,65,70,76.5,76.5,166.5,1942
1,F,Abbey Moon,SBD,FR-M4a,57,Raw,,WA,55.5,45,52.5,-60,52.5,45,50,52.5,52.5,85,92.5,102.5,102.5,207.5,1944
1,F,Routh Thach,SBD,FR-O,52,Raw,,WA,51.1,97.5,102.5,105,105,-72.5,72.5,75,75,112.5,120,125,125,305,1987
1,F,Lori Sharon,SBD,FR-O,63,Raw,,WA,62.5,112.5,117.5,120,120,72.5,-77.5,-77.5,72.5,160,-165,-165,160,352.5,1983
2,F,Steffany Grace Tilton,SBD,FR-O,63,Raw,,WA,59.5,85,90,-95,90,-65,65,72.5,72.5,110,117.5,-120,117.5,280,
3,F,Maria Rodriquez,SBD,FR-O,63,Raw,GCB,WA,57.8,97.5,102.5,110,110,-55,57.5,62.5,62.5,95,105,-112.5,105,277.5,1990
4,F,Jacinda Howard,SBD,FR-O,63,Raw,GCB,WA,60.6,87.5,92.5,-97.5,92.5,45,47.5,-50,47.5,105,112.5,-117.5,112.5,252.5,1983
1,F,Seanae Rochester,SBD,FR-O,72,Raw,REG,WA,70.7,-130,132.5,137.5,137.5,75,-80,-80,75,162.5,167.5,175,175,387.5,1991
2,F,Madeline Scott,SBD,FR-O,72,Raw,,WA,70.5,130,-142.5,142.5,142.5,62.5,-67.5,-67.5,62.5,155,170,-180,170,375,1991
3,F,Maria Altamrino,SBD,FR-O,72,Raw,,WA,70.6,112.5,117.5,-120,117.5,65,67.5,70,70,122.5,130,-132.5,130,317.5,1988
4,F,Elizabeth Mahoney,SBD,FR-O,72,Raw,,WA,70,85,90,95,95,60,-62.5,62.5,62.5,102.5,110,115,115,272.5,1985
5,F,Jamie Mondejar,SBD,FR-O,72,Raw,TP1,WA,68.8,75,80,90,90,50,-55,-55,50,105,115,125,125,265,1980
6,F,Kay Humpherys,SBD,FR-O,72,Raw,,AZ,65.6,85,95,102.5,102.5,52.5,-60,-62.5,52.5,95,-105,107.5,107.5,262.5,1988
7,F,Morgan Jones,SBD,FR-O,72,Raw,,WA,67.6,-77.5,-77.5,77.5,77.5,42.5,-50,50,50,77.5,85,-95,85,212.5,1988
1,F,Nicole Tribble,SBD,FR-O,84,Raw,GCB,WA,73.9,95,102.5,107.5,107.5,50,-52.5,52.5,52.5,117.5,127.5,-135,127.5,287.5,1982
1,F,Ashley Prichard,SBD,FR-O,84+,Raw,SSP,WA,112.6,187.5,200,205,205,50,52.5,60,60,205,217.5,-227.5,217.5,482.5,1985
2,F,Sarah Albert,SBD,FR-O,84+,Raw,GCB,WA,89.8,95,-102.5,-102.5,95,57.5,-62.5,-62.5,57.5,115,120,-127.5,120,272.5,1982
1,F,Faith Morse,SBD,FR-T1,63,Raw,,WA,59.9,103,-107.5,-107.5,103,-47.5,47.5,50,50,130,132.5,-137.5,132.5,285.5,2001
2,F,Taylor Cerrillo,SBD,FR-T1,63,Raw,,WA,61.4,70,72.5,-80,72.5,47.5,50,-55,50,90,97.5,102.5,102.5,225,2000
1,F,Isabelle Johnson,SBD,FR-T2,63,Raw,SSP,WA,62.3,70,77.5,82.5,82.5,47.5,52.5,-55,52.5,102.5,107.5,-115,107.5,242.5,1999
1,F,Keely Sadettanh,SBD,FR-T2,72,Raw,,WA,69.1,75,77.5,80,80,65,-67.5,-67.5,65,125,135,142.5,142.5,287.5,1998
1,F,Catherine Ticzon,SBD,FR-T3,63,Raw,,WA,62.7,92.5,97.5,-102.5,97.5,47.5,52.5,-55,52.5,112.5,115,-117.5,115,265,1996
2,F,Kara Phillips,SBD,FR-T3,63,Raw,,WA,61.9,80,85,-90,85,50,-52.5,-52.5,50,90,95,-100,95,230,1997
1,F,Andrea Muraoka,SBD,FR-T3,84+,Raw,,WA,99.1,105,107.5,112.5,112.5,67.5,-75,-75,67.5,125,135,145,145,325,1997
DQ,F,Amanda Stewart,SBD,F-T2,84,Single-ply,TP1,WA,79.4,-145,-145,-150,,,,,,,,,,,1999
