Division,WeightClassKg,Place,Name,Team,BodyweightKg,Best3SquatKg,Best3BenchKg,Best3DeadliftKg,TotalKg,Equipment,Event,Sex,BirthDate
Boys,51.71,1,Justin Moss,Burleson,50.35,165.56,92.99,158.76,417.3,Single-ply,SBD,M,
Boys,51.71,2,Coal Aylesworth,Burleson Centennial,51.71,158.76,90.72,158.76,408.23,Single-ply,SBD,M,
Boys,51.71,3,Rodolfo Cruz,Cleburne,48.53,117.93,56.7,120.2,294.84,Single-ply,SBD,M,
Boys,55.79,1,Ryan McCullough,Burleson,53.98,147.42,95.25,156.49,399.16,Single-ply,SBD,M,
Boys,55.79,2,Grayson Thomas,Burleson,55.79,151.95,88.45,151.95,392.36,Single-ply,SBD,M,
Boys,55.79,3,Aidan Tran,Crowley,55.79,133.81,79.38,161.03,374.21,Single-ply,SBD,M,
Boys,55.79,4,Trevor Harrington,Burleson Centennial,55.34,124.74,68.04,136.08,328.85,Single-ply,SBD,M,
Boys,59.87,1,Matthew Smith,Burleson,59.87,174.63,97.52,176.9,449.06,Single-ply,SBD,M,
Boys,59.87,2,Chase Swinney,Burleson Centennial,59.87,158.76,92.99,161.03,412.77,Single-ply,SBD,M,
Boys,59.87,3,Nicholas Charles,Burleson Centennial,59.42,127.01,88.45,147.42,362.87,Single-ply,SBD,M,
Boys,59.87,4,Landry Leigh,Cleburne,58.06,129.27,74.84,136.08,340.19,Single-ply,SBD,M,
Boys,59.87,5,Nicholas Rizo,Crowley,59.87,111.13,70.31,122.47,303.91,Single-ply,SBD,M,
Boys,59.87,6,Brien Wallis,Burleson,59.87,92.99,58.97,122.47,274.42,Single-ply,SBD,M,
Boys,67.13,1,Christian Negrete,Burleson,65.77,206.38,111.13,204.12,521.63,Single-ply,SBD,M,
Boys,67.13,2,Nick Lammond,Burleson Centennial,65.77,167.83,97.52,183.7,449.06,Single-ply,SBD,M,
Boys,67.13,3,Maverick Hurd,Burleson Centennial,64.86,154.22,102.06,172.37,428.64,Single-ply,SBD,M,
Boys,67.13,4,Johnny Van Cleef,Burleson Centennial,64.41,149.69,79.38,158.76,387.82,Single-ply,SBD,M,
Boys,67.13,5,Aiden Juarez,Burleson,64.86,131.54,88.45,161.03,381.02,Single-ply,SBD,M,
Boys,67.13,6,Dillan Jones,Cleburne,63.5,142.88,90.72,142.88,376.48,Single-ply,SBD,M,
Boys,67.13,7,Jackson Hunter,Burleson Centennial,67.13,140.61,86.18,147.42,374.21,Single-ply,SBD,M,
Boys,67.13,8,Max Cary,Cleburne,63.5,142.88,65.77,127.01,335.66,Single-ply,SBD,M,
Boys,67.13,DQ,Matthew Lopez,Burleson Centennial,65.77,,,,,Single-ply,SBD,M,
Boys,74.84,1,Johnathan Cranford,Burleson,72.12,249.48,165.56,206.38,621.42,Single-ply,SBD,M,
Boys,74.84,2,Jabari Smith,Burleson,69.85,208.65,106.59,192.78,508.02,Single-ply,SBD,M,
Boys,74.84,3,Tony Hernandez,Cleburne,71.67,174.63,111.13,179.17,464.93,Single-ply,SBD,M,
Boys,74.84,4,Lance Sansom,Cleburne,73.48,172.37,68.04,172.37,412.77,Single-ply,SBD,M,
Boys,74.84,5,Eli Martinez,Cleburne,73.03,158.76,79.38,172.37,410.5,Single-ply,SBD,M,
Boys,74.84,6,Hayden Byrd,Burleson Centennial,71.67,181.44,70.31,140.61,392.36,Single-ply,SBD,M,
Boys,74.84,7,Carlos Caridad,Burleson Centennial,73.03,136.08,108.86,147.42,392.36,Single-ply,SBD,M,
Boys,74.84,8,Deacon Presley,Burleson,70.31,156.49,74.84,156.49,387.82,Single-ply,SBD,M,
Boys,74.84,9,Javier Huerta,Crowley,68.49,127.01,83.91,158.76,369.68,Single-ply,SBD,M,
Boys,74.84,10,Enrique Gonzalez,Crowley,72.12,115.67,79.38,142.88,337.93,Single-ply,SBD,M,
Boys,74.84,11,Trentyn Madison,Crowley,73.03,113.4,81.65,136.08,331.12,Single-ply,SBD,M,
Boys,82.1,1,Andrew Freese,Burleson,81.19,213.19,136.08,219.99,569.26,Single-ply,SBD,M,
Boys,82.1,2,Ethan Hernandez,Burleson,81.19,213.19,124.74,229.06,566.99,Single-ply,SBD,M,
Boys,82.1,3,Jess Ackerman,Burleson,82.1,219.99,120.2,206.38,546.58,Single-ply,SBD,M,
Boys,82.1,4,Chris Maher,Cleburne,81.19,197.31,113.4,181.44,492.15,Single-ply,SBD,M,
Boys,82.1,5,Nicholas Alvarado,Cleburne,78.93,170.1,102.06,190.51,462.66,Single-ply,SBD,M,
Boys,82.1,6,Tucker Breitling,Burleson Centennial,77.56,161.03,92.99,174.63,428.64,Single-ply,SBD,M,
Boys,82.1,7,Cade Bomar,Burleson,77.56,138.35,92.99,142.88,374.21,Single-ply,SBD,M,
Boys,89.81,1,Eric Juarez,Cleburne,89.81,170.1,108.86,183.7,462.66,Single-ply,SBD,M,
Boys,89.81,2,Christian Blake,Crowley,86.18,142.88,106.59,192.78,442.25,Single-ply,SBD,M,
Boys,89.81,3,Jordan Doucet,Burleson Centennial,84.37,158.76,113.4,158.76,430.91,Single-ply,SBD,M,
Boys,89.81,4,Nikolas Hart,Burleson Centennial,87.54,136.08,115.67,170.1,421.84,Single-ply,SBD,M,
Boys,89.81,5,Colton Burns,Burleson Centennial,86.18,102.06,81.65,106.59,290.3,Single-ply,SBD,M,
Boys,89.81,DQ,Letron King,Crowley,85.73,158.76,,,,Single-ply,SBD,M,
Boys,99.79,1,Gabe Serna,Burleson Centennial,97.52,192.78,161.03,204.12,557.92,Single-ply,SBD,M,
Boys,99.79,2,Xavier Aguilar,Cleburne,91.63,174.63,122.47,183.7,480.81,Single-ply,SBD,M,
Boys,99.79,3,Damian Muniz,Cleburne,92.99,179.17,108.86,161.03,449.06,Single-ply,SBD,M,
Boys,99.79,4,Lakota Landeros,Cleburne,92.53,170.1,90.72,183.7,444.52,Single-ply,SBD,M,
Boys,99.79,5,Reid Gambrell,Burleson Centennial,93.89,167.83,102.06,167.83,437.72,Single-ply,SBD,M,
Boys,99.79,6,Mehki Ford,Crowley,90.26,136.08,108.86,174.63,419.57,Single-ply,SBD,M,
Boys,99.79,7,Jayden Mhoon,Crowley,98.88,142.88,117.93,151.95,412.77,Single-ply,SBD,M,
Boys,109.77,1,Izaiah Perry,Burleson,107.05,263.08,172.37,222.26,657.71,Single-ply,SBD,M,
Boys,109.77,2,Evan Warren,Crowley,106.59,244.94,129.27,219.99,594.21,Single-ply,SBD,M,
Boys,109.77,3,Josh Garcia,Burleson Centennial,107.95,195.04,158.76,206.38,560.19,Single-ply,SBD,M,
Boys,109.77,4,Jake Stacey,Burleson Centennial,107.95,208.65,158.76,183.7,551.11,Single-ply,SBD,M,
Boys,109.77,5,Jack Long,Burleson Centennial,103.42,195.04,142.88,204.12,542.04,Single-ply,SBD,M,
Boys,109.77,6,Joel Smith,Burleson,101.15,208.65,138.35,192.78,539.77,Single-ply,SBD,M,
Boys,109.77,7,Dc Thompson,Crowley,102.97,183.7,142.88,206.38,532.97,Single-ply,SBD,M,
Boys,109.77,8,Jayden Ferguson,Burleson Centennial,105.69,165.56,111.13,183.7,460.4,Single-ply,SBD,M,
Boys,109.77,9,Priest Ashe,Crowley,102.97,124.74,108.86,181.44,415.04,Single-ply,SBD,M,
Boys,109.77,10,Ronald Dancer,Burleson Centennial,101.6,95.25,90.72,154.22,340.19,Single-ply,SBD,M,
Boys,124.74,1,Jesus Ramirez,Cleburne,117.48,242.67,136.08,242.67,621.42,Single-ply,SBD,M,
Boys,124.74,2,Donald Thompson,Crowley,124.74,226.8,142.88,204.12,573.79,Single-ply,SBD,M,
Boys,124.74,3,Jp Martinez,Cleburne,122.47,190.51,117.93,206.38,514.83,Single-ply,SBD,M,
Boys,139.71+,1,Colin Preston,Crowley,156.94,115.67,70.31,151.95,337.93,Single-ply,SBD,M,
Boys,,NS,Darius Miller,Crowley,,,,,,Single-ply,SBD,M,
Boys,,NS,David Batten,Burleson Centennial,,,,,,Single-ply,SBD,M,
