Division,WeightClassKg,Place,Name,Team,BodyweightKg,Best3SquatKg,Best3BenchKg,Best3DeadliftKg,TotalKg,Equipment,Event,Sex
Boys,51.71,1,Toni Ogunsola,Frisco,49.71,124.74,58.97,120.2,303.91,Single-ply,SBD,M
Boys,51.71,2,Donovan Hayes,Frisco Centennial,51.07,122.47,58.97,117.93,299.37,Single-ply,SBD,M
Boys,51.71,3,Axel Banks,Denison,49.76,90.72,54.43,95.25,240.4,Single-ply,SBD,M
Boys,51.71,4,Simon Lafond,Garland Rowlett,51.12,83.91,52.16,88.45,224.53,Single-ply,SBD,M
Boys,51.71,5,Blake Weaver,Frisco Heritage,46.72,63.5,38.56,70.31,172.37,Single-ply,SBD,M
Boys,51.71,DQ,Luke Duvall,North Mesquite,51.71,,,,,Single-ply,SBD,M
Boys,51.71,DQ,Matthew Castillo,North Mesquite,51.71,,,,,Single-ply,SBD,M
Boys,51.71,DQ,Joey Silva,Garland Sachse,51.71,,,,,Single-ply,SBD,M
Boys,51.71,DQ,Haif Martinez,Lewisville The Colony,50.48,,,,,Single-ply,SBD,M
Boys,51.71,DQ,Victor Peluso,Frisco Wakeland,50.76,,,,,Single-ply,SBD,M
Boys,55.79,1,Allen Morales,Frisco Centennial,55.7,158.76,72.57,174.63,405.97,Single-ply,SBD,M
Boys,55.79,2,Duck Guillory,Frisco Centennial,55.66,142.88,86.18,170.1,399.16,Single-ply,SBD,M
Boys,55.79,3,Stephen Nelson,Denison,55.75,133.81,79.38,147.42,360.61,Single-ply,SBD,M
Boys,55.79,4,Corey Chappell,Garland Rowlett,54.34,120.2,74.84,129.27,324.32,Single-ply,SBD,M
Boys,55.79,5,Dongchan Kim,Frisco,55.11,127.01,65.77,106.59,299.37,Single-ply,SBD,M
Boys,59.87,6,Michael Dvorak,Garland Rowlett,55.84,90.72,61.23,133.81,285.76,Single-ply,SBD,M
Boys,55.79,7,Houston Patterson,Justin Northwest,54.39,102.06,58.97,122.47,283.5,Single-ply,SBD,M
Boys,55.79,8,Brandon Kaprelian,Coppell,54.88,113.4,65.77,102.06,281.23,Single-ply,SBD,M
Boys,59.87,DQ,Steven Rios,Carrollton Turner,55.93,,,,,Single-ply,SBD,M
Boys,55.79,DQ,Dimitri Sommer,Lewisville The Colony,55.57,140.61,,,,Single-ply,SBD,M
Boys,59.87,1,Sonny Khokar,Frisco Wakeland,58.15,190.51,108.86,208.65,508.02,Single-ply,SBD,M
Boys,67.13,2,Richard Hernandez,Lewisville The Colony,60.1,206.38,120.2,181.44,508.02,Single-ply,SBD,M
Boys,67.13,3,Jeff Troutman,Coppell,60.1,170.1,86.18,197.31,453.59,Single-ply,SBD,M
Boys,59.87,4,Carlos Bravo,Lewisville The Colony,57.52,165.56,83.91,174.63,424.11,Single-ply,SBD,M
Boys,59.87,5,Nick Baril,Frisco Centennial,59.51,115.67,79.38,122.47,317.51,Single-ply,SBD,M
Boys,59.87,DQ,Cody McSwain,Garland Sachse,59.87,,,,,Single-ply,SBD,M
Boys,59.87,DQ,Geraldo Romo,North Mesquite,59.87,,,,,Single-ply,SBD,M
Boys,67.13,1,Stefan Sommer,Lewisville The Colony,62.37,213.19,102.06,181.44,496.68,Single-ply,SBD,M
Boys,67.13,2,Rhickie Wood,Garland Sachse,65.27,176.9,113.4,185.97,476.27,Single-ply,SBD,M
Boys,74.84,3,Zach Daniel,Denison,67.36,174.63,92.99,195.04,462.66,Single-ply,SBD,M
Boys,74.84,4,Austin Turturro,Frisco Liberty,67.31,170.1,117.93,145.15,433.18,Single-ply,SBD,M
Boys,67.13,5,Casey Obenshain,Justin Northwest,66.04,149.69,99.79,181.44,430.91,Single-ply,SBD,M
Boys,67.13,6,Bradley Beck,McKinney,63.59,136.08,86.18,149.69,371.95,Single-ply,SBD,M
Boys,67.13,7,Chris Gauiter,Frisco Centennial,66.13,145.15,102.06,124.74,371.95,Single-ply,SBD,M
Boys,67.13,8,Cameron Peters,Frisco Centennial,63,108.86,77.11,117.93,303.91,Single-ply,SBD,M
Boys,67.13,DQ,Tim Sanders,Lewisville The Colony,66.81,213.19,113.4,,,Single-ply,SBD,M
Boys,67.13,DQ,Clayton Trout,McKinney North,67.13,,,,,Single-ply,SBD,M
Boys,67.13,DQ,Cory Saunders,McKinney North,62.55,,,,,Single-ply,SBD,M
Boys,67.13,DQ,Nate Jones,Lewisville The Colony,66.22,,,,,Single-ply,SBD,M
Boys,82.1,1,Cory Sayler,Lewisville The Colony,75.02,272.16,147.42,249.48,669.05,Single-ply,SBD,M
Boys,82.1,2,Brandon Moore,Carrollton Turner,74.89,195.04,106.59,210.92,512.56,Single-ply,SBD,M
Boys,82.1,3,Vincent Chavez,Frisco Centennial,75.02,190.51,113.4,181.44,485.34,Single-ply,SBD,M
Boys,74.84,4,Brandon Myles,North Mesquite,71.58,172.37,102.06,172.37,446.79,Single-ply,SBD,M
Boys,74.84,5,Jarred Askins,Frisco,73.53,158.76,111.13,158.76,428.64,Single-ply,SBD,M
Boys,74.84,6,Armani Edwards,Frisco Liberty,72.76,185.97,102.06,136.08,424.11,Single-ply,SBD,M
Boys,74.84,7,Dylan Stubbe,Justin Northwest,68.58,158.76,81.65,172.37,412.77,Single-ply,SBD,M
Boys,74.84,8,Brennan Sooter,Justin Northwest,71.35,154.22,90.72,158.76,403.7,Single-ply,SBD,M
Boys,74.84,9,Travis Barnes,Frisco,72.98,136.08,90.72,170.1,396.89,Single-ply,SBD,M
Boys,74.84,10,Brian Stocker,McKinney North,73.03,142.88,88.45,163.29,394.63,Single-ply,SBD,M
Boys,74.84,11,Brian Dupree,Richardson Lake Highlands,74.62,136.08,95.25,163.29,394.63,Single-ply,SBD,M
Boys,74.84,12,Christian Han,Coppell,74.43,154.22,79.38,151.95,385.55,Single-ply,SBD,M
Boys,74.84,13,Ross Abraham,Frisco Centennial,73.16,140.61,83.91,149.69,374.21,Single-ply,SBD,M
Boys,74.84,14,Collin Olsen,Lewisville The Colony,73.03,131.54,77.11,151.95,360.61,Single-ply,SBD,M
Boys,74.84,15,Anthony Mitchell,Frisco Wakeland,74.48,147.42,74.84,133.81,356.07,Single-ply,SBD,M
Boys,74.84,16,Logan Miller,Frisco Centennial,69.54,120.2,72.57,124.74,317.51,Single-ply,SBD,M
Boys,74.84,17,Juan Washington,Frisco Heritage,69.31,111.13,72.57,120.2,303.91,Single-ply,SBD,M
Boys,74.84,DQ,Jaquille Myles,Richardson Lake Highlands,74.84,,,,,Single-ply,SBD,M
Boys,74.84,DQ,Michael Silvosa,Frisco Heritage,68.58,,,,,Single-ply,SBD,M
Boys,82.1,DQ,Collin Charles,Frisco Heritage,75.07,,,,,Single-ply,SBD,M
Boys,74.84,DQ,Ryan Lim,Frisco Centennial,68.27,,,,,Single-ply,SBD,M
Boys,74.84,DQ,Michael Sadowski,Carrollton Turner,72.39,,,,,Single-ply,SBD,M
Boys,74.84,DQ,Aaron McCarthy,Lewisville The Colony,74.84,,,,,Single-ply,SBD,M
Boys,82.1,DQ,Matt Munoz,McKinney,75.02,,,,,Single-ply,SBD,M
Boys,74.84,DQ,Colton Roelofs,Justin Northwest,74.84,,,,,Single-ply,SBD,M
Boys,74.84,DQ,Andrew Beckman,Lewisville The Colony,74.84,,,,,Single-ply,SBD,M
Boys,74.84,DQ,Jamiah Ellis,Garland Rowlett,73.39,,,,,Single-ply,SBD,M
Boys,74.84,DQ,Trey Williams,McKinney North,74.48,142.88,,,,Single-ply,SBD,M
Boys,82.1,1,Justin Murphy,Lewisville The Colony,81.74,235.87,142.88,233.6,612.35,Single-ply,SBD,M
Boys,82.1,2,Blake Kozeny,Frisco Liberty,81.19,238.14,131.54,208.65,578.33,Single-ply,SBD,M
Boys,82.1,3,Tanner Haynie,Lewisville The Colony,81.15,249.48,113.4,210.92,573.79,Single-ply,SBD,M
Boys,82.1,4,Austin Arnold,Denison,81.6,201.85,149.69,206.38,557.92,Single-ply,SBD,M
Boys,89.81,5,Trez Robinson,Frisco Wakeland,82.28,215.46,122.47,219.99,557.92,Single-ply,SBD,M
Boys,82.1,6,Cody Montgomery,McKinney,80.38,192.78,124.74,217.72,535.24,Single-ply,SBD,M
Boys,82.1,7,Mike Denton,Lewisville The Colony,81.96,210.92,86.18,210.92,508.02,Single-ply,SBD,M
Boys,89.81,8,Cameron Langer,Justin Northwest,82.28,176.9,122.47,208.65,508.02,Single-ply,SBD,M
Boys,82.1,9,Lakelon Rice,Frisco Centennial,78.61,204.12,117.93,183.7,505.76,Single-ply,SBD,M
Boys,82.1,10,Horace Borders,North Mesquite,81.01,201.85,113.4,181.44,496.68,Single-ply,SBD,M
Boys,82.1,11,Calvin Estrada,Garland Rowlett,78.02,170.1,108.86,188.24,467.2,Single-ply,SBD,M
Boys,82.1,12,Keegan McCarthy,Garland Sachse,76.2,181.44,108.86,172.37,462.66,Single-ply,SBD,M
Boys,82.1,13,Quay McConic,Frisco Heritage,78.97,183.7,113.4,165.56,462.66,Single-ply,SBD,M
Boys,89.81,14,Shay McConic,Frisco Heritage,82.19,181.44,108.86,165.56,455.86,Single-ply,SBD,M
Boys,82.1,15,Logan Matamoros,Frisco Centennial,79.74,167.83,111.13,174.63,453.59,Single-ply,SBD,M
Boys,82.1,16,Derek Dieter,Frisco,80.65,188.24,92.99,172.37,453.59,Single-ply,SBD,M
Boys,89.81,17,Christian Minies,Garland Sachse,82.28,149.69,102.06,201.85,453.59,Single-ply,SBD,M
Boys,82.1,18,Blake Glenn,Garland Rowlett,78.79,142.88,102.06,179.17,424.11,Single-ply,SBD,M
Boys,82.1,19,Cameron Newton,McKinney North,79.38,151.95,95.25,167.83,415.04,Single-ply,SBD,M
Boys,82.1,20,Mac Fitzgerald,Frisco Centennial,81.42,136.08,97.52,181.44,415.04,Single-ply,SBD,M
Boys,82.1,21,Connor Lane,Frisco Centennial,80.38,154.22,79.38,158.76,392.36,Single-ply,SBD,M
Boys,82.1,22,Jon Le,Frisco Centennial,75.89,140.61,74.84,158.76,374.21,Single-ply,SBD,M
Boys,82.1,23,Jk Babers,Frisco Heritage,77.75,129.27,77.11,122.47,328.85,Single-ply,SBD,M
Boys,82.1,DQ,Chris Hayes,Frisco Centennial,82.1,,,,,Single-ply,SBD,M
Boys,82.1,DQ,Efe Nesiama,Coppell,82.1,,,,,Single-ply,SBD,M
Boys,82.1,DQ,Brandon Burgess,McKinney,82.1,,,,,Single-ply,SBD,M
Boys,82.1,DQ,Garrett Garner,McKinney,82.1,,,,,Single-ply,SBD,M
Boys,82.1,DQ,Josh Tristan,Lewisville The Colony,82.1,,,,,Single-ply,SBD,M
Boys,82.1,DQ,Brandon Lowery,Garland Sachse,80.69,,,,,Single-ply,SBD,M
Boys,89.81,1,Jeff Stevens #2,Justin Northwest,88.9,226.8,151.95,249.48,628.23,Single-ply,SBD,M
Boys,89.81,2,Tanner Anglin,Frisco Centennial,89.81,222.26,138.35,249.48,610.08,Single-ply,SBD,M
Boys,89.81,3,Zack Knickman,Richardson Lake Highlands,88.63,204.12,165.56,226.8,596.47,Single-ply,SBD,M
Boys,89.81,4,Aaron Bailey,Frisco Wakeland,86.95,208.65,124.74,208.65,542.04,Single-ply,SBD,M
Boys,89.81,5,Zach Wilmany,Garland Rowlett,82.74,197.31,124.74,210.92,532.97,Single-ply,SBD,M
Boys,89.81,6,Tom Nguyen,Garland Rowlett,85.46,183.7,115.67,219.99,519.36,Single-ply,SBD,M
Boys,89.81,7,Chuck Oputiva,North Mesquite,89.77,185.97,108.86,213.19,508.02,Single-ply,SBD,M
Boys,99.79,8,Fredis De La Rosa,Carrollton Turner,89.99,195.04,122.47,181.44,498.95,Single-ply,SBD,M
Boys,89.81,9,Alex Zywicki,McKinney,85.55,181.44,106.59,181.44,469.47,Single-ply,SBD,M
Boys,89.81,10,Taylor Ray #2,McKinney North,87.09,174.63,97.52,174.63,446.79,Single-ply,SBD,M
Boys,89.81,11,Alex Hicks #1,Frisco Heritage,88.59,122.47,95.25,140.61,358.34,Single-ply,SBD,M
Boys,89.81,12,Steven Obiselu,Frisco Heritage,82.78,127.01,70.31,117.93,315.25,Single-ply,SBD,M
Boys,89.81,13,Lohit Adusumilli,Frisco Heritage,89.04,92.99,61.23,97.52,251.74,Single-ply,SBD,M
Boys,89.81,DQ,Teddie Pegues,Richardson Lake Highlands,89.81,,,,,Single-ply,SBD,M
Boys,89.81,DQ,Jim Charles,Frisco Heritage,89.81,,,,,Single-ply,SBD,M
Boys,89.81,DQ,Jacob Kohlschmidt,McKinney,89.72,,,,,Single-ply,SBD,M
Boys,89.81,DQ,Agustine Zavala,McKinney,86.5,,,,,Single-ply,SBD,M
Boys,89.81,DQ,Ishmail Miles,Garland Sachse,89.54,,,,,Single-ply,SBD,M
Boys,99.79,DQ,Corbin Boettger,Denison,90.04,,,,,Single-ply,SBD,M
Boys,89.81,DQ,Chris Hendricks,Frisco Wakeland,84.19,,,,,Single-ply,SBD,M
Boys,99.79,1,Reggie Wilcox,Frisco Wakeland,98.29,249.48,151.95,254.01,655.44,Single-ply,SBD,M
Boys,99.79,2,Naveed Amirihkmat,Coppell,94.12,210.92,158.76,219.99,589.67,Single-ply,SBD,M
Boys,99.79,3,Shane King,Justin Northwest,97.79,235.87,111.13,229.06,576.06,Single-ply,SBD,M
Boys,99.79,4,Desmond Scott,North Mesquite,91.85,217.72,113.4,226.8,557.92,Single-ply,SBD,M
Boys,99.79,5,Chad Pennywell,Frisco Wakeland,99.43,226.8,127.01,199.58,553.38,Single-ply,SBD,M
Boys,99.79,6,Kyandrea Choice,Garland Sachse,95.84,190.51,131.54,215.46,537.51,Single-ply,SBD,M
Boys,99.79,7,Derek Lanham,Lewisville The Colony,91.99,222.26,106.59,204.12,532.97,Single-ply,SBD,M
Boys,99.79,8,Michael Ray #2,Justin Northwest,93.03,199.58,117.93,208.65,526.17,Single-ply,SBD,M
Boys,99.79,9,Sir Wells,Lewisville The Colony,94.17,226.8,90.72,206.38,523.9,Single-ply,SBD,M
Boys,99.79,10,David Montenegro,Carrollton Turner,93.44,210.92,142.88,167.83,521.63,Single-ply,SBD,M
Boys,99.79,11,Adam Borne,Frisco Liberty,94.3,199.58,124.74,174.63,498.95,Single-ply,SBD,M
Boys,99.79,12,Michael Quast,Coppell,91.63,190.51,131.54,174.63,496.68,Single-ply,SBD,M
Boys,99.79,13,Cameron Gschwend,Frisco Centennial,91.76,215.46,102.06,174.63,492.15,Single-ply,SBD,M
Boys,99.79,14,Ryan Joyce,Frisco Centennial,97.02,190.51,104.33,190.51,485.34,Single-ply,SBD,M
Boys,99.79,15,Fizz Hosain,Frisco,94.8,181.44,113.4,188.24,483.08,Single-ply,SBD,M
Boys,99.79,16,Derek Gourley,Frisco,92.12,170.1,117.93,188.24,476.27,Single-ply,SBD,M
Boys,99.79,17,Jeremy Seligsohn,Frisco Wakeland,98.11,183.7,97.52,174.63,455.86,Single-ply,SBD,M
Boys,99.79,18,John Chesser,Denison,95.84,154.22,102.06,163.29,419.57,Single-ply,SBD,M
Boys,99.79,19,Tarren Caskaddon,Frisco Heritage,94.66,124.74,92.99,161.03,378.75,Single-ply,SBD,M
Boys,99.79,DQ,Chris Ojegba,Richardson Lake Highlands,93.49,163.29,,,,Single-ply,SBD,M
Boys,99.79,DQ,Garrett Reeves,Richardson Lake Highlands,99.79,,,,,Single-ply,SBD,M
Boys,99.79,DQ,William Udeh,Coppell,97.07,158.76,,,,Single-ply,SBD,M
Boys,99.79,DQ,Spencer McDuffy,Frisco Liberty,99.79,,,,,Single-ply,SBD,M
Boys,99.79,DQ,Matt Spradling,McKinney,99.79,,,,,Single-ply,SBD,M
Boys,109.77,1,Josh Morrison,Lewisville The Colony,109.72,317.51,185.97,247.21,750.7,Single-ply,SBD,M
Boys,109.77,2,Austin Vela,Frisco Wakeland,107.73,267.62,183.7,240.4,691.73,Single-ply,SBD,M
Boys,109.77,3,Joe Bergeron,North Mesquite,101.6,249.48,147.42,251.74,648.64,Single-ply,SBD,M
Boys,109.77,4,Tyrone Melton,Garland Sachse,103.78,226.8,151.95,233.6,612.35,Single-ply,SBD,M
Boys,109.77,5,Robby Murray,Lewisville The Colony,109.5,226.8,142.88,219.99,589.67,Single-ply,SBD,M
Boys,109.77,6,Clayton McGilvray,Justin Northwest,101.6,226.8,111.13,204.12,542.04,Single-ply,SBD,M
Boys,124.74,7,Sam Preston,Lewisville The Colony,110,208.65,120.2,206.38,535.24,Single-ply,SBD,M
Boys,109.77,8,Abel Palma,McKinney North,107.27,208.65,113.4,208.65,530.7,Single-ply,SBD,M
Boys,109.77,9,Kyle Flowers,Frisco Wakeland,103.92,192.78,133.81,188.24,514.83,Single-ply,SBD,M
Boys,109.77,10,Claly Eppler,Denison,100.43,197.31,117.93,197.31,512.56,Single-ply,SBD,M
Boys,109.77,11,Dakota Norton,Justin Northwest,107.27,190.51,122.47,195.04,508.02,Single-ply,SBD,M
Boys,109.77,12,Elliot Parkman,McKinney,104.01,174.63,99.79,190.51,464.93,Single-ply,SBD,M
Boys,109.77,13,Jayden Stumbaugh,Denison,108.23,174.63,108.86,176.9,460.4,Single-ply,SBD,M
Boys,109.77,14,Drew Percle,Frisco Liberty,107.18,167.83,113.4,158.76,439.98,Single-ply,SBD,M
Boys,109.77,15,Michael Sabeti,Coppell,103.65,151.95,113.4,167.83,433.18,Single-ply,SBD,M
Boys,109.77,16,David Fridae,Carrollton Turner,108.59,165.56,68.04,142.88,376.48,Single-ply,SBD,M
Boys,109.77,17,Jonathon Shuster,McKinney,109.23,145.15,79.38,136.08,360.61,Single-ply,SBD,M
Boys,109.77,DQ,Brandon Ramsey,McKinney North,109.77,,,,,Single-ply,SBD,M
Boys,109.77,DQ,Jacob Emery,Denison,109.77,,,,,Single-ply,SBD,M
Boys,109.77,DQ,Randall Howard,Richardson Lake Highlands,100.24,161.03,,,,Single-ply,SBD,M
Boys,124.74,1,Marquel Sheppard,McKinney North,123.92,272.16,138.35,226.8,637.3,Single-ply,SBD,M
Boys,124.74,2,O'Chea Thomas,Garland Rowlett,121.43,210.92,129.27,272.16,612.35,Single-ply,SBD,M
Boys,124.74,3,Connor Lambring,Frisco,120.16,226.8,147.42,208.65,582.87,Single-ply,SBD,M
Boys,124.74,4,Tai Nguyen,Frisco,122.2,240.4,142.88,195.04,578.33,Single-ply,SBD,M
Boys,124.74,5,Andrew Eisaman,North Mesquite,121.02,226.8,129.27,219.99,576.06,Single-ply,SBD,M
Boys,124.74,6,Connor Counce,Denison,113.17,249.48,106.59,217.72,573.79,Single-ply,SBD,M
Boys,124.74,7,Chase Applebee,Frisco Centennial,119.75,231.33,138.35,204.12,573.79,Single-ply,SBD,M
Boys,124.74,8,Derrick Lockett,North Mesquite,117.12,199.58,140.61,190.51,530.7,Single-ply,SBD,M
Boys,124.74,9,Abran Oaks,Garland Sachse,121.2,208.65,115.67,201.85,526.17,Single-ply,SBD,M
Boys,124.74,10,Andrew Akens,North Mesquite,119.43,199.58,117.93,190.51,508.02,Single-ply,SBD,M
Boys,124.74,DQ,Christian Trevino,North Mesquite,110.77,183.7,122.47,172.37,,Single-ply,SBD,M
Boys,124.74,DQ,Carter Flemmer,Frisco,122.56,158.76,102.06,170.1,,Single-ply,SBD,M
Boys,124.74,DQ,Taylor Lasecki,Frisco,113.44,,,,,Single-ply,SBD,M
Boys,124.74,DQ,Kyle Boren,Frisco,116.94,199.58,,,,Single-ply,SBD,M
Boys,124.74,DQ,Oni Omoile,Coppell,124.74,,,,,Single-ply,SBD,M
Boys,124.74,DQ,Emilio Primera,Coppell,124.47,176.9,,,,Single-ply,SBD,M
Boys,124.74+,1,Josh Burkham,Lewisville The Colony,141.43,285.76,185.97,256.28,728.02,Single-ply,SBD,M
Boys,124.74+,2,DJ Willis,Lewisville The Colony,137.89,283.5,165.56,247.21,696.26,Single-ply,SBD,M
Boys,124.74+,3,Steven Jackson #2,Lewisville The Colony,133.95,258.55,149.69,276.69,684.92,Single-ply,SBD,M
Boys,124.74+,4,Lewis Ray,Justin Northwest,141.93,272.16,129.27,244.94,646.37,Single-ply,SBD,M
Boys,124.74+,5,Kris Weeks,Garland Sachse,141.79,181.44,131.54,210.92,523.9,Single-ply,SBD,M
Boys,124.74+,6,Brian Gutierrez,Garland Rowlett,141.52,224.53,104.33,151.95,480.81,Single-ply,SBD,M
Boys,124.74+,DQ,Davidson Venancio,Frisco Liberty,130.54,294.84,165.56,,,Single-ply,SBD,M
Boys,124.74+,DQ,Jake Williams #3,Coppell,141.97,,,,,Single-ply,SBD,M
Boys,124.74+,DQ,Enrique Rodriguez #3,Carrollton Turner,137.76,,,,,Single-ply,SBD,M
Boys,124.74+,DQ,Kent Perkins,Richardson Lake Highlands,137.62,174.63,131.54,,,Single-ply,SBD,M
