Division,WeightClassKg,Place,Name,Team,BodyweightKg,Best3SquatKg,Best3BenchKg,Best3DeadliftKg,TotalKg,Equipment,Event,Sex
Boys,51.71,1,Jesus Rios,Palacios,51.71,179.17,120.2,208.65,508.02,Single-ply,SBD,M
Boys,51.71,2,Ivan Rosales,Columbus,50.8,147.42,86.18,163.29,396.89,Single-ply,SBD,M
Boys,51.71,3,Shawn Patterson,Bastrop Cedar Creek,51.39,102.06,61.23,129.27,292.57,Single-ply,SBD,M
Boys,51.71,4,Joe Castillo #3,Altair Rice,46.31,102.06,52.16,102.06,256.28,Single-ply,SBD,M
Boys,51.71,5,Al Gardner,Sealy,50.44,97.52,65.77,61.23,224.53,Single-ply,SBD,M
Boys,51.71,6,Mason Neisner,Columbus,37.51,63.5,36.29,81.65,181.44,Single-ply,SBD,M
Boys,55.79,1,Tyler Le,Palacios,55.79,176.9,86.18,179.17,442.25,Single-ply,SBD,M
Boys,55.79,2,Adrian Herrera #1,Yoakum,54.75,174.63,88.45,149.69,412.77,Single-ply,SBD,M
Boys,55.79,3,Cody Faust,Yoakum,55.79,142.88,90.72,156.49,390.09,Single-ply,SBD,M
Boys,55.79,4,Kolbe Kutac,Schulenburg,55.57,127.01,56.7,138.35,322.05,Single-ply,SBD,M
Boys,55.79,5,David Padilla,Bloomington,55.11,117.93,63.5,136.08,317.51,Single-ply,SBD,M
Boys,55.79,6,Russell Morrison,El Maton Tidehaven,53.52,117.93,61.23,133.81,312.98,Single-ply,SBD,M
Boys,55.79,7,Ricky Rico,East Bernard,55.52,106.59,52.16,136.08,294.84,Single-ply,SBD,M
Boys,55.79,8,Isaac Garza,Ganado,55.11,102.06,65.77,102.06,269.89,Single-ply,SBD,M
Boys,55.79,9,Haiderman Carias,Altair Rice,54.02,97.52,52.16,117.93,267.62,Single-ply,SBD,M
Boys,55.79,10,Javier Comacho,Weimar,55.47,102.06,49.9,108.86,260.82,Single-ply,SBD,M
Boys,59.87,1,Lucio Davila,Altair Rice,58.56,172.37,86.18,174.63,433.18,Single-ply,SBD,M
Boys,59.87,2,Hunter Berry,Sealy,59.87,172.37,74.84,170.1,417.3,Single-ply,SBD,M
Boys,59.87,3,Frank Cobio,Brookshire Royal,59.15,151.95,95.25,161.03,408.23,Single-ply,SBD,M
Boys,59.87,4,Zachary Baker,Hallettsville,58.51,147.42,77.11,145.15,369.68,Single-ply,SBD,M
Boys,59.87,5,Yuli Samaniego,Altair Rice,59.01,136.08,74.84,131.54,342.46,Single-ply,SBD,M
Boys,59.87,6,Dylan Morales,Bastrop Cedar Creek,59.74,104.33,74.84,136.08,315.25,Single-ply,SBD,M
Boys,59.87,7,Kyle Gibson,College Station A&M; Cons,56.97,92.99,54.43,104.33,251.74,Single-ply,SBD,M
Boys,59.87,DQ,Sutton Lindsley,Bastrop,56.61,97.52,,,,Single-ply,SBD,M
Boys,59.87,DQ,Jose Reynoso,Columbus,59.19,117.93,52.16,,,Single-ply,SBD,M
Boys,59.87,DQ,Jamarion Flowers,Snook,57.61,,,,,Single-ply,SBD,M
Boys,59.87,DQ,Joseph Marsalia,Altair Rice,59.33,,,,,Single-ply,SBD,M
Boys,67.13,1,Nathan Besch,Weimar,67.09,185.97,104.33,199.58,489.88,Single-ply,SBD,M
Boys,67.13,2,Brandon Batot,Bastrop,65.86,185.97,90.72,183.7,460.4,Single-ply,SBD,M
Boys,67.13,3,Terano Arkadie,Yoakum,67.13,158.76,92.99,185.97,437.72,Single-ply,SBD,M
Boys,67.13,4,Michael Chomour,Yoakum,63.23,170.1,97.52,165.56,433.18,Single-ply,SBD,M
Boys,67.13,5,Nic Reyes,Altair Rice,66.32,158.76,86.18,185.97,430.91,Single-ply,SBD,M
Boys,67.13,6,Andrew Small,Wallis Brazos,66.63,170.1,83.91,170.1,424.11,Single-ply,SBD,M
Boys,67.13,7,Drew Powell,Hallettsville,65.77,161.03,102.06,158.76,421.84,Single-ply,SBD,M
Boys,67.13,8,Ben Villereal,Cuero,66.68,131.54,88.45,176.9,396.89,Single-ply,SBD,M
Boys,67.13,9,Trevor Howard,Bellville,67.13,154.22,68.04,170.1,392.36,Single-ply,SBD,M
Boys,67.13,10,Chase Gibson,College Station A&M; Cons,64.5,140.61,83.91,158.76,383.29,Single-ply,SBD,M
Boys,67.13,11,Jordan Garza,Yoakum,67.13,142.88,88.45,138.35,369.68,Single-ply,SBD,M
Boys,67.13,12,Shawn Torres,Altair Rice,66.32,136.08,74.84,142.88,353.8,Single-ply,SBD,M
Boys,67.13,13,Klayton Morris,Bastrop Cedar Creek,63.46,127.01,70.31,149.69,347,Single-ply,SBD,M
Boys,67.13,14,David Duffla,Bellville,61.69,122.47,72.57,142.88,337.93,Single-ply,SBD,M
Boys,67.13,15,Jose Martinez,Brookshire Royal,62.64,145.15,74.84,117.93,337.93,Single-ply,SBD,M
Boys,67.13,16,Jared Smith,Bastrop,65.95,120.2,70.31,142.88,333.39,Single-ply,SBD,M
Boys,67.13,17,Bladen Reaves,Bryan Rudder,65.5,124.74,65.77,136.08,326.59,Single-ply,SBD,M
Boys,67.13,DQ,Juan Barboza,Altair Rice,65.91,,,,,Single-ply,SBD,M
Boys,74.84,1,Seth Alvarez,Palacios,74.34,249.48,108.86,213.19,571.53,Single-ply,SBD,M
Boys,74.84,2,Hunter Luscombe,Sealy,73.71,210.92,120.2,210.92,542.04,Single-ply,SBD,M
Boys,74.84,3,Kyle Carillo,El Maton Tidehaven,71.85,190.51,92.99,208.65,492.15,Single-ply,SBD,M
Boys,74.84,4,Joseph Stewart,Brookshire Royal,72.26,192.78,104.33,172.37,469.47,Single-ply,SBD,M
Boys,74.84,5,Jacob Galvez,El Maton Tidehaven,74.25,185.97,104.33,170.1,460.4,Single-ply,SBD,M
Boys,74.84,6,Kyle Thiele,Giddings,74.84,151.95,120.2,172.37,444.52,Single-ply,SBD,M
Boys,74.84,7,Avery Srebalus,East Bernard,73.94,158.76,95.25,147.42,401.43,Single-ply,SBD,M
Boys,74.84,8,Abraham Moreno,Sealy,73.94,142.88,86.18,165.56,394.63,Single-ply,SBD,M
Boys,74.84,9,Adrian Castaneda,Bellville,74.84,163.29,97.52,129.27,390.09,Single-ply,SBD,M
Boys,74.84,10,Cameron Mata,Yoakum,74.16,158.76,70.31,147.42,376.48,Single-ply,SBD,M
Boys,74.84,DQ,Nick Freschnecht,Columbus,72.85,170.1,102.06,,,Single-ply,SBD,M
Boys,82.1,1,Robert Franklin,College Station A&M; Cons,77.88,219.99,136.08,226.8,582.87,Single-ply,SBD,M
Boys,82.1,2,Eric Lucio,Louise,77.34,226.8,127.01,219.99,573.79,Single-ply,SBD,M
Boys,82.1,3,Isaiah Herring,Hallettsville,77.56,213.19,138.35,210.92,562.45,Single-ply,SBD,M
Boys,82.1,4,Dylan Tomek,Hallettsville,79.83,208.65,133.81,213.19,555.65,Single-ply,SBD,M
Boys,82.1,5,Dalton Thomas,Bastrop,79.24,217.72,120.2,206.38,544.31,Single-ply,SBD,M
Boys,82.1,6,Toby Proske,Giddings,80.83,231.33,120.2,192.78,544.31,Single-ply,SBD,M
Boys,82.1,7,Jaric Crider,Bellville,80.47,213.19,124.74,199.58,537.51,Single-ply,SBD,M
Boys,82.1,8,Hunter Adkins,Altair Rice,80.88,213.19,131.54,185.97,530.7,Single-ply,SBD,M
Boys,82.1,9,Jeff Williams,El Maton Tidehaven,81.51,183.7,127.01,204.12,514.83,Single-ply,SBD,M
Boys,82.1,10,Trevor Williams,College Station A&M; Cons,80.2,199.58,113.4,188.24,501.22,Single-ply,SBD,M
Boys,82.1,11,Morgan Segovia,Palacios,75.75,197.31,113.4,170.1,480.81,Single-ply,SBD,M
Boys,82.1,12,Will Anderson,East Bernard,79.88,183.7,111.13,179.17,474,Single-ply,SBD,M
Boys,82.1,13,James Gracia,Bastrop Cedar Creek,81.42,156.49,99.79,185.97,442.25,Single-ply,SBD,M
Boys,82.1,14,Dylan Ramirez,Weimar,78.7,145.15,97.52,181.44,424.11,Single-ply,SBD,M
Boys,82.1,15,Jordi Cruz,Luling,78.11,158.76,88.45,142.88,390.09,Single-ply,SBD,M
Boys,82.1,16,Ian Garner,Wallis Brazos,79.33,113.4,108.86,161.03,383.29,Single-ply,SBD,M
Boys,82.1,17,Mauro Calderon,Brookshire Royal,80.1,133.81,77.11,136.08,347,Single-ply,SBD,M
Boys,82.1,18,Aaron Cardenas,Louise,81.83,113.4,68.04,145.15,326.59,Single-ply,SBD,M
Boys,82.1,DQ,Jaedon McGee,Bastrop,79.65,,,,,Single-ply,SBD,M
Boys,89.81,1,Dominic Garcia,Palacios,84.37,217.72,127.01,244.94,589.67,Single-ply,SBD,M
Boys,89.81,2,Trace McAfee,Hallettsville,86.18,226.8,147.42,204.12,578.33,Single-ply,SBD,M
Boys,89.81,3,Vaughn Morris,Hempstead,87.18,226.8,122.47,204.12,553.38,Single-ply,SBD,M
Boys,89.81,4,Jason Jasperson,College Station A&M; Cons,89.36,208.65,122.47,222.26,553.38,Single-ply,SBD,M
Boys,89.81,5,Ben Carmean,Bellville,89.31,217.72,142.88,183.7,544.31,Single-ply,SBD,M
Boys,89.81,6,Adam Nguyen,Palacios,84.46,226.8,102.06,210.92,539.77,Single-ply,SBD,M
Boys,89.81,7,Alex Reyes,Brookshire Royal,89.68,199.58,136.08,197.31,532.97,Single-ply,SBD,M
Boys,89.81,8,Elijah Edwards,Palacios,84.37,190.51,113.4,226.8,530.7,Single-ply,SBD,M
Boys,89.81,9,Ryan Perry,Bastrop,87.32,192.78,127.01,210.92,530.7,Single-ply,SBD,M
Boys,89.81,10,Justin Garza,Yoakum,83.32,199.58,142.88,183.7,526.17,Single-ply,SBD,M
Boys,89.81,11,James Taylor #5,Wallis Brazos,85.82,222.26,122.47,181.44,526.17,Single-ply,SBD,M
Boys,89.81,12,Hayden Henry,Hallettsville,84.37,204.12,113.4,192.78,510.29,Single-ply,SBD,M
Boys,89.81,13,Tariq Barron,Louise,87.27,204.12,106.59,195.04,505.76,Single-ply,SBD,M
Boys,89.81,14,Marques Henry,Bastrop Cedar Creek,89.77,188.24,113.4,204.12,505.76,Single-ply,SBD,M
Boys,89.81,15,Dayton Ball,Cuero,84.32,185.97,111.13,204.12,501.22,Single-ply,SBD,M
Boys,89.81,16,Devin Levias,College Station A&M; Cons,85.73,185.97,115.67,199.58,501.22,Single-ply,SBD,M
Boys,89.81,17,Cullen Schrader,Bellville,82.69,181.44,124.74,158.76,464.93,Single-ply,SBD,M
Boys,89.81,18,Locke Rowley,East Bernard,84.19,170.1,106.59,181.44,458.13,Single-ply,SBD,M
Boys,89.81,19,Connor Kelly,Bastrop Cedar Creek,82.55,158.76,90.72,188.24,437.72,Single-ply,SBD,M
Boys,89.81,20,Jackson Engel,Palacios,85.14,170.1,90.72,176.9,437.72,Single-ply,SBD,M
Boys,89.81,21,Daniel García,Brookshire Royal,83.96,149.69,106.59,172.37,428.64,Single-ply,SBD,M
Boys,89.81,22,Ben Maldanado,Wallis Brazos,84.14,165.56,104.33,149.69,419.57,Single-ply,SBD,M
Boys,89.81,23,Chris Owens,Bryan Rudder,88.09,158.76,90.72,161.03,410.5,Single-ply,SBD,M
Boys,89.81,24,Vernon Smith,Bellville,82.92,142.88,88.45,163.29,394.63,Single-ply,SBD,M
Boys,89.81,25,John Thomas,Snook,87.36,92.99,65.77,136.08,294.84,Single-ply,SBD,M
Boys,99.79,1,Andrew Tavera,Altair Rice,98.61,260.82,140.61,244.94,646.37,Single-ply,SBD,M
Boys,99.79,2,Lex Leibfried,Bellville,99.56,258.55,161.03,226.8,646.37,Single-ply,SBD,M
Boys,99.79,3,Joseph Rodriguez #5,Bastrop Cedar Creek,98.02,249.48,142.88,244.94,637.3,Single-ply,SBD,M
Boys,99.79,4,Ty Jalowy,East Bernard,91.4,240.4,136.08,240.4,616.89,Single-ply,SBD,M
Boys,99.79,5,Bailey Reid,Bryan Rudder,99.02,240.4,165.56,210.92,616.89,Single-ply,SBD,M
Boys,99.79,6,Nickolas Johnson #1,Bryan Rudder,98.29,235.87,140.61,188.24,564.72,Single-ply,SBD,M
Boys,99.79,7,Kevin Leonard,College Station A&M; Cons,95.16,222.26,120.2,217.72,560.19,Single-ply,SBD,M
Boys,99.79,8,Kevin Carpenter,Palacios,98.84,206.38,120.2,229.06,555.65,Single-ply,SBD,M
Boys,99.79,9,Michael Rodgers,Hempstead,97.79,183.7,136.08,210.92,530.7,Single-ply,SBD,M
Boys,99.79,10,Jesus Vargas,Altair Rice,99.43,197.31,117.93,195.04,510.29,Single-ply,SBD,M
Boys,99.79,11,Caleb Zuniga,Bastrop Cedar Creek,98.97,183.7,129.27,192.78,505.76,Single-ply,SBD,M
Boys,99.79,12,Michael Brietzke,Luling,98.11,204.12,99.79,199.58,503.49,Single-ply,SBD,M
Boys,99.79,13,Luke Berglund,Bellville,96.84,170.1,122.47,204.12,496.68,Single-ply,SBD,M
Boys,99.79,14,Randy Reyes,Bastrop Cedar Creek,96.71,158.76,115.67,181.44,455.86,Single-ply,SBD,M
Boys,99.79,15,Casey Marek,Bellville,97.84,176.9,102.06,172.37,451.32,Single-ply,SBD,M
Boys,99.79,16,David Garza,Cuero,98.16,165.56,90.72,174.63,430.91,Single-ply,SBD,M
Boys,99.79,17,Will Denton,Cuero,91.76,154.22,90.72,156.49,401.43,Single-ply,SBD,M
Boys,99.79,18,Jesus Bernal,Brookshire Royal,94.3,163.29,97.52,140.61,401.43,Single-ply,SBD,M
Boys,99.79,DQ,Joseph Clay,Wallis Brazos,98.57,165.56,,,,Single-ply,SBD,M
Boys,109.77,1,Tristan Caballero,Yoakum,108.73,272.16,181.44,226.8,680.39,Single-ply,SBD,M
Boys,109.77,2,Clifford Chambers,Bryan Rudder,109.63,276.69,120.2,195.04,591.94,Single-ply,SBD,M
Boys,109.77,3,Oliver Shorter,Altair Rice,102.56,233.6,131.54,206.38,571.53,Single-ply,SBD,M
Boys,109.77,4,Miguel Montes,Louise,102.74,244.94,111.13,204.12,560.19,Single-ply,SBD,M
Boys,109.77,5,Andrew Hlavinka,East Bernard,108.36,215.46,124.74,215.46,555.65,Single-ply,SBD,M
Boys,109.77,6,Tyler Vasut,East Bernard,108.68,217.72,117.93,213.19,548.85,Single-ply,SBD,M
Boys,109.77,7,Brady Roberts,Bryan Rudder,106.32,204.12,145.15,181.44,530.7,Single-ply,SBD,M
Boys,109.77,8,Shawn Allen,Schulenburg,108.18,206.38,122.47,181.44,510.29,Single-ply,SBD,M
Boys,109.77,9,Colten Orsak,Snook,104.69,195.04,106.59,204.12,505.76,Single-ply,SBD,M
Boys,109.77,10,Nick Searcy,Cuero,101.88,179.17,111.13,183.7,474,Single-ply,SBD,M
Boys,109.77,11,Wade Smith,Giddings,103.01,183.7,108.86,165.56,458.13,Single-ply,SBD,M
Boys,109.77,12,Kyle Nelson,Bellville,106.73,181.44,90.72,181.44,453.59,Single-ply,SBD,M
Boys,109.77,13,PJ Moreida,Altair Rice,103.92,124.74,61.23,108.86,294.84,Single-ply,SBD,M
Boys,109.77,DQ,Will Dowell,Hallettsville,102.97,,,,,Single-ply,SBD,M
Boys,124.74,1,Charles Owens,Bryan Rudder,124.24,340.19,181.44,272.16,793.79,Single-ply,SBD,M
Boys,124.74,2,Alex Nguyen,Palacios,113.94,254.01,158.76,204.12,616.89,Single-ply,SBD,M
Boys,124.74,3,Jose Avalos,Louise,112.4,226.8,136.08,222.26,585.13,Single-ply,SBD,M
Boys,124.74,4,Cameron King #1,Bastrop,114.03,215.46,120.2,219.99,555.65,Single-ply,SBD,M
Boys,124.74,5,Joshua Peoples,Bryan Rudder,123.74,195.04,117.93,240.4,553.38,Single-ply,SBD,M
Boys,124.74,6,Luis Tello,Giddings,121.52,226.8,108.86,206.38,542.04,Single-ply,SBD,M
Boys,124.74,7,Hunter Breaux,Bellville,124.38,217.72,140.61,172.37,530.7,Single-ply,SBD,M
Boys,124.74,8,Brandon Higginbotham,East Bernard,115.85,190.51,127.01,204.12,521.63,Single-ply,SBD,M
Boys,124.74,9,Drake Braodwater,Bastrop Cedar Creek,111.72,163.29,124.74,204.12,492.15,Single-ply,SBD,M
Boys,124.74,10,Nick Gomez,Yoakum,114.26,195.04,111.13,154.22,460.4,Single-ply,SBD,M
Boys,124.74,11,Jon Michael Shepard,Brookshire Royal,116.57,179.17,104.33,147.42,430.91,Single-ply,SBD,M
Boys,124.74,12,Shemar Barnes,Snook,117.75,163.29,111.13,151.95,426.38,Single-ply,SBD,M
Boys,124.74,13,Josh Elliott,Cuero,113.53,158.76,86.18,149.69,394.63,Single-ply,SBD,M
Boys,124.74,14,Jacob Leos,Luling,115.08,149.69,99.79,136.08,385.55,Single-ply,SBD,M
Boys,124.74,DQ,Robert Martinez,Louise,122.02,249.48,131.54,,,Single-ply,SBD,M
Boys,124.74,DQ,Justin Hoffman,Bastrop,118.71,256.28,,,,Single-ply,SBD,M
Boys,124.74,DQ,Joey Domingez,Yoakum,116.57,185.97,,,,Single-ply,SBD,M
Boys,124.74,DQ,Blake Ray,Columbus,121.47,197.31,131.54,,,Single-ply,SBD,M
Boys,124.74+,1,James Nino,Weimar,141.93,274.42,181.44,254.01,709.87,Single-ply,SBD,M
Boys,124.74+,2,Rene Loya,Bastrop,133.36,254.01,163.29,222.26,639.57,Single-ply,SBD,M
Boys,124.74+,3,Joel Sanchez #1,Luling,171.91,272.16,142.88,215.46,630.49,Single-ply,SBD,M
Boys,124.74+,4,Diego Hernandez,Cuero,134.35,233.6,142.88,226.8,603.28,Single-ply,SBD,M
Boys,124.74+,5,Juan Ramirez,Giddings,134.67,244.94,142.88,199.58,587.4,Single-ply,SBD,M
Boys,124.74+,6,Shaquon Warren,Bryan Rudder,126.46,204.12,133.81,229.06,566.99,Single-ply,SBD,M
Boys,124.74+,7,Haden Haas,Cuero,128.82,229.06,120.2,192.78,542.04,Single-ply,SBD,M
Boys,124.74+,8,Zach Sowa,Sealy,136.58,190.51,129.27,174.63,494.42,Single-ply,SBD,M
Boys,124.74+,9,Jadan Thomas,Weimar,131.9,188.24,120.2,165.56,474,Single-ply,SBD,M
Boys,124.74+,10,Pedro Govea,Luling,130.82,197.31,99.79,170.1,467.2,Single-ply,SBD,M
Boys,124.74+,11,Anthony Hernandez,Sealy,129.73,156.49,120.2,176.9,453.59,Single-ply,SBD,M
Boys,124.74+,DQ,Jonathyn Murry,Luling,138.12,,,,,Single-ply,SBD,M
Boys,,NS,Jake Carr,Palacios,,,,,,Single-ply,SBD,M
Boys,,NS,Kiezland Quintero,Schulenburg,,,,,,Single-ply,SBD,M
Boys,,NS,Christian Torres,Luling,,,,,,Single-ply,SBD,M
Boys,,NS,George Sanchez,Luling,,,,,,Single-ply,SBD,M
Boys,,NS,Isiah Montes,Louise,,,,,,Single-ply,SBD,M
Boys,,NS,Pete Moreno,Louise,,,,,,Single-ply,SBD,M
Boys,,NS,Khamron Thomas,Hempstead,,,,,,Single-ply,SBD,M
Boys,,NS,Brandon Brune,El Maton Tidehaven,,,,,,Single-ply,SBD,M
Boys,,NS,Brennan Schimcek,Hallettsville,,,,,,Single-ply,SBD,M
Boys,,NS,Dereck Morris,Hempstead,,,,,,Single-ply,SBD,M
Boys,,NS,Ancelmo Cruces,Cuero,,,,,,Single-ply,SBD,M
Boys,,NS,Justin Ficklen,Cuero,,,,,,Single-ply,SBD,M
Boys,,NS,Zach Fuchs,Cuero,,,,,,Single-ply,SBD,M
Boys,,NS,Jordan Smith #6,College Station A&M; Cons,,,,,,Single-ply,SBD,M
Boys,,NS,Austen Smith,College Station A&M; Cons,,,,,,Single-ply,SBD,M
Boys,,NS,Will Sullivan,College Station A&M; Cons,,,,,,Single-ply,SBD,M
Boys,,NS,J'Vante Wade,Brookshire Royal,,,,,,Single-ply,SBD,M
Boys,,NS,Fransisco Serrato,Brookshire Royal,,,,,,Single-ply,SBD,M
Boys,,NS,John Goode,Bastrop,,,,,,Single-ply,SBD,M
Boys,,NS,Adrian Rojas,Bloomington,,,,,,Single-ply,SBD,M
Boys,,NS,Sean Payne,Bastrop,,,,,,Single-ply,SBD,M
Boys,,NS,Denver Evans,Yoakum,,,,,,Single-ply,SBD,M
Boys,,NS,Kendall McCloud,Weimar,,,,,,Single-ply,SBD,M
Boys,,NS,Armando Rosales,Weimar,,,,,,Single-ply,SBD,M
Boys,,NS,Brain George,Bastrop Cedar Creek,,,,,,Single-ply,SBD,M
Boys,,NS,Jordan Barrou,Snook,,,,,,Single-ply,SBD,M
Boys,,NS,Chris Sebeste,Snook,,,,,,Single-ply,SBD,M
