Division,WeightClassKg,Place,Name,Team,BodyweightKg,Best3SquatKg,Best3BenchKg,Best3DeadliftKg,TotalKg,Equipment,Event,Sex,BirthDate
Boys,51.71,1,Knox Wilson,Van Alstyne,45.36,90.72,52.16,92.99,235.87,Single-ply,SBD,M,
Boys,51.71,2,Noah Sallaway,Prosper Rock Hill,49.4,79.38,54.43,72.57,206.38,Single-ply,SBD,M,
Boys,55.79,1,Nathan Pacheco,Van Alstyne,55.79,113.4,65.77,133.81,312.98,Single-ply,SBD,M,
Boys,55.79,2,Lyric Patino,Prosper Rock Hill,54.61,106.59,56.7,102.06,265.35,Single-ply,SBD,M,
Boys,59.87,1,Henok Martinez,Prosper Rock Hill,59.87,147.42,77.11,124.74,349.27,Single-ply,SBD,M,
Boys,59.87,2,Eddie Wieczorek,Prosper Rock Hill,59.87,140.61,68.04,136.08,344.73,Single-ply,SBD,M,
Boys,59.87,3,Gio Torres,Van Alstyne,59.87,142.88,79.38,120.2,342.46,Single-ply,SBD,M,
Boys,67.13,1,Myles Williams,Melissa,66.41,165.56,111.13,163.29,439.98,Single-ply,SBD,M,
Boys,67.13,2,Brandon Halliburton,Anna,65.32,154.22,79.38,151.95,385.55,Single-ply,SBD,M,
Boys,67.13,3,Aiden Johnson,Prosper Rock Hill,63.32,142.88,81.65,142.88,367.41,Single-ply,SBD,M,
Boys,67.13,4,Gunnar Keenan,Van Alstyne,66.68,117.93,90.72,142.88,351.53,Single-ply,SBD,M,
Boys,67.13,5,Landon Henry,Prosper Rock Hill,62.6,124.74,90.72,133.81,349.27,Single-ply,SBD,M,
Boys,67.13,6,Jordan Shute,Anna,64.32,140.61,79.38,127.01,347,Single-ply,SBD,M,
Boys,67.13,7,Austin Guillen,Prosper Rock Hill,62.6,111.13,65.77,136.08,312.98,Single-ply,SBD,M,
Boys,74.84,1,Peyton Knight,Melissa,74.12,240.4,149.69,231.33,621.42,Single-ply,SBD,M,
Boys,74.84,2,Cole Riley,Melissa,70.49,154.22,88.45,129.27,371.95,Single-ply,SBD,M,
Boys,74.84,3,Ja'Khyre Jackson,Prosper Rock Hill,74.39,151.95,74.84,136.08,362.87,Single-ply,SBD,M,
Boys,74.84,4,Jonah Price,Van Alstyne,72.03,133.81,79.38,142.88,356.07,Single-ply,SBD,M,
Boys,74.84,5,Brock Fitzhugh,Prosper Rock Hill,70.58,88.45,65.77,127.01,281.23,Single-ply,SBD,M,
Boys,82.1,1,Dan Nguyen-Phan,Prosper Rock Hill,81.65,158.76,97.52,151.95,408.23,Single-ply,SBD,M,
Boys,89.81,1,Billy Barrea,Anna,88.99,215.46,104.33,199.58,519.36,Single-ply,SBD,M,
Boys,89.81,2,Donovan Shannon,Prosper Rock Hill,87.09,174.63,127.01,190.51,492.15,Single-ply,SBD,M,
Boys,99.79,1,Casy Adjei,Prosper Rock Hill,97.98,272.16,129.27,240.4,641.83,Single-ply,SBD,M,
Boys,99.79,2,Clayton West,Anna,91.9,226.8,113.4,206.38,546.58,Single-ply,SBD,M,
Boys,99.79,3,Lance Riley,Melissa,99.34,201.85,131.54,181.44,514.83,Single-ply,SBD,M,
Boys,99.79,4,Luke Demel,Melissa,91.63,161.03,122.47,170.1,453.59,Single-ply,SBD,M,
Boys,99.79,5,Kyle Greve,Van Alstyne,93.44,165.56,111.13,176.9,453.59,Single-ply,SBD,M,
Boys,99.79,6,Hector Rincon,Anna,99.79,170.1,108.86,170.1,449.06,Single-ply,SBD,M,
Boys,109.77,1,JR Box,Anna,103.87,226.8,151.95,226.8,605.55,Single-ply,SBD,M,
Boys,109.77,2,Austin Jordan,Prosper Rock Hill,102.06,129.27,102.06,165.56,396.89,Single-ply,SBD,M,
Boys,124.74,1,Nick Loya,Van Alstyne,114.31,195.04,145.15,183.7,523.9,Single-ply,SBD,M,
Boys,124.74,2,Jacob Brown,Melissa,117.12,197.31,136.08,170.1,503.49,Single-ply,SBD,M,
Boys,139.71,1,Owen Hollenbeck,Melissa,130.63,210.92,145.15,183.7,539.77,Single-ply,SBD,M,
