﻿BDFPF BK Bench - Deadlift  Champ Belgiuqe 2020
                                                 Bench Unequipped                                        B.W     1       2        3        4      score
1                                                - 63 KG Baute         Tricia      F   BEL     20   JR   61,8    40      -45      -45             33,57
1                                                - 90 KG Mazet         Kim         F   BEL     35   SR   85,0    -67,5   72,5     -77,5           47,73
1                                                67,5 KG Dierckx       Liam        M   BEL     25   SR   66,2    95      100      -105            73,87
2                                                67,5 KG Dehondt       Nick        M   BEL     28   SR   64,7    90      97,5     -100            73,57
1                                                67,5 KG Boland        Darren      M   BEL     44   M1   66,3    100     107,5    110             81,15
1                                                67,5 KG De Ridder     Pascal      M   BEL     52   M3   62,9    85      -90      -90             65,90
1                                                75 KG Waroux          Dirk        M   BEL     39   SR   74,9    120     127,5    132,5           88,14
2                                                75 KG De Ridder       Jason       M   BEL     29   SR   72,6    85      92,5     100             68,20
3                                                75 KG el fatimi       ismail      M   BEL     28   SR   72,8    70      80       87,5            59,54
1                                                82,5 KG Abdullah      Christian   M   BEL     20   JR   81,2    100     110      120             75,14
1                                                82,5 KG Neyt          Bart        M   BEL     51   M3   77,3    90      100      -105            64,92
1                                                90 KG Hamidian        Human       M   BEL     18   T3   84,5    120     127,5    132,5           80,73
2                                                90 KG Lambert         Guillaume   M   BEL     18   T3   83,0    75      80       -82,5           49,34
1                                                90 KG De Creus        Jonas       M   BEL     27   SR   88,4    115     125      -130            73,98
1                                                90 KG Hemelsoet       Erwin       M   BEL     48   M2   89,2    -125    130      -140            76,51
1                                                90 KG Vandecasteele   Johan       M   BEL     56   M4   88,1    150     -155,5   -155,5          88,95
2                                                90 KG De Vlieger      Luc         M   BEL     57   M4   82,6    95      100      -107,5          61,88
1                                                90 KG Devaere         Achiel      M   BEL     72   M7   89,0    100     105      110,5    113    64,82
1                                                100 KG louvet         simon       M   BEL     18   T3   90,7    -100    100      -107,5          58,27
1                                                100 KG Goethals       Dries       M   BEL     34   SR   95,6    140     -145     -145            79,24
2                                                100 KG Tambuyser      Michael     M   BEL     28   SR   94,8    90      92,5     95              54,01
1                                                100 KG Scorsiono      Fabrizio    M   BEL     56   M4   98,9    120     -127,5                   66,82
1                                                110 KG Martiniuc      Egor        M   BEL     36   SR   106,1   172,5   180      185      190    100,25
2                                                110 KG Michiels       Tim         M   BEL     28   SR   108,0   115     120      125             67,39
1                                                110 KG Vermote        Gianni      M   BEL     47   M2   108,6   125     132,5    -140            71,31
1                                                110 KG Gheldof        Marcel      M   BEL     54   M3   109,3   140     145      -152,5          77,91
1                                                110 KG Catteuw        Luc         M   BEL     61   M5   100,5   130     -140     -140            71,88
1                                                110 KG Secke          Jaques      M   BEL     68   M6   102,8   145     -155                     79,45
1                                                125 KG Debyser        Ward        M   BEL     18   T3   110,3   150     160      -170            85,78
1                                                125 KG Karraa         Elias       M   BEL     27   SR   112,0   140     147,5    -150            78,79
2                                                125 KG Degruyter      Bjorn       M   BEL     29   SR   114,8   120     -125     125             66,45
1                                                125 KG Vlaeminck      Oscar       M   BEL     63   M5   114,0   122,5   -125     125      -131   66,54
                                                 Gäste
1                                                + 145 KG Vercruyce    John        M   BEL     25   SR   160,8   190     200      210      -215   101,37
1                                                - 70 KG Schmidt       Maja        F   GER     16   T2   64,8    35      42,5     50              40,32
1                                                60 KG Grünberg        Michael         M GER   53   M3   58,4    65      70       -75,5           58,53
1                                                100 KG Pütz           David           M GER   43   M1   94,4    120     127,5    130             74,06
1                                                100 KG Kling          Andreas         M GER   53   M3   99,9    160     173      177,5           98,39
1                                                110 KG Stoebke        Christian       M GER   43   M1   105,8   120     125      -125            67,80
1                                                125 KG Kanz           Volker          M GER   53   M3   116,2   100     105      110             58,33
1                                                145 KG Tetzlaff       Martin          M GER   48   M2   128,0   180     190      193,5    195    99,60
29 Feb 2020

BDFPF BK Bench - Deadlift  Champ Belgiuqe 2020
Deadlift Unequipped
1                                                - 63 KG Baute        Tricia      F   BEL   20   JR   61,80    100     -105     -105            83,92
1                                                - 90 KG Mazet        Kim         F   BEL   35   SR   85,00    140     -150     152,5    163    100,39
1                                                67,5 KG Dierckx      Liam        M   BEL   25   SR   66,20    192,5   205      -207,5          151,43
2                                                67,5 KG Dehondt      Nick        M   BEL   28   SR   64,70    150     162,5    165             124,51
1                                                67,5 KG Boland       Darren      M   BEL   44   M1   66,30    195     207,5    -210            153,07
1                                                75 KG el fatimi      ismail      M   BEL   28   SR   72,80    -165    177,5    190             129,30
2                                                75 KG Waroux         Dirk        M   BEL   39   SR   74,90    160     -177,5   -180            106,43
1                                                82,5 KG Abdullah     Christian   M   BEL   20   JR   81,20    220     230      -245            144,03
1                                                90 KG Hamidian       Human       M   BEL   18   T3   84,50    210     -230     -230            127,95
2                                                90 KG Lambert        Guillaume   M   BEL   18   T3   83,00    140     150      160             98,67
1                                                90 KG De Creus       Jonas       M   BEL   27   SR   88,40    200     220      235             139,07
1                                                90 KG Hemelsoet      Erwin       M   BEL   48   M2   89,20    210     230      240             141,24
1                                                100 KG louvet        simon       M   BEL   18   T3   90,70    200     205      210             122,37
1                                                100 KG Tambuyser     Michael     M   BEL   28   SR   94,80    165     175      200             113,70
1                                                110 KG Martiniuc     Egor        M   BEL   36   SR   106,10   210     220      230             124,64
2                                                110 KG Michiels      Tim         M   BEL   28   SR   108,00   185     195      202,5           109,17
1                                                110 KG Gheldof       Marcel      M   BEL   54   M3   109,30   200     220      225      230    120,89
1                                                125 KG Debyser       Ward        M   BEL   18   T3   110,30   250     260      270      -275   144,75
1                                                125 KG Karraa        Elias       M   BEL   27   SR   112,00   220     240      245             130,88
1                                                + 145 KG Vercruyce   John        M   BEL   25   SR   160,80   280     300      302,5           146,02
                                                 Gäste
1                                                - 58,5 KG Stoebke    Melissa     F   GER   16   T2   57,10    55      60       65              58,29
1                                                - 70 KG Schmidt      Maja        F   GER   16   T2   64,80    70      80       87,5            70,55
1                                                60 KG Grünberg       Michael     M   GER   53   M3   58,40    130     135      147,5    150    123,32
1                                                100 KG Pütz          David       M   GER   43   M1   94,40    170     180      185             105,39
1                                                125 KG Kanz          Volker      M   GER   53   M3   116,20   150     160                      84,85
1                                                145 KG Tetzlaff      Martin      M   GER   48   M2   128,00   200     220      -230            113,83
29 Feb 2020
