Division,WeightClassKg,Place,Name,Team,BodyweightKg,Best3SquatKg,Best3BenchKg,Best3DeadliftKg,TotalKg,Equipment,Event,Sex,BirthDate
Boys,51.71,1,Avery Roberts,Brownsboro,50.8,124.74,74.84,136.08,335.66,Single-ply,SBD,M,
Boys,51.71,2,Steven Arvizo,Brownsboro,49.9,92.99,52.16,111.13,256.28,Single-ply,SBD,M,
Boys,59.87,1,Kyle Crawford,Brownsboro,58.51,190.51,104.33,204.12,498.95,Single-ply,SBD,M,
Boys,59.87,2,Eli Castillo,Fairfield,58.51,165.56,92.99,181.44,439.98,Single-ply,SBD,M,
Boys,59.87,3,Hunter Washington,Brownsboro,58.79,151.95,88.45,181.44,421.84,Single-ply,SBD,M,
Boys,59.87,4,Jonathan Cockrell,Pollok Central,57.88,106.59,54.43,136.08,297.1,Single-ply,SBD,M,
Boys,59.87,5,Steven Turbyfill,Malakoff Cross Roads,57.15,97.52,65.77,124.74,288.03,Single-ply,SBD,M,
Boys,59.87,DQ,Tristan Himes,Malakoff Cross Roads,56.7,,,,,Single-ply,SBD,M,
Boys,67.13,1,Landon Fretwell,Brownsboro,64.86,190.51,102.06,192.78,485.34,Single-ply,SBD,M,
Boys,67.13,2,Curtis Gatewood,Corsicana,63.05,136.08,108.86,151.95,396.89,Single-ply,SBD,M,
Boys,67.13,3,Ja'Shawne Hillsman,Corsicana,64.41,131.54,74.84,142.88,349.27,Single-ply,SBD,M,
Boys,67.13,4,August Adams,Malakoff Cross Roads,61.23,117.93,68.04,129.27,315.25,Single-ply,SBD,M,
Boys,67.13,DQ,Grayson Adams,Brownsboro,67.13,124.74,,,,Single-ply,SBD,M,
Boys,74.84,1,Robert Haney,Brownsboro,71.21,183.7,120.2,197.31,501.22,Single-ply,SBD,M,
Boys,74.84,2,Brayden May,Kerens,74.12,174.63,124.74,181.44,480.81,Single-ply,SBD,M,
Boys,74.84,3,Collin Glass,Fairfield,72.57,151.95,90.72,158.76,401.43,Single-ply,SBD,M,
Boys,74.84,4,Tyler Commander,Palestine Westwood,68.95,145.15,83.91,147.42,376.48,Single-ply,SBD,M,
Boys,74.84,5,Josh Guardiola,Palestine Westwood,68.13,149.69,74.84,142.88,367.41,Single-ply,SBD,M,
Boys,74.84,6,Michael DeMoss,Kerens,73.03,113.4,74.84,122.47,310.71,Single-ply,SBD,M,
Boys,74.84,DQ,Clyde Bumgarner,Fruitvale,68.95,102.06,,,,Single-ply,SBD,M,
Boys,82.1,1,Collin Crow,Brownsboro,78.93,199.58,136.08,201.85,537.51,Single-ply,SBD,M,
Boys,82.1,2,Evan Chavers,Fairfield,80.29,192.78,131.54,183.7,508.02,Single-ply,SBD,M,
Boys,82.1,3,Hayden Palmer,Kerens,81.92,181.44,111.13,183.7,476.27,Single-ply,SBD,M,
Boys,82.1,4,Kevin Cano,Corsicana,76.93,179.17,102.06,174.63,455.86,Single-ply,SBD,M,
Boys,82.1,5,Kaden King,Brownsboro,75.75,170.1,102.06,170.1,442.25,Single-ply,SBD,M,
Boys,82.1,6,Kyler Schick,Fairfield,77.11,170.1,92.99,163.29,426.38,Single-ply,SBD,M,
Boys,82.1,7,Jackson Reed,Van,80.74,158.76,92.99,142.88,394.63,Single-ply,SBD,M,
Boys,82.1,8,Kyle Morgan,Malakoff,82.01,133.81,79.38,131.54,344.73,Single-ply,SBD,M,
Boys,89.81,1,K'Vionne Davis,Malakoff,89.81,263.08,129.27,219.99,612.35,Single-ply,SBD,M,
Boys,89.81,2,Braiden Barrett,Fairfield,85.73,233.6,149.69,215.46,598.74,Single-ply,SBD,M,
Boys,89.81,3,Eli Martin,Fairfield,87.09,231.33,136.08,226.8,594.21,Single-ply,SBD,M,
Boys,89.81,4,Jalen Smith,Malakoff,84.73,195.04,111.13,181.44,487.61,Single-ply,SBD,M,
Boys,89.81,5,Samuel Lee,Brownsboro,86.18,176.9,120.2,158.76,455.86,Single-ply,SBD,M,
Boys,89.81,6,Damien Jackson,Malakoff,87,176.9,92.99,181.44,451.32,Single-ply,SBD,M,
Boys,89.81,7,Joe Ruiz,Van,89.81,163.29,97.52,163.29,424.11,Single-ply,SBD,M,
Boys,89.81,8,Dorean Jordan,Kerens,84.82,142.88,95.25,167.83,405.97,Single-ply,SBD,M,
Boys,89.81,9,Braydon Hullum,Van,86.55,142.88,92.99,151.95,387.82,Single-ply,SBD,M,
Boys,89.81,10,Matthew Smith,Kerens,87.54,124.74,70.31,142.88,337.93,Single-ply,SBD,M,
Boys,89.81,11,Brandon Soules,Fruitvale,87.54,61.23,61.23,83.91,206.38,Single-ply,SBD,M,
Boys,89.81,DQ,Austin Frazier,Palestine Westwood,87.54,192.78,,,,Single-ply,SBD,M,
Boys,99.79,1,Ryan Magrill,Brownsboro,98.43,274.42,183.7,226.8,684.92,Single-ply,SBD,M,
Boys,99.79,2,Gabe Villarreal,Palestine Westwood,91.63,208.65,131.54,226.8,566.99,Single-ply,SBD,M,
Boys,99.79,3,Samuel Marsters,Fairfield,93.89,199.58,136.08,199.58,535.24,Single-ply,SBD,M,
Boys,99.79,4,Evan Owen,Corsicana,91.63,195.04,136.08,195.04,526.17,Single-ply,SBD,M,
Boys,99.79,5,Jose Morales,Malakoff,97.98,197.31,131.54,176.9,505.76,Single-ply,SBD,M,
Boys,99.79,6,Carter Anderson,Pollok Central,99.52,190.51,113.4,199.58,503.49,Single-ply,SBD,M,
Boys,99.79,7,Benjamin Brooks,Corsicana,92.53,190.51,124.74,185.97,501.22,Single-ply,SBD,M,
Boys,99.79,8,Ayden Coker,Palestine Westwood,94.8,181.44,136.08,183.7,501.22,Single-ply,SBD,M,
Boys,99.79,9,Shawn Meadows,Malakoff,95.35,188.24,111.13,179.17,478.54,Single-ply,SBD,M,
Boys,99.79,10,Doc Renberg,Malakoff,91.53,181.44,99.79,181.44,462.66,Single-ply,SBD,M,
Boys,99.79,11,Landon Salinas,Fairfield,96.62,188.24,102.06,158.76,449.06,Single-ply,SBD,M,
Boys,99.79,12,Sergio Ramirez,Corsicana,90.72,151.95,106.59,172.37,430.91,Single-ply,SBD,M,
Boys,99.79,13,Antonio Rodriguez,Kerens,93.44,154.22,124.74,145.15,424.11,Single-ply,SBD,M,
Boys,99.79,14,Juan Zamarripa,Pollok Central,99.7,154.22,65.77,167.83,387.82,Single-ply,SBD,M,
Boys,99.79,15,Jesus Alanis-Zamago,Pollok Central,99.79,113.4,63.5,136.08,312.98,Single-ply,SBD,M,
Boys,99.79,DQ,Hunter Heacox,Malakoff Cross Roads,97.07,158.76,,,,Single-ply,SBD,M,
Boys,109.77,1,Julio Roque,Fairfield,107.95,226.8,113.4,219.99,560.19,Single-ply,SBD,M,
Boys,109.77,2,Matthew Gomez,Palestine Westwood,106.14,210.92,117.93,204.12,532.97,Single-ply,SBD,M,
Boys,109.77,3,Fernando Contreras,Malakoff,102.15,199.58,131.54,183.7,514.83,Single-ply,SBD,M,
Boys,109.77,4,River Bonds,Fairfield,106.59,206.38,120.2,181.44,508.02,Single-ply,SBD,M,
Boys,109.77,5,Travis McCalister,Malakoff,108.68,183.7,111.13,192.78,487.61,Single-ply,SBD,M,
Boys,109.77,6,Dylon McGowan,Fairfield,102.97,170.1,111.13,176.9,458.13,Single-ply,SBD,M,
Boys,109.77,7,Patrick Crabtree,Kerens,103.87,170.1,106.59,154.22,430.91,Single-ply,SBD,M,
Boys,109.77,8,Tyler Callaway,Fruitvale,108.41,147.42,77.11,133.81,358.34,Single-ply,SBD,M,
Boys,124.74,1,Lance Robertson,Malakoff,121.83,263.08,167.83,226.8,657.71,Single-ply,SBD,M,
Boys,124.74,2,Mason Logan,Malakoff,122.92,204.12,147.42,213.19,564.72,Single-ply,SBD,M,
Boys,124.74,3,Brady Williams,Fairfield,116.57,226.8,140.61,195.04,562.45,Single-ply,SBD,M,
Boys,124.74,4,Ryder Rogers,Malakoff,117.57,204.12,122.47,204.12,530.7,Single-ply,SBD,M,
Boys,124.74,5,Aiden Gonzalez,Pollok Central,124.56,208.65,104.33,195.04,508.02,Single-ply,SBD,M,
Boys,124.74,6,Jose Suarez,Van,124.74,208.65,102.06,181.44,492.15,Single-ply,SBD,M,
Boys,124.74,7,Jesse Rodriguez,Malakoff,112.49,195.04,117.93,176.9,489.88,Single-ply,SBD,M,
Boys,124.74,8,Reggie Johnson,Van,111.86,197.31,106.59,174.63,478.54,Single-ply,SBD,M,
Boys,124.74,9,Kepler Maulthaup,Van,117.48,181.44,97.52,172.37,451.32,Single-ply,SBD,M,
Boys,124.74,10,Tyson Johnson,Pollok Central,123.29,176.9,79.38,195.04,451.32,Single-ply,SBD,M,
Boys,124.74,11,Nathaniel Smith,Palestine Westwood,117.93,154.22,106.59,156.49,417.3,Single-ply,SBD,M,
Boys,124.74,12,Damion Joiner,Van,117.48,149.69,83.91,167.83,401.43,Single-ply,SBD,M,
Boys,124.74,13,David Alvarado,Malakoff Cross Roads,112.94,142.88,72.57,120.2,335.66,Single-ply,SBD,M,
Boys,124.74,14,Antonio Flores,Fruitvale,111.13,106.59,72.57,120.2,299.37,Single-ply,SBD,M,
Boys,139.71,1,Trevor Marquez,Malakoff Cross Roads,133.36,265.35,158.76,219.99,644.1,Single-ply,SBD,M,
Boys,139.71,2,Branson Rhone,Brownsboro,137.44,183.7,117.93,204.12,505.76,Single-ply,SBD,M,
Boys,139.71,3,Zemetress Randle,Palestine Westwood,129.27,204.12,108.86,170.1,483.08,Single-ply,SBD,M,
Boys,139.71,4,Zackary Jackson,Malakoff,128.46,174.63,102.06,174.63,451.32,Single-ply,SBD,M,
Boys,139.71,5,Josh Vazquez,Malakoff Cross Roads,139.07,185.97,81.65,133.81,401.43,Single-ply,SBD,M,
Boys,139.71,DQ,Ethan Julian,Malakoff Cross Roads,126.55,,,,,Single-ply,SBD,M,
Boys,139.71,DQ,Trae Derrick,Van,129.73,213.19,,,,Single-ply,SBD,M,
Boys,139.71,DQ,Zanthony Jackson,Malakoff,133.63,190.51,106.59,,,Single-ply,SBD,M,
Boys,139.71+,1,D'Angelo Vazquez,Malakoff Cross Roads,148.32,226.8,106.59,183.7,517.1,Single-ply,SBD,M,
