Division,WeightClassKg,Place,Name,Team,BodyweightKg,Best3SquatKg,Best3BenchKg,Best3DeadliftKg,TotalKg,Equipment,Event,Sex,BirthDate
Boys,51.71,1,Kolbe Murray,Bay City,49.99,117.93,61.23,131.54,310.71,Single-ply,SBD,M,
Boys,51.71,2,Ernie Cano,Kenedy,50.8,111.13,65.77,124.74,301.64,Single-ply,SBD,M,
Boys,51.71,3,Canaan Allen,Bay City,50.62,97.52,58.97,124.74,281.23,Single-ply,SBD,M,
Boys,55.79,1,Jayden Moya,Refugio,55.34,113.4,77.11,142.88,333.39,Single-ply,SBD,M,
Boys,59.87,1,Javier Ontiveros,Refugio,58.88,136.08,90.72,149.69,376.48,Single-ply,SBD,M,
Boys,59.87,2,Jared Jaso,Refugio,59.6,124.74,70.31,142.88,337.93,Single-ply,SBD,M,
Boys,59.87,3,Jonathan Guerrero,Yorktown,58.88,127.01,79.38,129.27,335.66,Single-ply,SBD,M,
Boys,59.87,4,Ronnie Kimball,Bay City,59.24,108.86,56.7,124.74,290.3,Single-ply,SBD,M,
Boys,67.13,1,Adrian Valdez,Goliad,66.22,192.78,120.2,201.85,514.83,Single-ply,SBD,M,
Boys,67.13,2,Cleo Leal,Kenedy,61.6,158.76,92.99,151.95,403.7,Single-ply,SBD,M,
Boys,67.13,3,Morris Brown,Kenedy,61.69,165.56,77.11,161.03,403.7,Single-ply,SBD,M,
Boys,67.13,4,Justin Edision,Goliad,63.5,147.42,95.25,149.69,392.36,Single-ply,SBD,M,
Boys,67.13,5,Jo Jo Martinez,Goliad,64.86,142.88,70.31,142.88,356.07,Single-ply,SBD,M,
Boys,74.84,1,Caleb Barrientez,Kenedy,74.84,183.7,108.86,183.7,476.27,Single-ply,SBD,M,
Boys,74.84,2,Trevian McGilbra,Goliad,73.48,163.29,95.25,165.56,424.11,Single-ply,SBD,M,
Boys,74.84,3,Alexis Barrera,Goliad,73.94,163.29,83.91,165.56,412.77,Single-ply,SBD,M,
Boys,82.1,1,Trevor Bennett,Goliad,79.38,210.92,104.33,204.12,519.36,Single-ply,SBD,M,
Boys,82.1,2,Damien Herrera,Yorktown,80.56,161.03,79.38,158.76,399.16,Single-ply,SBD,M,
Boys,82.1,3,Brian Freeman,Yorktown,82.1,145.15,88.45,151.95,385.55,Single-ply,SBD,M,
Boys,89.81,1,Dylan Farias,Kenedy,89.81,219.99,136.08,215.46,571.53,Single-ply,SBD,M,
Boys,89.81,2,Calvin Lopez,Kenedy,86.64,192.78,133.81,158.76,485.34,Single-ply,SBD,M,
Boys,89.81,3,Glenn Ihde,Bay City,89.36,181.44,104.33,183.7,469.47,Single-ply,SBD,M,
Boys,89.81,4,Justin Guerrero,Yorktown,88.36,142.88,74.84,136.08,353.8,Single-ply,SBD,M,
Boys,99.79,1,Fernando Vargas,Kenedy,95.53,240.4,136.08,238.14,614.62,Single-ply,SBD,M,
Boys,99.79,2,Caden Bradford,Bay City,91.44,235.87,149.69,206.38,591.94,Single-ply,SBD,M,
Boys,99.79,3,Brennon Freeman,Yorktown,94.26,161.03,97.52,156.49,415.04,Single-ply,SBD,M,
Boys,109.77,1,Alex Burciaga,Bay City,101.79,161.03,79.38,149.69,390.09,Single-ply,SBD,M,
Boys,109.77,2,Courtney Williams,Bay City,104.51,102.06,63.5,113.4,278.96,Single-ply,SBD,M,
Boys,124.74,1,Ryland Reyna,Kenedy,114.94,231.33,190.51,226.8,648.64,Single-ply,SBD,M,
Boys,124.74,2,Ethan Pompa,Yorktown,110.95,226.8,113.4,183.7,523.9,Single-ply,SBD,M,
Boys,124.74,3,Leland Aguilar,Bay City,120.38,151.95,86.18,154.22,392.36,Single-ply,SBD,M,
Boys,139.71,1,Robert De Leon,Kenedy,126.78,206.38,183.7,206.38,596.47,Single-ply,SBD,M,
Boys,139.71,2,Dailynn Hernandez,Bay City,130.36,254.01,142.88,192.78,589.67,Single-ply,SBD,M,
Boys,139.71,3,Isaac Allen,Bay City,129.64,195.04,136.08,174.63,505.76,Single-ply,SBD,M,
Boys,139.71,4,Juan Garcia,Bay City,134.63,136.08,72.57,154.22,362.87,Single-ply,SBD,M,
