Division,WeightClassKg,Place,Name,Team,BodyweightKg,Best3SquatKg,Best3BenchKg,Best3DeadliftKg,TotalKg,Equipment,Event,Sex,BirthDate
Boys,51.71,1,Justin Chapa,Edinburg Vela,48.99,170.1,115.67,192.78,478.54,Single-ply,SBD,M,
Boys,51.71,2,Jon Vasquez,Edinburg,49.8,99.79,58.97,97.52,256.28,Single-ply,SBD,M,
Boys,51.71,3,Juan Zapata,Edinburg North,45.09,74.84,47.63,97.52,219.99,Single-ply,SBD,M,
Boys,55.79,DQ,Justin Acosta,Edinburg North,55.02,,,,,Single-ply,SBD,M,
Boys,59.87,1,Rivers Martinez,Edinburg,59.87,158.76,111.13,161.03,430.91,Single-ply,SBD,M,
Boys,59.87,2,Roland Saenz,Edinburg,59.87,136.08,86.18,136.08,358.34,Single-ply,SBD,M,
Boys,59.87,3,Sean Carperntar,Edinburg North,59.87,122.47,92.99,138.35,353.8,Single-ply,SBD,M,
Boys,59.87,4,Jacob Faz,Edinburg North,59.87,122.47,79.38,127.01,328.85,Single-ply,SBD,M,
Boys,59.87,5,Fernando Diosdado,Edinburg North,59.87,108.86,58.97,113.4,281.23,Single-ply,SBD,M,
Boys,59.87,DQ,Aleman Marques,Edinburg Vela,57.88,115.67,,,,Single-ply,SBD,M,
Boys,67.13,1,Diego Armendaiz,Edinburg Vela,66.54,161.03,102.06,183.7,446.79,Single-ply,SBD,M,
Boys,67.13,2,Josiah Caballero,Edinburg,65.36,165.56,92.99,174.63,433.18,Single-ply,SBD,M,
Boys,67.13,3,Nathaniel Rios,Edinburg,67,149.69,95.25,156.49,401.43,Single-ply,SBD,M,
Boys,67.13,4,Anthony Martinez,Edinburg North,66.22,142.88,83.91,156.49,383.29,Single-ply,SBD,M,
Boys,67.13,5,Adi Miranda,Edinburg Economedes,62.28,127.01,65.77,136.08,328.85,Single-ply,SBD,M,
Boys,74.84,1,Devin Aguilar,Edinburg North,74.57,217.72,154.22,231.33,603.28,Single-ply,SBD,M,
Boys,74.84,2,Villareal Jonah,Edinburg Vela,74.16,206.38,133.81,192.78,532.97,Single-ply,SBD,M,
Boys,74.84,3,Isaac Solis,Edinburg,72.08,170.1,136.08,188.24,494.42,Single-ply,SBD,M,
Boys,74.84,4,Chapa Braedan,Edinburg Vela,73.8,181.44,124.74,183.7,489.88,Single-ply,SBD,M,
Boys,74.84,5,Domingo Luevano,Edinburg,74.07,176.9,142.88,165.56,485.34,Single-ply,SBD,M,
Boys,74.84,6,Diego Guevara,Edinburg Economedes,69.08,151.95,102.06,183.7,437.72,Single-ply,SBD,M,
Boys,82.1,1,Othon Elizondo,Edinburg Economedes,81.24,224.53,122.47,224.53,571.53,Single-ply,SBD,M,
Boys,82.1,2,Miguel Rodriguez,Edinburg Economedes,79.11,188.24,122.47,204.12,514.83,Single-ply,SBD,M,
Boys,82.1,3,Trevino Ruben,Edinburg Vela,79.38,183.7,102.06,183.7,469.47,Single-ply,SBD,M,
Boys,82.1,4,Albert Gamez,Edinburg,81.74,158.76,97.52,145.15,401.43,Single-ply,SBD,M,
Boys,82.1,5,Eric Hernandez,Edinburg,77.43,151.95,97.52,140.61,390.09,Single-ply,SBD,M,
Boys,82.1,6,Eleno Rodriguez,Edinburg,77.47,142.88,79.38,124.74,347,Single-ply,SBD,M,
Boys,82.1,7,Erik Salinas,Edinburg North,78.34,127.01,74.84,145.15,347,Single-ply,SBD,M,
Boys,89.81,1,Garcia Jesus,Edinburg Vela,87.27,238.14,133.81,229.06,601.01,Single-ply,SBD,M,
Boys,89.81,2,Emiliano Mendez,Edinburg North,89.18,133.81,88.45,133.81,356.07,Single-ply,SBD,M,
Boys,99.79,1,Manuel Reyna,Edinburg Economedes,98.02,233.6,122.47,215.46,571.53,Single-ply,SBD,M,
Boys,99.79,2,Aydin Torres,Edinburg North,96.66,174.63,108.86,161.03,444.52,Single-ply,SBD,M,
Boys,99.79,3,Adrian Alaniz,Edinburg,97.93,154.22,68.04,145.15,367.41,Single-ply,SBD,M,
Boys,109.77,1,Rupert Lopez,Edinburg,109.32,158.76,99.79,133.81,392.36,Single-ply,SBD,M,
Boys,109.77,DQ,Zarate Lombardo,Edinburg Vela,102.15,,,,,Single-ply,SBD,M,
Boys,109.77,DQ,Pena Tristan,Edinburg Vela,102.29,208.65,122.47,,,Single-ply,SBD,M,
Boys,124.74,1,Meza Vincente,Edinburg Vela,112.94,215.46,170.1,206.38,591.94,Single-ply,SBD,M,
Boys,124.74,2,Alejandro Ramon,Edinburg North,124.47,151.95,120.2,172.37,444.52,Single-ply,SBD,M,
Boys,124.74,3,Ricardo De Leon,Edinburg Economedes,114.89,158.76,111.13,163.29,433.18,Single-ply,SBD,M,
Boys,124.74,DQ,Shean Cesena,Edinburg North,121.97,111.13,,,,Single-ply,SBD,M,
Boys,139.71,1,Raul Nava,Edinburg Vela,126.51,124.74,74.84,165.56,365.14,Single-ply,SBD,M,
Boys,139.71,DQ,Preston Alvarado,Edinburg Economedes,137.08,,,,,Single-ply,SBD,M,
Boys,139.71+,1,Pedro Martinez,Edinburg Economedes,151.55,249.48,138.35,238.14,625.96,Single-ply,SBD,M,
Boys,139.71+,2,Marco Diaz,Edinburg Vela,221.85,142.88,102.06,142.88,387.82,Single-ply,SBD,M,
