Division,WeightClassKg,Place,Name,Team,BodyweightKg,Best3SquatKg,Best3BenchKg,Best3DeadliftKg,TotalKg,Equipment,Event,Sex,BirthDate
Boys,55.79,1,Cannon Smith,San Augustine,52.53,90.72,61.23,115.67,267.62,Single-ply,SBD,M,
Boys,59.87,1,Alex Stepp,Hemphill,58.69,140.61,92.99,167.83,401.43,Single-ply,SBD,M,
Boys,59.87,2,Daniel Palacios,San Augustine,57.52,83.91,68.04,113.4,265.35,Single-ply,SBD,M,
Boys,59.87,3,Donny Caporali,Shelbyville,58.6,86.18,54.43,124.74,265.35,Single-ply,SBD,M,
Boys,59.87,4,Corey Holcomb,Pineland West Sabine,56.52,86.18,56.7,117.93,260.82,Single-ply,SBD,M,
Boys,59.87,5,Christian Chavez,Pineland West Sabine,57.06,88.45,58.97,102.06,249.48,Single-ply,SBD,M,
Boys,67.13,1,Kameron Striegel,Pineland West Sabine,60.15,149.69,74.84,136.08,360.61,Single-ply,SBD,M,
Boys,67.13,2,Jacob Dowden,Pineland West Sabine,64.59,117.93,68.04,124.74,310.71,Single-ply,SBD,M,
Boys,74.84,1,Carlos Garrett,Shelbyville,72.76,183.7,122.47,204.12,510.29,Single-ply,SBD,M,
Boys,74.84,2,DeKevin Smith,Hemphill,68.22,145.15,88.45,179.17,412.77,Single-ply,SBD,M,
Boys,74.84,3,Jed Wagstaff,Shelbyville,69.76,147.42,83.91,149.69,381.02,Single-ply,SBD,M,
Boys,74.84,4,Diego Prado,San Augustine,71.49,102.06,70.31,127.01,299.37,Single-ply,SBD,M,
Boys,74.84,NS,Chris Williams,Hemphill,,,,,,Single-ply,SBD,M,
Boys,82.1,1,Blaine Bourque,Pineland West Sabine,80.56,183.7,113.4,181.44,478.54,Single-ply,SBD,M,
Boys,82.1,2,Dustin Welch,Pineland West Sabine,79.2,142.88,70.31,136.08,349.27,Single-ply,SBD,M,
Boys,82.1,3,Dalton Hester,Pineland West Sabine,79.74,102.06,52.16,122.47,276.69,Single-ply,SBD,M,
Boys,89.81,1,Jolon Garner,San Augustine,85.37,215.46,127.01,215.46,557.92,Single-ply,SBD,M,
Boys,89.81,2,Jarren Jenkins,San Augustine,89.27,172.37,97.52,181.44,451.32,Single-ply,SBD,M,
Boys,89.81,3,Joe Harris,Hemphill,89.27,183.7,108.86,156.49,449.06,Single-ply,SBD,M,
Boys,89.81,4,Ashton Bragg,Shelbyville,89.45,142.88,74.84,147.42,365.14,Single-ply,SBD,M,
Boys,99.79,1,MiTelius Hoyle,Hemphill,94.8,138.35,90.72,151.95,381.02,Single-ply,SBD,M,
Boys,99.79,2,Edgar Yanez,San Augustine,92.26,124.74,81.65,154.22,360.61,Single-ply,SBD,M,
Boys,99.79,3,Trent Hoyt,San Augustine,99.61,124.74,79.38,140.61,344.73,Single-ply,SBD,M,
Boys,99.79,NS,JaMarrious Hall,Hemphill,,,,,,Single-ply,SBD,M,
Boys,109.77,1,Briley Rogers,Pineland West Sabine,106.68,208.65,113.4,181.44,503.49,Single-ply,SBD,M,
Boys,109.77,2,Dawson Jackson,Shelbyville,109.68,170.1,106.59,158.76,435.45,Single-ply,SBD,M,
Boys,109.77,3,Leland Jenkins,San Augustine,108.68,147.42,111.13,161.03,419.57,Single-ply,SBD,M,
Boys,124.74,1,Jaylon Kirksey,San Augustine,121.47,142.88,92.99,192.78,428.64,Single-ply,SBD,M,
Boys,124.74,2,Evan Sensat,Pineland West Sabine,115.21,154.22,83.91,181.44,419.57,Single-ply,SBD,M,
Boys,124.74,3,Stephen Morrison,Pineland West Sabine,117.39,102.06,61.23,133.81,297.1,Single-ply,SBD,M,
Boys,124.74,DQ,Bo Conn,Hemphill,115.21,249.48,142.88,,,Single-ply,SBD,M,
Boys,139.71+,1,Kei'Arriyen Parks,Hemphill,161.66,272.16,127.01,213.19,612.35,Single-ply,SBD,M,
Boys,139.71+,2,Jason Bush,San Augustine,140.16,226.8,158.76,204.12,589.67,Single-ply,SBD,M,
Boys,,NS,Chance Gray,Shelbyville,,,,,,Single-ply,SBD,M,
