Division,WeightClassKg,Place,Name,Team,BodyweightKg,Best3SquatKg,Best3BenchKg,Best3DeadliftKg,TotalKg,Equipment,Event,Sex,BirthDate
Boys,55.79,1,Erik Julio,Houston Northbrook,55.52,179.17,88.45,179.17,446.79,Single-ply,SBD,M,
Boys,59.87,1,Diego Manteca,Waller,59.87,183.7,92.99,147.42,424.11,Single-ply,SBD,M,
Boys,59.87,2,Troy Hubbard,Waller,59.33,156.49,81.65,136.08,374.21,Single-ply,SBD,M,
Boys,67.13,1,Miguel Garcia-Garcia,Waller,66.32,185.97,120.2,192.78,498.95,Single-ply,SBD,M,
Boys,67.13,2,Bayron Pecina,Houston Northbrook,64.59,142.88,63.5,163.29,369.68,Single-ply,SBD,M,
Boys,67.13,3,Marcello Villarreal,Houston Northbrook,66.59,142.88,83.91,142.88,369.68,Single-ply,SBD,M,
Boys,74.84,1,Gabriel Mata,Houston Northbrook,71.67,179.17,92.99,210.92,483.08,Single-ply,SBD,M,
Boys,74.84,2,Jan Herrera,Houston Northbrook,74.84,165.56,102.06,174.63,442.25,Single-ply,SBD,M,
Boys,74.84,3,Josue Giron,Houston Northbrook,74.12,151.95,61.23,154.22,367.41,Single-ply,SBD,M,
Boys,74.84,4,Keneth Sauceda,Houston Northbrook,69.58,138.35,77.11,147.42,362.87,Single-ply,SBD,M,
Boys,74.84,5,Steven Portillo,Houston Northbrook,72.98,106.59,61.23,127.01,294.84,Single-ply,SBD,M,
Boys,82.1,1,Zach Phipps,Waller,78.38,199.58,127.01,188.24,514.83,Single-ply,SBD,M,
Boys,82.1,2,Jacob Dains,Waller,80.56,190.51,108.86,215.46,514.83,Single-ply,SBD,M,
Boys,89.81,1,Ryan Garcia,Waller,87.18,199.58,138.35,167.83,505.76,Single-ply,SBD,M,
Boys,89.81,2,Kolby Karsteter,Waller,88.45,188.24,108.86,183.7,480.81,Single-ply,SBD,M,
Boys,89.81,3,Joshua Simpson,Waller,87.82,183.7,104.33,183.7,471.74,Single-ply,SBD,M,
Boys,99.79,1,Erik Cornejo,Waller,97.34,249.48,117.93,204.12,571.53,Single-ply,SBD,M,
Boys,99.79,2,Jairo Garcia,Waller,97.25,183.7,120.2,199.58,503.49,Single-ply,SBD,M,
Boys,99.79,3,Sebastian Guzman,Houston Northbrook,96.43,151.95,70.31,165.56,387.82,Single-ply,SBD,M,
Boys,109.77,1,Prince Echaverry,Houston Northbrook,106.87,247.21,138.35,226.8,612.35,Single-ply,SBD,M,
Boys,109.77,2,Leighton Geiman,Waller,109.68,190.51,113.4,190.51,494.42,Single-ply,SBD,M,
Boys,124.74,1,Dwayne Salter,Waller,116.21,278.96,131.54,219.99,630.49,Single-ply,SBD,M,
Boys,124.74,2,Jaiden Stevens,Waller,116.48,226.8,117.93,197.31,542.04,Single-ply,SBD,M,
Boys,124.74,3,Alex Alvarenga,Waller,124.01,204.12,124.74,183.7,512.56,Single-ply,SBD,M,
