Division,WeightClassKg,Place,Name,Team,BodyweightKg,Best3SquatKg,Best3BenchKg,Best3DeadliftKg,TotalKg,Equipment,Event,Sex,BirthDate
Boys,51.71,1,Ethan Bolin,Fort Worth Boswell,51.71,77.11,58.97,92.99,229.06,Single-ply,SBD,M,
Boys,51.71,2,Juan Avelarolmos,Saginaw,51.53,65.77,43.09,68.04,176.9,Single-ply,SBD,M,
Boys,51.71,3,Preston Andrews,Glen Rose,43.09,61.23,24.95,52.16,138.35,Single-ply,SBD,M,
Boys,55.79,1,Joe Builtron,Fort Worth Boswell,54.43,106.59,68.04,131.54,306.17,Single-ply,SBD,M,
Boys,59.87,1,Meschac Ntuaremba,Saginaw,59.15,124.74,88.45,149.69,362.87,Single-ply,SBD,M,
Boys,59.87,2,Meritt Brewer,Glen Rose,59.87,136.08,63.5,136.08,335.66,Single-ply,SBD,M,
Boys,67.13,1,Djonny Mukuna,Saginaw,66.77,167.83,113.4,190.51,471.74,Single-ply,SBD,M,
Boys,67.13,2,Ethan Hodkinson,Fort Worth Boswell,64.86,149.69,92.99,149.69,392.36,Single-ply,SBD,M,
Boys,67.13,3,Kolt Giesen,Glen Rose,66.41,136.08,92.99,149.69,378.75,Single-ply,SBD,M,
Boys,67.13,4,Dede Lords,Fort Worth Boswell,64.86,111.13,77.11,136.08,324.32,Single-ply,SBD,M,
Boys,67.13,5,Ethan Corbin,Saginaw,65.5,113.4,86.18,120.2,319.78,Single-ply,SBD,M,
Boys,67.13,6,Kaleb Baker,Glen Rose,64.68,122.47,63.5,131.54,317.51,Single-ply,SBD,M,
Boys,67.13,7,Martin Reedy,Glen Rose,67.13,122.47,68.04,127.01,317.51,Single-ply,SBD,M,
Boys,67.13,8,Logan Angles,Saginaw,62.05,111.13,68.04,102.06,281.23,Single-ply,SBD,M,
Boys,74.84,1,Parker Stephenson,Glen Rose,74.66,192.78,111.13,195.04,498.95,Single-ply,SBD,M,
Boys,74.84,2,Jordan DeHoyos,Fort Worth Boswell,71.67,163.29,122.47,197.31,483.08,Single-ply,SBD,M,
Boys,74.84,3,Diego Caceres,Fort Worth Boswell,69.85,138.35,104.33,185.97,428.64,Single-ply,SBD,M,
Boys,74.84,4,Max Grear,Fort Worth Boswell,74.84,156.49,81.65,158.76,396.89,Single-ply,SBD,M,
Boys,74.84,5,James Pompa,Glen Rose,73.03,149.69,81.65,158.76,390.09,Single-ply,SBD,M,
Boys,74.84,6,Ethan Treadaway,Glen Rose,73.94,154.22,81.65,154.22,390.09,Single-ply,SBD,M,
Boys,74.84,7,Brandon Richardson,Saginaw,74.39,142.88,74.84,172.37,390.09,Single-ply,SBD,M,
Boys,74.84,8,Isaac Braly,Saginaw,74.3,120.2,102.06,161.03,383.29,Single-ply,SBD,M,
Boys,74.84,9,Michael Williams,Saginaw,73.39,142.88,77.11,154.22,374.21,Single-ply,SBD,M,
Boys,74.84,10,Walker Andrews,Glen Rose,74.03,142.88,74.84,154.22,371.95,Single-ply,SBD,M,
Boys,74.84,11,Matthew Becker,Fort Worth Boswell,72.57,140.61,83.91,136.08,360.61,Single-ply,SBD,M,
Boys,74.84,12,Preston Ragsdale,Glen Rose,74.3,113.4,68.04,129.27,310.71,Single-ply,SBD,M,
Boys,74.84,13,Wyatt Robinson,Fort Worth Boswell,73.03,108.86,77.11,113.4,299.37,Single-ply,SBD,M,
Boys,82.1,1,Tristan Black,Glen Rose,79.38,199.58,99.79,183.7,483.08,Single-ply,SBD,M,
Boys,82.1,2,Christian de la Cruz,Glen Rose,81.65,163.29,104.33,204.12,471.74,Single-ply,SBD,M,
Boys,82.1,3,Alex Rosales,Fort Worth Boswell,77.11,149.69,102.06,165.56,417.3,Single-ply,SBD,M,
Boys,82.1,4,Russell Lem,Glen Rose,81.74,149.69,97.52,165.56,412.77,Single-ply,SBD,M,
Boys,82.1,5,Riley Devries,Saginaw,81.19,106.59,88.45,149.69,344.73,Single-ply,SBD,M,
Boys,82.1,6,Caleb Apple,Saginaw,80.56,111.13,88.45,129.27,328.85,Single-ply,SBD,M,
Boys,82.1,7,Dylan Howard,Glen Rose,77.84,117.93,74.84,127.01,319.78,Single-ply,SBD,M,
Boys,89.81,1,Ryder Cook,Glen Rose,87.36,204.12,124.74,192.78,521.63,Single-ply,SBD,M,
Boys,89.81,2,Jacob Brewer,Saginaw,85.09,181.44,106.59,208.65,496.68,Single-ply,SBD,M,
Boys,89.81,3,Ezra Carter,Fort Worth Boswell,83.46,185.97,113.4,185.97,485.34,Single-ply,SBD,M,
Boys,89.81,4,Hunter Douglas,Glen Rose,89.36,181.44,108.86,181.44,471.74,Single-ply,SBD,M,
Boys,89.81,5,Gabe Wright,Fort Worth Boswell,89.36,167.83,108.86,183.7,460.4,Single-ply,SBD,M,
Boys,89.81,6,Duy Lam,Saginaw,83.01,165.56,102.06,181.44,449.06,Single-ply,SBD,M,
Boys,89.81,7,Alaril Ferguson,Saginaw,84.82,158.76,106.59,163.29,428.64,Single-ply,SBD,M,
Boys,89.81,8,Giovany Porras,Saginaw,85.91,154.22,95.25,163.29,412.77,Single-ply,SBD,M,
Boys,89.81,9,Eduardo Arabaiza,Saginaw,86.91,142.88,,147.42,290.3,Single-ply,SD,M,
Boys,99.79,1,Mason Munk,Fort Worth Boswell,99.79,192.78,124.74,192.78,510.29,Single-ply,SBD,M,
Boys,99.79,2,Keltyn Raymond,Glen Rose,98.25,183.7,104.33,192.78,480.81,Single-ply,SBD,M,
Boys,99.79,3,Jake Gilbreath,Glen Rose,99.52,183.7,104.33,192.78,480.81,Single-ply,SBD,M,
Boys,99.79,4,Sawyer Ghazal,Glen Rose,94.26,183.7,113.4,174.63,471.74,Single-ply,SBD,M,
Boys,99.79,5,Gerson Trejo,Saginaw,91.63,154.22,86.18,156.49,396.89,Single-ply,SBD,M,
Boys,99.79,6,Josh Mangus,Fort Worth Boswell,92.08,138.35,95.25,158.76,392.36,Single-ply,SBD,M,
Boys,99.79,7,Kyle Daulton,Saginaw,97.16,127.01,90.72,158.76,376.48,Single-ply,SBD,M,
Boys,109.77,1,Harley Bowman,Glen Rose,107.05,199.58,120.2,215.46,535.24,Single-ply,SBD,M,
Boys,109.77,2,Alijah Brand,Fort Worth Boswell,103.87,183.7,113.4,192.78,489.88,Single-ply,SBD,M,
Boys,109.77,3,Kenneth Beavers,Saginaw,106.41,136.08,65.77,149.69,351.53,Single-ply,SBD,M,
Boys,124.74,1,Gerardo De La O,Saginaw,114.12,208.65,120.2,208.65,537.51,Single-ply,SBD,M,
Boys,124.74,2,Peyton Klein,Glen Rose,118.57,215.46,127.01,183.7,526.17,Single-ply,SBD,M,
Boys,124.74,3,Donell Jackson,Saginaw,113.31,167.83,113.4,226.8,508.02,Single-ply,SBD,M,
Boys,124.74,4,Conner Austin,Fort Worth Boswell,115.21,170.1,106.59,158.76,435.45,Single-ply,SBD,M,
Boys,124.74,5,Nate Cordova,Fort Worth Boswell,122.02,158.76,90.72,165.56,415.04,Single-ply,SBD,M,
Boys,124.74,6,Michael Esparza,Glen Rose,116.21,158.76,,181.44,340.19,Single-ply,SD,M,
Boys,139.71,1,Austin Lyon,Fort Worth Boswell,127.01,238.14,136.08,238.14,612.35,Single-ply,SBD,M,
Boys,139.71,2,Drew Garcia,Saginaw,139.43,181.44,111.13,176.9,469.47,Single-ply,SBD,M,
Boys,139.71,3,Zaylan Williams,Saginaw,128.28,158.76,79.38,156.49,394.63,Single-ply,SBD,M,
Boys,139.71+,1,Xzaviah Milton,Saginaw,146.87,226.8,131.54,181.44,539.77,Single-ply,SBD,M,
Boys,139.71+,2,Anthony Rodriguez,Saginaw,149.41,181.44,81.65,204.12,467.2,Single-ply,SBD,M,
