Division,WeightClassKg,Place,Name,Team,BodyweightKg,Best3SquatKg,Best3BenchKg,Best3DeadliftKg,TotalKg,Equipment,Event,Sex,BirthDate
Boys,51.71,1,Imanol Mendez,Louise,51.26,145.15,72.57,154.22,371.95,Single-ply,SBD,M,
Boys,51.71,2,Kolbe Murray,Bay City,49.9,120.2,61.23,136.08,317.51,Single-ply,SBD,M,
Boys,51.71,3,Cam Graves,Palacios,49.71,102.06,74.84,122.47,299.37,Single-ply,SBD,M,
Boys,51.71,4,Curtis Ledwig,Ganado,51.44,120.2,56.7,113.4,290.3,Single-ply,SBD,M,
Boys,55.79,1,Alex Le,Palacios,52.25,149.69,95.25,161.03,405.97,Single-ply,SBD,M,
Boys,55.79,2,Jacob Miller,Louise,52.25,77.11,72.57,106.59,256.28,Single-ply,SBD,M,
Boys,55.79,3,Trevor Lutringer,Louise,53.98,74.84,56.7,120.2,251.74,Single-ply,SBD,M,
Boys,59.87,1,Jordan Garcia,El Maton Tidehaven,57.97,156.49,83.91,170.1,410.5,Single-ply,SBD,M,
Boys,59.87,2,Noah Whittley,Edna,56.34,138.35,83.91,158.76,381.02,Single-ply,SBD,M,
Boys,59.87,3,Chad Faas,El Maton Tidehaven,56.34,113.4,83.91,136.08,333.39,Single-ply,SBD,M,
Boys,59.87,4,Tanner Veselka,Vanderbilt Industrial,59.87,136.08,56.7,133.81,326.59,Single-ply,SBD,M,
Boys,67.13,1,Manny Calderon,Ganado,66.5,190.51,113.4,190.51,494.42,Single-ply,SBD,M,
Boys,67.13,2,Bryce Duke,Palacios,66.13,167.83,92.99,183.7,444.52,Single-ply,SBD,M,
Boys,67.13,3,Cain Hayden,Ganado,65.5,170.1,88.45,163.29,421.84,Single-ply,SBD,M,
Boys,67.13,4,Benjamin Blanco,Louise,66.32,149.69,95.25,174.63,419.57,Single-ply,SBD,M,
Boys,67.13,5,Michael Drozd,Louise,65.77,142.88,102.06,170.1,415.04,Single-ply,SBD,M,
Boys,67.13,6,Alex Benavides,Vanderbilt Industrial,63.05,156.49,86.18,158.76,401.43,Single-ply,SBD,M,
Boys,67.13,7,Blayke Yeager,Louise,62.51,147.42,79.38,172.37,399.16,Single-ply,SBD,M,
Boys,67.13,8,Jorge Auguiano,El Campo,63.5,133.81,83.91,147.42,365.14,Single-ply,SBD,M,
Boys,67.13,9,Luke Bures,Ganado,65.32,142.88,79.38,136.08,358.34,Single-ply,SBD,M,
Boys,67.13,10,Juan Almeda,Ganado,66.68,129.27,70.31,145.15,344.73,Single-ply,SBD,M,
Boys,67.13,11,Alex Garcia #12,Palacios,66.59,142.88,68.04,131.54,342.46,Single-ply,SBD,M,
Boys,67.13,12,Felix Rodriguez,Bay City,66.77,113.4,61.23,136.08,310.71,Single-ply,SBD,M,
Boys,67.13,NS,Jacob Arguijo,Palacios,,,,,,Single-ply,SBD,M,
Boys,67.13,DQ,Adrian Sanchez,Wharton,67.13,,,,,Single-ply,SBD,M,
Boys,67.13,NS,David Goad,Wharton,,,,,,Single-ply,SBD,M,
Boys,74.84,1,Alexis Martinez #14,Ganado,74.48,195.04,117.93,192.78,505.76,Single-ply,SBD,M,
Boys,74.84,2,Aiden Garcia,Edna,73.94,181.44,113.4,195.04,489.88,Single-ply,SBD,M,
Boys,74.84,3,Ezequiel Medina,Louise,71.49,172.37,88.45,197.31,458.13,Single-ply,SBD,M,
Boys,74.84,4,Frank O'Connor,El Campo,72.76,174.63,108.86,156.49,439.98,Single-ply,SBD,M,
Boys,74.84,5,Brandon Almeda,Ganado,74.84,176.9,92.99,170.1,439.98,Single-ply,SBD,M,
Boys,74.84,6,Karson Van Pelt,Vanderbilt Industrial,72.57,158.76,97.52,161.03,417.3,Single-ply,SBD,M,
Boys,74.84,7,Luke Montague,El Maton Tidehaven,72.57,142.88,113.4,151.95,408.23,Single-ply,SBD,M,
Boys,74.84,8,Nathan Glaze,El Maton Tidehaven,73.75,149.69,108.86,149.69,408.23,Single-ply,SBD,M,
Boys,74.84,9,Joseluis Cisneros,Palacios,70.49,151.95,72.57,170.1,394.63,Single-ply,SBD,M,
Boys,74.84,10,Jermey Griggs,Wharton,71.94,113.4,88.45,117.93,319.78,Single-ply,SBD,M,
Boys,74.84,NS,Gavinv Duke,Palacios,,,,,,Single-ply,SBD,M,
Boys,74.84,DQ,Jacob Martinez,El Maton Tidehaven,74.84,,,,,Single-ply,SBD,M,
Boys,82.1,1,John Sample,Edna,76.66,226.8,115.67,195.04,537.51,Single-ply,SBD,M,
Boys,82.1,2,Joseph Tate,El Maton Tidehaven,81.1,215.46,138.35,183.7,537.51,Single-ply,SBD,M,
Boys,82.1,3,Tristan Harper,El Campo,81.37,190.51,145.15,183.7,519.36,Single-ply,SBD,M,
Boys,82.1,4,Dalton Bohannon,Edna,82.1,183.7,113.4,204.12,501.22,Single-ply,SBD,M,
Boys,82.1,5,Haydn Neito,Palacios,78.2,181.44,102.06,195.04,478.54,Single-ply,SBD,M,
Boys,82.1,6,Lebron Garcia,El Maton Tidehaven,79.92,161.03,92.99,183.7,437.72,Single-ply,SBD,M,
Boys,82.1,7,Juan Andrade,Bay City,82.1,167.83,102.06,165.56,435.45,Single-ply,SBD,M,
Boys,82.1,8,Josh Turner,Vanderbilt Industrial,78.38,158.76,83.91,154.22,396.89,Single-ply,SBD,M,
Boys,82.1,9,Fisher Keszler,El Maton Tidehaven,80.74,136.08,104.33,145.15,385.55,Single-ply,SBD,M,
Boys,82.1,10,Raymond Rodriguez,El Campo,81.37,124.74,102.06,158.76,385.55,Single-ply,SBD,M,
Boys,82.1,11,Vicente Cortez,Edna,79.38,138.35,68.04,156.49,362.87,Single-ply,SBD,M,
Boys,82.1,12,Brandon Garcia,Bay City,78.83,124.74,72.57,147.42,344.73,Single-ply,SBD,M,
Boys,82.1,DQ,Carter Kovar,Ganado,80.38,185.97,102.06,,,Single-ply,SBD,M,
Boys,89.81,1,Jesse Cornish,Vanderbilt Industrial,86.36,231.33,129.27,192.78,553.38,Single-ply,SBD,M,
Boys,89.81,2,Roy Arrambide,Louise,86.18,147.42,97.52,165.56,410.5,Single-ply,SBD,M,
Boys,89.81,3,David Almeda,Ganado,87.91,170.1,97.52,140.61,408.23,Single-ply,SBD,M,
Boys,89.81,DQ,Joshua Gomez,Louise,86.18,170.1,111.13,,,Single-ply,SBD,M,
Boys,89.81,DQ,Jericho Cardenas,Wharton,89.81,,,,,Single-ply,SBD,M,
Boys,99.79,1,Daniel Gaona III,Louise,96.07,272.16,154.22,233.6,659.98,Single-ply,SBD,M,
Boys,99.79,2,Caden Bradford,Bay City,92.8,263.08,156.49,229.06,648.64,Single-ply,SBD,M,
Boys,99.79,3,Fernando Cortez,Edna,93.8,235.87,131.54,235.87,603.28,Single-ply,SBD,M,
Boys,99.79,4,Cameron Davis,Bloomington,97.16,213.19,151.95,226.8,591.94,Single-ply,SBD,M,
Boys,99.79,5,Tanner Lev,Palacios,96.71,229.06,120.2,224.53,573.79,Single-ply,SBD,M,
Boys,99.79,6,Glenn Ihde,Bay City,89.99,213.19,108.86,213.19,535.24,Single-ply,SBD,M,
Boys,99.79,7,Sean Sneath,El Maton Tidehaven,93.53,183.7,120.2,208.65,512.56,Single-ply,SBD,M,
Boys,99.79,8,Ethan Resendez,Louise,97.25,190.51,102.06,195.04,487.61,Single-ply,SBD,M,
Boys,99.79,9,Brian Resendez,El Maton Tidehaven,98.52,174.63,113.4,190.51,478.54,Single-ply,SBD,M,
Boys,99.79,10,Dominic Williams,Wharton,97.89,183.7,106.59,183.7,474,Single-ply,SBD,M,
Boys,99.79,11,Jaime Leal,El Campo,91.72,176.9,117.93,176.9,471.74,Single-ply,SBD,M,
Boys,99.79,12,Michael Havranek,Bloomington,98.16,165.56,86.18,156.49,408.23,Single-ply,SBD,M,
Boys,99.79,13,Ricardo Garcia,Bay City,93.08,124.74,86.18,165.56,376.48,Single-ply,SBD,M,
Boys,99.79,14,Chaze McRae,Palacios,98.61,129.27,74.84,111.13,315.25,Single-ply,SBD,M,
Boys,99.79,NS,Jensen McKinney,Palacios,,,,,,Single-ply,SBD,M,
Boys,99.79,DQ,Clarence Farrow,El Campo,99.79,,,,,Single-ply,SBD,M,
Boys,99.79,DQ,Sean Cotton,El Maton Tidehaven,99.79,,,,,Single-ply,SBD,M,
Boys,109.77,1,Xavier Perez,Palacios,103.15,278.96,170.1,235.87,684.92,Single-ply,SBD,M,
Boys,109.77,2,Wyatt Lee,El Maton Tidehaven,108.14,244.94,158.76,183.7,587.4,Single-ply,SBD,M,
Boys,109.77,3,Taylor Manriquez,El Campo,108.23,215.46,154.22,204.12,573.79,Single-ply,SBD,M,
Boys,109.77,4,Ezequiel Huitzil,Vanderbilt Industrial,103.51,201.85,97.52,192.78,492.15,Single-ply,SBD,M,
Boys,109.77,5,Alex Burciaga,Bay City,104.14,185.97,99.79,183.7,469.47,Single-ply,SBD,M,
Boys,109.77,6,Bryan Tinajero,Bloomington,109.59,147.42,86.18,201.85,435.45,Single-ply,SBD,M,
Boys,109.77,7,Courtney Williams,Bay City,102.42,136.08,70.31,136.08,342.46,Single-ply,SBD,M,
Boys,109.77,8,David Wingo,Wharton,102.78,111.13,97.52,129.27,337.93,Single-ply,SBD,M,
Boys,109.77,DQ,Jace Kitchens,Vanderbilt Industrial,109.77,,,,,Single-ply,SBD,M,
Boys,109.77,DQ,Nick Debo,El Campo,109.77,,,,,Single-ply,SBD,M,
Boys,124.74,1,Juan Leal,El Campo,117.66,294.84,165.56,249.48,709.87,Single-ply,SBD,M,
Boys,124.74,2,Christopher Vasquez,Louise,122.74,294.84,133.81,251.74,680.39,Single-ply,SBD,M,
Boys,124.74,3,Andrew Galvan,El Maton Tidehaven,120.11,272.16,165.56,197.31,635.03,Single-ply,SBD,M,
Boys,124.74,4,Kohl Powell,Vanderbilt Industrial,113.85,224.53,122.47,208.65,555.65,Single-ply,SBD,M,
Boys,124.74,5,Marcos Ontiveros,El Campo,116.57,185.97,120.2,174.63,480.81,Single-ply,SBD,M,
Boys,124.74,6,Vincent Barajas,Ganado,110.86,183.7,95.25,176.9,455.86,Single-ply,SBD,M,
Boys,124.74,7,Michael Sosa,El Campo,111.49,188.24,106.59,158.76,453.59,Single-ply,SBD,M,
Boys,124.74,8,Leland Aguilar,Bay City,122.83,172.37,99.79,176.9,449.06,Single-ply,SBD,M,
Boys,124.74,DQ,Augustine Muniz,Wharton,114.58,192.78,,,,Single-ply,SBD,M,
Boys,124.74,NS,Eric Garza,Edna,,,,,,Single-ply,SBD,M,
Boys,124.74,DQ,Kerry North,El Campo,124.74,,,,,Single-ply,SBD,M,
Boys,139.71,1,Jerry Johnson,El Maton Tidehaven,127.64,362.87,197.31,260.82,821,Single-ply,SBD,M,
Boys,139.71,2,Dailynn Hernandez,Bay City,131.18,283.5,145.15,219.99,648.64,Single-ply,SBD,M,
