<?xml version="1.0" encoding="UTF-8" standalone="no"?>
<svg
   xmlns:dc="http://purl.org/dc/elements/1.1/"
   xmlns:cc="http://creativecommons.org/ns#"
   xmlns:rdf="http://www.w3.org/1999/02/22-rdf-syntax-ns#"
   xmlns:svg="http://www.w3.org/2000/svg"
   xmlns="http://www.w3.org/2000/svg"
   xmlns:xlink="http://www.w3.org/1999/xlink"
   xmlns:sodipodi="http://sodipodi.sourceforge.net/DTD/sodipodi-0.dtd"
   xmlns:inkscape="http://www.inkscape.org/namespaces/inkscape"
   version="1.1"
   x="0px"
   y="0px"
   viewBox="0 0 72 96"
   enable-background="new 0 0 96 96"
   xml:space="preserve"
   id="svg30"
   sodipodi:docname="noun_227701_cc.svg"
   width="72"
   height="96"
   inkscape:version="0.92.2 5c3e80d, 2017-08-06"><metadata
     id="metadata36"><rdf:RDF><cc:Work
         rdf:about=""><dc:format>image/svg+xml</dc:format><dc:type
           rdf:resource="http://purl.org/dc/dcmitype/StillImage" /><dc:title></dc:title></cc:Work></rdf:RDF></metadata><defs
     id="defs34" /><sodipodi:namedview
     pagecolor="#ffffff"
     bordercolor="#666666"
     borderopacity="1"
     objecttolerance="10"
     gridtolerance="10"
     guidetolerance="10"
     inkscape:pageopacity="0"
     inkscape:pageshadow="2"
     inkscape:window-width="1266"
     inkscape:window-height="835"
     id="namedview32"
     showgrid="false"
     fit-margin-top="0"
     fit-margin-left="0"
     fit-margin-right="0"
     fit-margin-bottom="0"
     inkscape:zoom="1.9666667"
     inkscape:cx="35"
     inkscape:cy="36"
     inkscape:window-x="0"
     inkscape:window-y="0"
     inkscape:window-maximized="0"
     inkscape:current-layer="svg30" /><g
     id="g20"
     transform="translate(-13)"><defs
       id="defs3"><path
         id="b"
         d="m 83,84 c 0,5.523 -4.477,10 -10,10 H 25 C 19.477,94 15,89.523 15,84 V 12 C 15,6.477 19.477,2 25,2 h 48 c 5.523,0 10,4.477 10,10 z"
         inkscape:connector-curvature="0" /></defs><clipPath
       id="a"><use
         xlink:href="#b"
         overflow="visible"
         id="use5"
         style="overflow:visible"
         x="0"
         y="0"
         width="100%"
         height="100%" /></clipPath><g
       clip-path="url(#a)"
       id="g10"><path
         d="m 57.768,45.194 -9.997,-7.823 c -4.062,3.177 -9.846,3.121 -13.888,-0.374 l -2.338,-2.021 8.431,-10.76 3.148,2.467 -6.057,7.731 c 2.843,1.997 6.725,1.609 9.123,-1.014 l 1.25,-1.368 12.792,10.011 z"
         id="path8"
         inkscape:connector-curvature="0"
         style="fill:#000000" /></g><g
       clip-path="url(#a)"
       id="g14"><path
         d="M 54.146,96.206 50.324,95.027 55.36,78.694 48.241,72.849 43.645,65.769 30.961,56.422 c -3.108,-2.29 -3.897,-6.621 -1.795,-9.861 1.077,-1.659 2.737,-2.79 4.675,-3.184 1.938,-0.395 3.907,-0.001 5.546,1.105 L 54.359,54.594 57,47.633 V 35.058 L 51.151,29 H 48 C 41.383,29 36,23.617 36,17 V 15 H 55.746 L 72,29.087 V 92 H 68 V 30.913 L 54.254,19 H 40.253 c 0.891,3.447 4.026,6 7.747,6 h 4.849 L 61,33.442 V 48.367 L 56.308,60.738 37.149,47.798 c -0.742,-0.501 -1.635,-0.679 -2.511,-0.5 -0.877,0.178 -1.629,0.69 -2.116,1.441 -0.951,1.466 -0.594,3.427 0.812,4.463 l 13.271,9.779 4.654,7.17 8.714,7.155 z"
         id="path12"
         inkscape:connector-curvature="0"
         style="fill:#000000" /></g><g
       clip-path="url(#a)"
       id="g18"><path
         d="m 53.757,48.603 c -2.336,0 -4.649,-0.982 -6.272,-2.855 l -2.756,-3.18 7.673,-4.945 2.167,3.362 -3.781,2.437 c 1.433,1.369 3.659,1.584 5.338,0.465 l 1.765,-1.176 2.219,3.328 -1.765,1.176 c -1.402,0.935 -3,1.388 -4.588,1.388 z"
         id="path16"
         inkscape:connector-curvature="0"
         style="fill:#000000" /></g></g><g
     id="g24"
     transform="translate(-13)"><path
       d="M 73,96 H 25 C 18.383,96 13,90.617 13,84 V 12 C 13,5.383 18.383,0 25,0 h 48 c 6.617,0 12,5.383 12,12 v 72 c 0,6.617 -5.383,12 -12,12 z M 25,4 c -4.411,0 -8,3.589 -8,8 v 72 c 0,4.411 3.589,8 8,8 h 48 c 4.411,0 8,-3.589 8,-8 V 12 C 81,7.589 77.411,4 73,4 Z"
       id="path22"
       inkscape:connector-curvature="0"
       style="fill:#000000" /></g></svg>