<?xml version="1.0" encoding="UTF-8" standalone="no"?>
<svg
   xmlns:dc="http://purl.org/dc/elements/1.1/"
   xmlns:cc="http://creativecommons.org/ns#"
   xmlns:rdf="http://www.w3.org/1999/02/22-rdf-syntax-ns#"
   xmlns:svg="http://www.w3.org/2000/svg"
   xmlns="http://www.w3.org/2000/svg"
   xmlns:sodipodi="http://sodipodi.sourceforge.net/DTD/sodipodi-0.dtd"
   xmlns:inkscape="http://www.inkscape.org/namespaces/inkscape"
   version="1.1"
   x="0px"
   y="0px"
   viewBox="0 0 83.274506 72.5"
   xml:space="preserve"
   id="svg24"
   sodipodi:docname="noun_952588_cc.svg"
   width="83.274506"
   height="72.5"
   inkscape:version="0.92.2 5c3e80d, 2017-08-06"><metadata
     id="metadata30"><rdf:RDF><cc:Work
         rdf:about=""><dc:format>image/svg+xml</dc:format><dc:type
           rdf:resource="http://purl.org/dc/dcmitype/StillImage" /><dc:title></dc:title></cc:Work></rdf:RDF></metadata><defs
     id="defs28" /><sodipodi:namedview
     pagecolor="#ffffff"
     bordercolor="#666666"
     borderopacity="1"
     objecttolerance="10"
     gridtolerance="10"
     guidetolerance="10"
     inkscape:pageopacity="0"
     inkscape:pageshadow="2"
     inkscape:window-width="640"
     inkscape:window-height="480"
     id="namedview26"
     showgrid="false"
     fit-margin-top="0"
     fit-margin-left="0"
     fit-margin-right="0"
     fit-margin-bottom="0"
     inkscape:zoom="1.888"
     inkscape:cx="41.711152"
     inkscape:cy="27.2"
     inkscape:window-x="0"
     inkscape:window-y="1"
     inkscape:window-maximized="0"
     inkscape:current-layer="svg24" /><style
     type="text/css"
     id="style2">
	.st0{stroke:#000000;stroke-miterlimit:10;}
	.st1{fill:none;stroke:#000000;stroke-miterlimit:10;}
</style><path
     class="st0"
     d="m 76.111152,14.8 h 1.7 c 0.2,0 0.3,0.1 0.4,0.2 0.9,0.7 4.5,3.9 4.5,6.2 0.1,2.6 -1.9,3.1 -1.9,3.1 h -4.8 v -9.5 z"
     id="path4"
     inkscape:connector-curvature="0"
     style="stroke:#000000;stroke-miterlimit:10" /><path
     class="st0"
     d="m 76.511152,55.6 c 0,0 6.1,1.1 6,-2.5 0,0 0.6,-3.9 -6,-3.3 z"
     id="path6"
     inkscape:connector-curvature="0"
     style="stroke:#000000;stroke-miterlimit:10" /><path
     class="st0"
     d="M 1.1111524,66.3 21.211152,46.4 c 0.2,-0.2 0.3,-0.4 0.4,-0.7 0.1,-1.1 0.6,-4.1 1.1,-5.3 0.1,-0.2 0.1,-0.4 0.1,-0.6 l -0.6,-10.6 c -0.1,-1 0.1,-1.4 0.3,-1.7 l 17.9,-22.8 c 0.1,-0.1 0.1,-0.1 0.1,-0.2 0.2,-0.5 1.3,-2.5 2.6,-2.4 0,0 0.5,-0.2 1.4,0.1 0.5,0.2 0.4,0.8 0.4,1.3 l -0.1,8.5 c 0,0.1 -1.4,5.1 -4.6,7 -0.2,0.1 -0.3,0.2 -0.4,0.4 -0.4,0.6 -1.3,2 -1.7,2.6 -0.1,0.2 -0.2,0.4 -0.2,0.7 v 1 c 0,0.8 0.8,1.4 1.6,1.2 l 4.7,-1.9 c 0.8,-0.3 0.1,1.1 0.3,2 0,0 0.3,35.9 0.3,35.9 0,0.5 1.6,3.9 5,3.5 0,0 0.6,1.9 -0.5,2.5 -2.4,1.3 -6.3,3 -12.5,4.7 -0.1,0 -0.2,0 -0.3,0 L 1.7111524,72 c -0.7,0 -1.30000003,-0.6 -1.20000003,-1.3 l 0.2,-3.6 c 0,-0.3 0.1,-0.5 0.40000003,-0.8 z"
     id="path8"
     inkscape:connector-curvature="0"
     style="stroke:#000000;stroke-miterlimit:10" /><path
     class="st1"
     d="m 70.911152,64.3 h -20.6 c -2.9,0 -5.2,-2.3 -5.2,-5.2 V 5.7 c 0,-2.9 2.3,-5.2 5.2,-5.2 h 20.6 c 2.9,0 5.2,2.3 5.2,5.2 v 53.4 c 0,2.8 -2.3,5.2 -5.2,5.2 z"
     id="path10"
     inkscape:connector-curvature="0"
     style="fill:none;stroke:#000000;stroke-miterlimit:10" /><rect
     x="47.411152"
     y="9.3000002"
     class="st1"
     width="26.6"
     height="46.5"
     id="rect12"
     style="fill:none;stroke:#000000;stroke-miterlimit:10" /><circle
     class="st1"
     cx="60.81115"
     cy="60.100002"
     r="3"
     id="circle14"
     style="fill:none;stroke:#000000;stroke-miterlimit:10" /><path
     class="st0"
     d="m 76.611152,26.1 c 0,0 6.9,1.9 6.1,6.9 -0.8,4.9 -3.3,5.8 -3.3,5.8 0,0 -4,0.3 -4.4,-4.2 0,0 0.1,-1.8 1,-2.2 z"
     id="path16"
     inkscape:connector-curvature="0"
     style="stroke:#000000;stroke-miterlimit:10" /><path
     class="st0"
     d="m 76.611152,38.4 c 0,0 7.4,1 5.4,8.8 0,0 -0.1,2.8 -3.6,2.3 0,0 -3.3,-0.8 -3.3,-3 0,0 -0.3,-2.4 1,-4.1 z"
     id="path18"
     inkscape:connector-curvature="0"
     style="stroke:#000000;stroke-miterlimit:10" /></svg>