<?xml version="1.0" encoding="UTF-8" standalone="no"?>
<!-- Created with Inkscape (http://www.inkscape.org/) -->

<svg
   xmlns:dc="http://purl.org/dc/elements/1.1/"
   xmlns:cc="http://creativecommons.org/ns#"
   xmlns:rdf="http://www.w3.org/1999/02/22-rdf-syntax-ns#"
   xmlns:svg="http://www.w3.org/2000/svg"
   xmlns="http://www.w3.org/2000/svg"
   xmlns:sodipodi="http://sodipodi.sourceforge.net/DTD/sodipodi-0.dtd"
   xmlns:inkscape="http://www.inkscape.org/namespaces/inkscape"
   width="24.26045mm"
   height="24.260445mm"
   viewBox="0 0 24.26045 24.260445"
   version="1.1"
   id="svg4213"
   inkscape:version="0.92.2 5c3e80d, 2017-08-06"
   sodipodi:docname="discard.svg">
  <defs
     id="defs4207" />
  <sodipodi:namedview
     id="base"
     pagecolor="#ffffff"
     bordercolor="#666666"
     borderopacity="1.0"
     inkscape:pageopacity="0.0"
     inkscape:pageshadow="2"
     inkscape:zoom="0.35"
     inkscape:cx="240.13223"
     inkscape:cy="-145.58206"
     inkscape:document-units="mm"
     inkscape:current-layer="layer1"
     showgrid="false"
     fit-margin-top="0"
     fit-margin-left="0"
     fit-margin-right="0"
     fit-margin-bottom="0"
     inkscape:window-width="1396"
     inkscape:window-height="855"
     inkscape:window-x="0"
     inkscape:window-y="1"
     inkscape:window-maximized="1" />
  <metadata
     id="metadata4210">
    <rdf:RDF>
      <cc:Work
         rdf:about="">
        <dc:format>image/svg+xml</dc:format>
        <dc:type
           rdf:resource="http://purl.org/dc/dcmitype/StillImage" />
        <dc:title></dc:title>
      </cc:Work>
    </rdf:RDF>
  </metadata>
  <g
     inkscape:label="Layer 1"
     inkscape:groupmode="layer"
     id="layer1"
     transform="translate(-42.298347,-86.054302)">
    <g
       transform="matrix(-0.17932396,-0.16302198,-0.16302198,0.17932396,226.49275,-73.295628)"
       id="g4-7-5">
      <path
         inkscape:connector-curvature="0"
         d="m 50,968.36215 c -3.3136,0 -6,2.6863 -6,6 v 22 H 22 c -3.3137,0 -6,2.68616 -6,5.99995 0,3.3136 2.6863,6 6,6 h 22 v 22.0001 c 0,3.3137 2.6864,6 6,6 3.3138,0 6,-2.6863 6,-6 v -22.0001 h 22 c 3.3137,0 6,-2.6864 6,-6 0,-3.31379 -2.6863,-5.99995 -6,-5.99995 H 56 v -22 c 0,-3.3137 -2.6862,-6 -6,-6 z"
         style="color:#000000;text-indent:0;text-transform:none;direction:ltr;baseline-shift:baseline;display:inline;overflow:visible;visibility:visible;fill:#000000;fill-opacity:1;stroke:none;enable-background:accumulate"
         marker="none"
         visibility="visible"
         display="inline"
         overflow="visible"
         id="path2-7-9-8" />
    </g>
    <path
       style="color:#000000;text-indent:0;text-decoration:none;text-decoration-line:none;text-transform:none;direction:ltr;baseline-shift:baseline;display:inline;overflow:visible;visibility:visible;fill:#000000;fill-opacity:1;stroke:none;stroke-width:0.93331003;enable-background:accumulate"
       d="m 46.266983,107.16225 c 4.954158,4.50379 12.635474,4.13802 17.139284,-0.81617 4.503854,-4.95413 4.138034,-12.635453 -0.816144,-17.139257 -4.954186,-4.503811 -12.635482,-4.13806 -17.13926,0.816145 -4.503811,4.954185 -4.138039,12.635502 0.81612,17.139282 z m 0.627831,-0.69061 c -4.580965,-4.16452 -4.917903,-11.23988 -0.753365,-15.820866 4.164511,-4.581012 11.239882,-4.917903 15.820868,-0.753366 4.580986,4.164539 4.91793,11.239902 0.753365,15.820872 -4.164538,4.58098 -11.23991,4.91787 -15.820868,0.75336 z"
       display="inline"
       overflow="visible"
       visibility="visible"
       marker="none"
       id="path2-52-1"
       inkscape:connector-curvature="0"
       sodipodi:nodetypes="scscsscscs" />
  </g>
</svg>
