<?xml version="1.0" encoding="UTF-8" standalone="no"?>
<!-- Created with Inkscape (http://www.inkscape.org/) -->

<svg
   xmlns:dc="http://purl.org/dc/elements/1.1/"
   xmlns:cc="http://creativecommons.org/ns#"
   xmlns:rdf="http://www.w3.org/1999/02/22-rdf-syntax-ns#"
   xmlns:svg="http://www.w3.org/2000/svg"
   xmlns="http://www.w3.org/2000/svg"
   xmlns:sodipodi="http://sodipodi.sourceforge.net/DTD/sodipodi-0.dtd"
   xmlns:inkscape="http://www.inkscape.org/namespaces/inkscape"
   width="24.26045mm"
   height="24.260447mm"
   viewBox="0 0 24.26045 24.260447"
   version="1.1"
   id="svg4363"
   inkscape:version="0.92.2 5c3e80d, 2017-08-06"
   sodipodi:docname="discard_and_flip.svg">
  <defs
     id="defs4357" />
  <sodipodi:namedview
     id="base"
     pagecolor="#ffffff"
     bordercolor="#666666"
     borderopacity="1.0"
     inkscape:pageopacity="0.0"
     inkscape:pageshadow="2"
     inkscape:zoom="0.35"
     inkscape:cx="85.846521"
     inkscape:cy="-71.296349"
     inkscape:document-units="mm"
     inkscape:current-layer="layer1"
     showgrid="false"
     fit-margin-top="0"
     fit-margin-left="0"
     fit-margin-right="0"
     fit-margin-bottom="0"
     inkscape:window-width="1396"
     inkscape:window-height="855"
     inkscape:window-x="0"
     inkscape:window-y="1"
     inkscape:window-maximized="1" />
  <metadata
     id="metadata4360">
    <rdf:RDF>
      <cc:Work
         rdf:about="">
        <dc:format>image/svg+xml</dc:format>
        <dc:type
           rdf:resource="http://purl.org/dc/dcmitype/StillImage" />
        <dc:title></dc:title>
      </cc:Work>
    </rdf:RDF>
  </metadata>
  <g
     inkscape:label="Layer 1"
     inkscape:groupmode="layer"
     id="layer1"
     transform="translate(-83.119775,-105.70906)">
    <g
       transform="matrix(-0.10605006,-0.09640926,-0.09640926,0.10605006,192.94945,16.777878)"
       id="g4-7-5-1">
      <path
         inkscape:connector-curvature="0"
         d="m 50,968.36215 c -3.3136,0 -6,2.6863 -6,6 v 22 H 22 c -3.3137,0 -6,2.68616 -6,5.99995 0,3.3136 2.6863,6 6,6 h 22 v 22.0001 c 0,3.3137 2.6864,6 6,6 3.3138,0 6,-2.6863 6,-6 v -22.0001 h 22 c 3.3137,0 6,-2.6864 6,-6 0,-3.31379 -2.6863,-5.99995 -6,-5.99995 H 56 v -22 c 0,-3.3137 -2.6862,-6 -6,-6 z"
         style="color:#000000;text-indent:0;text-transform:none;direction:ltr;baseline-shift:baseline;display:inline;overflow:visible;visibility:visible;fill:#000000;fill-opacity:1;stroke:none;enable-background:accumulate"
         marker="none"
         visibility="visible"
         display="inline"
         overflow="visible"
         id="path2-7-9-8-3" />
    </g>
    <path
       style="color:#000000;text-indent:0;text-decoration:none;text-decoration-line:none;text-transform:none;direction:ltr;baseline-shift:baseline;display:inline;overflow:visible;visibility:visible;fill:#000000;fill-opacity:1;stroke:none;stroke-width:0.93331003;enable-background:accumulate"
       d="m 87.088411,126.81702 c 4.954158,4.50378 12.635475,4.13801 17.139289,-0.81618 4.50385,-4.95413 4.13803,-12.63545 -0.81615,-17.13925 -4.954184,-4.50382 -12.635481,-4.13807 -17.139259,0.81614 -4.503811,4.95418 -4.138039,12.6355 0.81612,17.13929 z m 0.627831,-0.69062 c -4.580965,-4.16452 -4.917903,-11.23988 -0.753365,-15.82086 4.164511,-4.58102 11.239883,-4.91791 15.820873,-0.75337 4.58098,4.16454 4.91793,11.23991 0.75336,15.82087 -4.164537,4.58098 -11.239909,4.91787 -15.820868,0.75336 z"
       display="inline"
       overflow="visible"
       visibility="visible"
       marker="none"
       id="path2-52-1-8"
       inkscape:connector-curvature="0"
       sodipodi:nodetypes="scscsscscs" />
    <path
       inkscape:connector-curvature="0"
       d="m 104.80808,117.08015 -4.15905,-2.8357 c -0.0572,-0.0393 -0.13275,-0.0435 -0.19471,-0.0114 -0.062,0.0326 -0.10061,0.0967 -0.10061,0.16712 v 1.70521 c -2.903378,0.12018 -4.498566,2.99829 -4.537133,5.08802 0,0.001 0,0.001 0,0.003 0,0.001 0,0.003 0,0.004 0,0.002 0,0.003 0,0.003 0,0.0114 0.001,0.0223 0.0031,0.0326 0.01431,0.0882 0.09003,0.15313 0.182611,0.15502 0.0016,0 0.0031,0 0.0041,0 0.102033,0 0.185649,-0.0855 0.18906,-0.18716 0.01698,-0.49191 2.041712,-2.70037 4.159032,-2.8274 v 1.69575 c 0,0.0703 0.039,0.13418 0.10103,0.16712 0.062,0.0333 0.13718,0.0287 0.19472,-0.0114 l 4.15903,-2.83573 c 0.0515,-0.0347 0.0825,-0.0933 0.0825,-0.15577 0,-0.0624 -0.031,-0.12104 -0.0827,-0.15615 z"
       id="path2-79-9-7-5-4"
       style="stroke-width:0.37809461" />
  </g>
</svg>
