<?xml version="1.0" encoding="UTF-8" standalone="no"?>
<svg
   xmlns:dc="http://purl.org/dc/elements/1.1/"
   xmlns:cc="http://creativecommons.org/ns#"
   xmlns:rdf="http://www.w3.org/1999/02/22-rdf-syntax-ns#"
   xmlns:svg="http://www.w3.org/2000/svg"
   xmlns="http://www.w3.org/2000/svg"
   xmlns:sodipodi="http://sodipodi.sourceforge.net/DTD/sodipodi-0.dtd"
   xmlns:inkscape="http://www.inkscape.org/namespaces/inkscape"
   version="1.1"
   x="0px"
   y="0px"
   viewBox="0 0 68.529861 54.792189"
   enable-background="new 0 0 100 82.502"
   xml:space="preserve"
   id="svg22"
   sodipodi:docname="noun_3573_cc.svg"
   width="68.529861"
   height="54.792191"
   inkscape:version="0.92.2 5c3e80d, 2017-08-06"><metadata
     id="metadata28"><rdf:RDF><cc:Work
         rdf:about=""><dc:format>image/svg+xml</dc:format><dc:type
           rdf:resource="http://purl.org/dc/dcmitype/StillImage" /><dc:title></dc:title></cc:Work></rdf:RDF></metadata><defs
     id="defs26" /><sodipodi:namedview
     pagecolor="#ffffff"
     bordercolor="#666666"
     borderopacity="1"
     objecttolerance="10"
     gridtolerance="10"
     guidetolerance="10"
     inkscape:pageopacity="0"
     inkscape:pageshadow="2"
     inkscape:window-width="640"
     inkscape:window-height="480"
     id="namedview24"
     showgrid="false"
     fit-margin-top="0"
     fit-margin-left="0"
     fit-margin-right="0"
     fit-margin-bottom="0"
     inkscape:zoom="2.2884293"
     inkscape:cx="50"
     inkscape:cy="30.938557"
     inkscape:window-x="0"
     inkscape:window-y="0"
     inkscape:window-maximized="0"
     inkscape:current-layer="svg22" /><path
     d="m 31.029,31.746882 c 0.508,1.096 1.143,1.821 1.989,2.261 l 0.907,-0.271 0.446,-2.994 -3.346,0.998 c 0.002,0 0.002,0.004 0.004,0.006 z"
     id="path2"
     inkscape:connector-curvature="0"
     style="fill:#010101" /><path
     d="m 31.08,24.796882 4.374,-1.303 0.313,-2.103 c -0.35,0.058 -0.693,0.112 -1.051,0.173 -1.621,0.275 -3.093,2.193 -3.636,3.233 z"
     id="path6"
     inkscape:connector-curvature="0"
     style="fill:#010101" /><path
     d="m 48.011,33.328882 c -1.069,0.019 -3.509,0.795 -5.871,1.55 -2.586,0.825 -4.654,1.447 -6.234,1.731 -1.006,0.179 -1.816,0.223 -2.423,0.09 -0.009,-0.002 -0.021,-0.002 -0.031,-0.005 -2.089,-0.505 -3.587,-1.792 -4.585,-3.943 -1.36,-2.925 -1.413,-5.278 -0.17,-8.477 0.09,-0.238 0.245,-0.534 0.425,-0.85 0.2,-0.353 0.446,-0.733 0.747,-1.13 1.021,-1.345 2.575,-2.763 4.447,-3.081 0.619,-0.104 1.222,-0.203 1.818,-0.297 l 1.092,-7.324 c -3.544,0.335 -6.932,0.688 -8.85,0.987 -4.831,0.753 -8.012,6.977 -10.813,10.784 -2.17,2.954 -4.222,5.74 -6.242,7.816 -5.294,5.441 -9.743,7.491 -11.321,8.096 l 6.706,15.283 0.135,0.012 c 2.757,0.242 9.69,0.629 14.558,-1.008 2.281,-0.769 4.532,-2.106 7.138,-3.657 2.128,-1.268 4.538,-2.705 7.414,-4.094 0.057,-0.026 0.112,-0.053 0.168,-0.079 1.299,-0.627 2.596,-1.239 3.867,-1.827 5.733,-2.657 10.877,-4.827 12.982,-5.699 -0.914,-2.496 -2.565,-4.922 -4.957,-4.878 z"
     id="path8"
     inkscape:connector-curvature="0"
     style="fill:#010101" /><path
     d="M 67.144,3.6188822 43.009,0.01788224 c -0.889,-0.132 -1.715,0.481 -1.848,1.36899996 L 36.28,34.098882 c 1.64,-0.377 3.693,-1.03 5.136,-1.491 3.187,-1.019 5.219,-1.641 6.557,-1.663 0.318,-0.006 0.64,0.016 0.954,0.063 2.689,0.4 4.92,2.667 6.278,6.378 l 0.783,2.146 -2.108,0.875 c -1.382,0.574 -5.089,2.131 -9.564,4.145 l 16.356,2.441 c 0.889,0.132 1.716,-0.479 1.85,-1.367 l 5.99,-40.1589998 c 0.132,-0.888 -0.482,-1.717 -1.368,-1.848 z"
     id="path16"
     inkscape:connector-curvature="0"
     style="fill:#010101" /></svg>