-- Merging decision tree log ---
manifest
ADDED from /var/REACTNATIVE_PROJECTS/NewGitMt/MT_Spa_Masseuse/massagedtodayaspamasseuse/android/app/src/main/AndroidManifest.xml:1:1-29:12
INJECTED from /var/REACTNATIVE_PROJECTS/NewGitMt/MT_Spa_Masseuse/massagedtodayaspamasseuse/android/app/src/main/AndroidManifest.xml:1:1-29:12
INJECTED from /var/REACTNATIVE_PROJECTS/NewGitMt/MT_Spa_Masseuse/massagedtodayaspamasseuse/android/app/src/main/AndroidManifest.xml:1:1-29:12
INJECTED from /var/REACTNATIVE_PROJECTS/NewGitMt/MT_Spa_Masseuse/massagedtodayaspamasseuse/android/app/src/main/AndroidManifest.xml:1:1-29:12
MERGED from /var/REACTNATIVE_PROJECTS/NewGitMt/MT_Spa_Masseuse/massagedtodayaspamasseuse/android/app/src/main/AndroidManifest.xml:1:1-29:12
MERGED from [:react-native-vector-icons] /var/REACTNATIVE_PROJECTS/NewGitMt/MT_Spa_Masseuse/massagedtodayaspamasseuse/node_modules/react-native-vector-icons/android/build/intermediates/library_manifest/debug/AndroidManifest.xml:2:1-11:12
MERGED from [:@delightfulstudio_react-native-wheel-picker-android] /var/REACTNATIVE_PROJECTS/NewGitMt/MT_Spa_Masseuse/massagedtodayaspamasseuse/node_modules/@delightfulstudio/react-native-wheel-picker-android/android/build/intermediates/library_manifest/debug/AndroidManifest.xml:2:1-11:12
MERGED from [:@react-native-community_async-storage] /var/REACTNATIVE_PROJECTS/NewGitMt/MT_Spa_Masseuse/massagedtodayaspamasseuse/node_modules/@react-native-community/async-storage/android/build/intermediates/library_manifest/debug/AndroidManifest.xml:2:1-9:12
MERGED from [:react-native-geolocation-service] /var/REACTNATIVE_PROJECTS/NewGitMt/MT_Spa_Masseuse/massagedtodayaspamasseuse/node_modules/react-native-geolocation-service/android/build/intermediates/library_manifest/debug/AndroidManifest.xml:2:1-14:12
MERGED from [:react-native-gesture-handler] /var/REACTNATIVE_PROJECTS/NewGitMt/MT_Spa_Masseuse/massagedtodayaspamasseuse/node_modules/react-native-gesture-handler/android/build/intermediates/library_manifest/debug/AndroidManifest.xml:2:1-11:12
MERGED from [:react-native-image-crop-picker] /var/REACTNATIVE_PROJECTS/NewGitMt/MT_Spa_Masseuse/massagedtodayaspamasseuse/node_modules/react-native-image-crop-picker/android/build/intermediates/library_manifest/debug/AndroidManifest.xml:2:1-28:12
MERGED from [:react-native-image-picker] /var/REACTNATIVE_PROJECTS/NewGitMt/MT_Spa_Masseuse/massagedtodayaspamasseuse/node_modules/react-native-image-picker/android/build/intermediates/library_manifest/debug/AndroidManifest.xml:2:1-21:12
MERGED from [:react-native-splash-screen] /var/REACTNATIVE_PROJECTS/NewGitMt/MT_Spa_Masseuse/massagedtodayaspamasseuse/node_modules/react-native-splash-screen/android/build/intermediates/library_manifest/debug/AndroidManifest.xml:2:1-14:12
MERGED from [:react-native-webview] /var/REACTNATIVE_PROJECTS/NewGitMt/MT_Spa_Masseuse/massagedtodayaspamasseuse/node_modules/react-native-webview/android/build/intermediates/library_manifest/debug/AndroidManifest.xml:2:1-23:12
MERGED from [com.facebook.react:react-native:0.61.2] /home/natit/.gradle/caches/transforms-2/files-2.1/34bd01ab9a71b8cc36164998a584cdb5/AndroidManifest.xml:2:1-13:12
MERGED from [org.webkit:android-jsc:r245459] /home/natit/.gradle/caches/transforms-2/files-2.1/ce6eb6733a92d0bccb779af83aede304/AndroidManifest.xml:2:1-11:12
MERGED from [com.github.yalantis:ucrop:2.2.2-native] /home/natit/.gradle/caches/transforms-2/files-2.1/2515b5ea445f6eb23f3e0cda8b6e066a/AndroidManifest.xml:2:1-11:12
MERGED from [androidx.appcompat:appcompat:1.0.2] /home/natit/.gradle/caches/transforms-2/files-2.1/b51f9a4654927f325f2ef262d01beb49/AndroidManifest.xml:17:1-22:12
MERGED from [com.facebook.fresco:fresco:2.0.0] /home/natit/.gradle/caches/transforms-2/files-2.1/bdf7cd0f442874928f2d77b4ece5aecf/AndroidManifest.xml:2:1-9:12
MERGED from [com.facebook.fresco:imagepipeline-okhttp3:2.0.0] /home/natit/.gradle/caches/transforms-2/files-2.1/a1d505133fc88cc24255098d564032b0/AndroidManifest.xml:2:1-9:12
MERGED from [com.facebook.fresco:drawee:2.0.0] /home/natit/.gradle/caches/transforms-2/files-2.1/c771f3ee61b7216a00b9314b76438071/AndroidManifest.xml:2:1-9:12
MERGED from [com.facebook.fresco:nativeimagefilters:2.0.0] /home/natit/.gradle/caches/transforms-2/files-2.1/79f548bfcd010422d0ba6c8fa3c0b271/AndroidManifest.xml:2:1-9:12
MERGED from [com.facebook.fresco:imagepipeline:2.0.0] /home/natit/.gradle/caches/transforms-2/files-2.1/945ee9cbed2f4b5593f3024487e3db95/AndroidManifest.xml:2:1-9:12
MERGED from [com.facebook.fresco:nativeimagetranscoder:2.0.0] /home/natit/.gradle/caches/transforms-2/files-2.1/89c1ae8e1bfd1e1a85f1c8c53c155ce0/AndroidManifest.xml:2:1-9:12
MERGED from [com.facebook.fresco:imagepipeline-base:2.0.0] /home/natit/.gradle/caches/transforms-2/files-2.1/7211062f2cd7fd71a3976765888f9b37/AndroidManifest.xml:2:1-9:12
MERGED from [com.facebook.soloader:soloader:0.6.0] /home/natit/.gradle/caches/transforms-2/files-2.1/46c4048e692669c5c7c59dbbd4c718b3/AndroidManifest.xml:2:1-13:12
MERGED from [cn.aigestudio.wheelpicker:WheelPicker:1.1.2] /home/natit/.gradle/caches/transforms-2/files-2.1/7a73ce7b1412959dbb8c50eca2d6b70e/AndroidManifest.xml:2:1-12:12
MERGED from [com.google.android.gms:play-services-location:16.0.0] /home/natit/.gradle/caches/transforms-2/files-2.1/3d6b64608ec72b8467e2803460d7c94f/AndroidManifest.xml:2:1-9:12
MERGED from [com.google.android.gms:play-services-base:16.0.1] /home/natit/.gradle/caches/transforms-2/files-2.1/195925090d6f93eb2f17e925a19c7179/AndroidManifest.xml:17:1-29:12
MERGED from [com.google.android.gms:play-services-places-placereport:16.0.0] /home/natit/.gradle/caches/transforms-2/files-2.1/484e695fd6a7789d6f9425ea1bd7cac7/AndroidManifest.xml:17:1-24:12
MERGED from [com.google.android.gms:play-services-tasks:16.0.1] /home/natit/.gradle/caches/transforms-2/files-2.1/49f239ec616f235e1dbad457c93ff931/AndroidManifest.xml:2:1-9:12
MERGED from [com.google.android.gms:play-services-basement:16.0.1] /home/natit/.gradle/caches/transforms-2/files-2.1/b830f2f38b6e2d17f737d37c53c0969e/AndroidManifest.xml:17:1-28:12
MERGED from [androidx.legacy:legacy-support-v4:1.0.0] /home/natit/.gradle/caches/transforms-2/files-2.1/e5f45239c9a864b3ec12c064e6a1bfb7/AndroidManifest.xml:17:1-22:12
MERGED from [androidx.fragment:fragment:1.0.0] /home/natit/.gradle/caches/transforms-2/files-2.1/3e01c859fc06b47819ef1dc3af40f2b5/AndroidManifest.xml:17:1-22:12
MERGED from [androidx.vectordrawable:vectordrawable-animated:1.0.0] /home/natit/.gradle/caches/transforms-2/files-2.1/fc6953d0ca3241b2ac1b1575f09641a4/AndroidManifest.xml:17:1-22:12
MERGED from [androidx.legacy:legacy-support-core-ui:1.0.0] /home/natit/.gradle/caches/transforms-2/files-2.1/850f445a801bf0d5d96462e7b4d5aa54/AndroidManifest.xml:17:1-22:12
MERGED from [androidx.legacy:legacy-support-core-utils:1.0.0] /home/natit/.gradle/caches/transforms-2/files-2.1/2da00a16da0557467175e81fdca4b408/AndroidManifest.xml:17:1-22:12
MERGED from [androidx.vectordrawable:vectordrawable:1.0.1] /home/natit/.gradle/caches/transforms-2/files-2.1/4f391a9220d6eeabeae72ffe2b6b0594/AndroidManifest.xml:17:1-22:12
MERGED from [androidx.loader:loader:1.0.0] /home/natit/.gradle/caches/transforms-2/files-2.1/6e817d06a6b3ba733859c714032d2a9d/AndroidManifest.xml:17:1-22:12
MERGED from [androidx.viewpager:viewpager:1.0.0] /home/natit/.gradle/caches/transforms-2/files-2.1/52a731fa00c0e0f8b0e9e9b7c8adee06/AndroidManifest.xml:17:1-22:12
MERGED from [androidx.coordinatorlayout:coordinatorlayout:1.0.0] /home/natit/.gradle/caches/transforms-2/files-2.1/a83d8a0d7b4fd026621c5756a4c0c0a4/AndroidManifest.xml:17:1-22:12
MERGED from [androidx.drawerlayout:drawerlayout:1.0.0] /home/natit/.gradle/caches/transforms-2/files-2.1/4e22c45acfac3538f27d12f86a9560c8/AndroidManifest.xml:17:1-22:12
MERGED from [androidx.slidingpanelayout:slidingpanelayout:1.0.0] /home/natit/.gradle/caches/transforms-2/files-2.1/22cebf1941db95fa9f05209d311905df/AndroidManifest.xml:17:1-22:12
MERGED from [androidx.customview:customview:1.0.0] /home/natit/.gradle/caches/transforms-2/files-2.1/25d51578a38f7e4367b3daea49b14ee2/AndroidManifest.xml:17:1-22:12
MERGED from [androidx.swiperefreshlayout:swiperefreshlayout:1.0.0] /home/natit/.gradle/caches/transforms-2/files-2.1/89e5e89be699f55ea423de9980e46a15/AndroidManifest.xml:17:1-22:12
MERGED from [androidx.asynclayoutinflater:asynclayoutinflater:1.0.0] /home/natit/.gradle/caches/transforms-2/files-2.1/6b8823c7cd7349ad931cc5e5922118ef/AndroidManifest.xml:17:1-22:12
MERGED from [androidx.media:media:1.0.0] /home/natit/.gradle/caches/transforms-2/files-2.1/028bd18508ffc0a2e2578d66fb0eb09d/AndroidManifest.xml:17:1-22:12
MERGED from [androidx.core:core:1.0.1] /home/natit/.gradle/caches/transforms-2/files-2.1/2dd1a5d57fe2b7203b94a11b8e844293/AndroidManifest.xml:17:1-24:12
MERGED from [androidx.versionedparcelable:versionedparcelable:1.0.0] /home/natit/.gradle/caches/transforms-2/files-2.1/fbb08af1b97e208085730b3bfcec35d8/AndroidManifest.xml:17:1-25:12
MERGED from [androidx.cursoradapter:cursoradapter:1.0.0] /home/natit/.gradle/caches/transforms-2/files-2.1/44e28abc4b5f895414707f766ed3e00d/AndroidManifest.xml:17:1-22:12
MERGED from [androidx.lifecycle:lifecycle-runtime:2.0.0] /home/natit/.gradle/caches/transforms-2/files-2.1/8898360fbd311ab741a2ac9a9f0ff368/AndroidManifest.xml:17:1-22:12
MERGED from [androidx.documentfile:documentfile:1.0.0] /home/natit/.gradle/caches/transforms-2/files-2.1/2680560e94d07f9f7ce1a8c6af4370be/AndroidManifest.xml:17:1-22:12
MERGED from [androidx.localbroadcastmanager:localbroadcastmanager:1.0.0] /home/natit/.gradle/caches/transforms-2/files-2.1/9f5082b56460d029313fe60d5c9b6416/AndroidManifest.xml:17:1-22:12
MERGED from [androidx.print:print:1.0.0] /home/natit/.gradle/caches/transforms-2/files-2.1/eaf6446969ec63702555aa3cc5121fd1/AndroidManifest.xml:17:1-22:12
MERGED from [androidx.lifecycle:lifecycle-viewmodel:2.0.0] /home/natit/.gradle/caches/transforms-2/files-2.1/6c5d2a0ba40b29c5bced7a8962bd74f6/AndroidManifest.xml:17:1-22:12
MERGED from [androidx.lifecycle:lifecycle-livedata:2.0.0] /home/natit/.gradle/caches/transforms-2/files-2.1/ec76986c2b4cccb4a23d4c7d09ed8105/AndroidManifest.xml:17:1-22:12
MERGED from [androidx.lifecycle:lifecycle-livedata-core:2.0.0] /home/natit/.gradle/caches/transforms-2/files-2.1/4a4c226fb926dad569739561d6f0cfd1/AndroidManifest.xml:17:1-22:12
MERGED from [androidx.arch.core:core-runtime:2.0.0] /home/natit/.gradle/caches/transforms-2/files-2.1/e1ba7620851acfcd54617c4a9713fe2a/AndroidManifest.xml:17:1-22:12
MERGED from [androidx.interpolator:interpolator:1.0.0] /home/natit/.gradle/caches/transforms-2/files-2.1/800de3691d37f0c0acf843f01722def6/AndroidManifest.xml:17:1-22:12
MERGED from [com.facebook.fresco:fbcore:2.0.0] /home/natit/.gradle/caches/transforms-2/files-2.1/3aacdf0d3e8c8089bd61d4e10ba9aa99/AndroidManifest.xml:2:1-9:12
INJECTED from /var/REACTNATIVE_PROJECTS/NewGitMt/MT_Spa_Masseuse/massagedtodayaspamasseuse/android/app/src/debug/AndroidManifest.xml:2:1-8:12
INJECTED from /var/REACTNATIVE_PROJECTS/NewGitMt/MT_Spa_Masseuse/massagedtodayaspamasseuse/android/app/src/debug/AndroidManifest.xml:2:1-8:12
INJECTED from /var/REACTNATIVE_PROJECTS/NewGitMt/MT_Spa_Masseuse/massagedtodayaspamasseuse/android/app/src/debug/AndroidManifest.xml:2:1-8:12
	package
		ADDED from /var/REACTNATIVE_PROJECTS/NewGitMt/MT_Spa_Masseuse/massagedtodayaspamasseuse/android/app/src/main/AndroidManifest.xml:2:3-38
		INJECTED from /var/REACTNATIVE_PROJECTS/NewGitMt/MT_Spa_Masseuse/massagedtodayaspamasseuse/android/app/src/main/AndroidManifest.xml
		ADDED from /var/REACTNATIVE_PROJECTS/NewGitMt/MT_Spa_Masseuse/massagedtodayaspamasseuse/android/app/src/main/AndroidManifest.xml:2:3-38
		INJECTED from /var/REACTNATIVE_PROJECTS/NewGitMt/MT_Spa_Masseuse/massagedtodayaspamasseuse/android/app/src/debug/AndroidManifest.xml
	android:versionName
		INJECTED from /var/REACTNATIVE_PROJECTS/NewGitMt/MT_Spa_Masseuse/massagedtodayaspamasseuse/android/app/src/main/AndroidManifest.xml
		ADDED from /var/REACTNATIVE_PROJECTS/NewGitMt/MT_Spa_Masseuse/massagedtodayaspamasseuse/android/app/src/main/AndroidManifest.xml:1:1-29:12
		INJECTED from /var/REACTNATIVE_PROJECTS/NewGitMt/MT_Spa_Masseuse/massagedtodayaspamasseuse/android/app/src/debug/AndroidManifest.xml
	xmlns:tools
		ADDED from /var/REACTNATIVE_PROJECTS/NewGitMt/MT_Spa_Masseuse/massagedtodayaspamasseuse/android/app/src/debug/AndroidManifest.xml:3:5-51
	android:versionCode
		INJECTED from /var/REACTNATIVE_PROJECTS/NewGitMt/MT_Spa_Masseuse/massagedtodayaspamasseuse/android/app/src/main/AndroidManifest.xml
		ADDED from /var/REACTNATIVE_PROJECTS/NewGitMt/MT_Spa_Masseuse/massagedtodayaspamasseuse/android/app/src/main/AndroidManifest.xml:1:1-29:12
		INJECTED from /var/REACTNATIVE_PROJECTS/NewGitMt/MT_Spa_Masseuse/massagedtodayaspamasseuse/android/app/src/debug/AndroidManifest.xml
	xmlns:android
		ADDED from /var/REACTNATIVE_PROJECTS/NewGitMt/MT_Spa_Masseuse/massagedtodayaspamasseuse/android/app/src/main/AndroidManifest.xml:1:11-69
uses-permission#android.permission.INTERNET
ADDED from /var/REACTNATIVE_PROJECTS/NewGitMt/MT_Spa_Masseuse/massagedtodayaspamasseuse/android/app/src/main/AndroidManifest.xml:4:5-67
MERGED from [:react-native-geolocation-service] /var/REACTNATIVE_PROJECTS/NewGitMt/MT_Spa_Masseuse/massagedtodayaspamasseuse/node_modules/react-native-geolocation-service/android/build/intermediates/library_manifest/debug/AndroidManifest.xml:9:5-67
MERGED from [:react-native-geolocation-service] /var/REACTNATIVE_PROJECTS/NewGitMt/MT_Spa_Masseuse/massagedtodayaspamasseuse/node_modules/react-native-geolocation-service/android/build/intermediates/library_manifest/debug/AndroidManifest.xml:9:5-67
	android:name
		ADDED from /var/REACTNATIVE_PROJECTS/NewGitMt/MT_Spa_Masseuse/massagedtodayaspamasseuse/android/app/src/main/AndroidManifest.xml:4:22-64
uses-permission#android.permission.CAMERA
ADDED from /var/REACTNATIVE_PROJECTS/NewGitMt/MT_Spa_Masseuse/massagedtodayaspamasseuse/android/app/src/main/AndroidManifest.xml:5:5-65
	android:name
		ADDED from /var/REACTNATIVE_PROJECTS/NewGitMt/MT_Spa_Masseuse/massagedtodayaspamasseuse/android/app/src/main/AndroidManifest.xml:5:22-62
uses-permission#android.permission.READ_EXTERNAL_STORAGE
ADDED from /var/REACTNATIVE_PROJECTS/NewGitMt/MT_Spa_Masseuse/massagedtodayaspamasseuse/android/app/src/main/AndroidManifest.xml:6:5-80
	android:name
		ADDED from /var/REACTNATIVE_PROJECTS/NewGitMt/MT_Spa_Masseuse/massagedtodayaspamasseuse/android/app/src/main/AndroidManifest.xml:6:22-77
uses-permission#android.permission.WRITE_EXTERNAL_STORAGE
ADDED from /var/REACTNATIVE_PROJECTS/NewGitMt/MT_Spa_Masseuse/massagedtodayaspamasseuse/android/app/src/main/AndroidManifest.xml:7:5-81
MERGED from [:react-native-image-crop-picker] /var/REACTNATIVE_PROJECTS/NewGitMt/MT_Spa_Masseuse/massagedtodayaspamasseuse/node_modules/react-native-image-crop-picker/android/build/intermediates/library_manifest/debug/AndroidManifest.xml:10:5-81
MERGED from [:react-native-image-crop-picker] /var/REACTNATIVE_PROJECTS/NewGitMt/MT_Spa_Masseuse/massagedtodayaspamasseuse/node_modules/react-native-image-crop-picker/android/build/intermediates/library_manifest/debug/AndroidManifest.xml:10:5-81
	android:name
		ADDED from /var/REACTNATIVE_PROJECTS/NewGitMt/MT_Spa_Masseuse/massagedtodayaspamasseuse/android/app/src/main/AndroidManifest.xml:7:22-78
uses-permission#android.permission.ACCESS_FINE_LOCATION
ADDED from /var/REACTNATIVE_PROJECTS/NewGitMt/MT_Spa_Masseuse/massagedtodayaspamasseuse/android/app/src/main/AndroidManifest.xml:8:5-79
MERGED from [:react-native-geolocation-service] /var/REACTNATIVE_PROJECTS/NewGitMt/MT_Spa_Masseuse/massagedtodayaspamasseuse/node_modules/react-native-geolocation-service/android/build/intermediates/library_manifest/debug/AndroidManifest.xml:12:5-79
MERGED from [:react-native-geolocation-service] /var/REACTNATIVE_PROJECTS/NewGitMt/MT_Spa_Masseuse/massagedtodayaspamasseuse/node_modules/react-native-geolocation-service/android/build/intermediates/library_manifest/debug/AndroidManifest.xml:12:5-79
	android:name
		ADDED from /var/REACTNATIVE_PROJECTS/NewGitMt/MT_Spa_Masseuse/massagedtodayaspamasseuse/android/app/src/main/AndroidManifest.xml:8:22-76
application
ADDED from /var/REACTNATIVE_PROJECTS/NewGitMt/MT_Spa_Masseuse/massagedtodayaspamasseuse/android/app/src/main/AndroidManifest.xml:9:5-27:19
MERGED from /var/REACTNATIVE_PROJECTS/NewGitMt/MT_Spa_Masseuse/massagedtodayaspamasseuse/android/app/src/main/AndroidManifest.xml:9:5-27:19
MERGED from /var/REACTNATIVE_PROJECTS/NewGitMt/MT_Spa_Masseuse/massagedtodayaspamasseuse/android/app/src/main/AndroidManifest.xml:9:5-27:19
MERGED from [:react-native-image-crop-picker] /var/REACTNATIVE_PROJECTS/NewGitMt/MT_Spa_Masseuse/massagedtodayaspamasseuse/node_modules/react-native-image-crop-picker/android/build/intermediates/library_manifest/debug/AndroidManifest.xml:12:5-26:19
MERGED from [:react-native-image-crop-picker] /var/REACTNATIVE_PROJECTS/NewGitMt/MT_Spa_Masseuse/massagedtodayaspamasseuse/node_modules/react-native-image-crop-picker/android/build/intermediates/library_manifest/debug/AndroidManifest.xml:12:5-26:19
MERGED from [:react-native-image-picker] /var/REACTNATIVE_PROJECTS/NewGitMt/MT_Spa_Masseuse/massagedtodayaspamasseuse/node_modules/react-native-image-picker/android/build/intermediates/library_manifest/debug/AndroidManifest.xml:9:5-19:19
MERGED from [:react-native-image-picker] /var/REACTNATIVE_PROJECTS/NewGitMt/MT_Spa_Masseuse/massagedtodayaspamasseuse/node_modules/react-native-image-picker/android/build/intermediates/library_manifest/debug/AndroidManifest.xml:9:5-19:19
MERGED from [:react-native-splash-screen] /var/REACTNATIVE_PROJECTS/NewGitMt/MT_Spa_Masseuse/massagedtodayaspamasseuse/node_modules/react-native-splash-screen/android/build/intermediates/library_manifest/debug/AndroidManifest.xml:11:5-12:19
MERGED from [:react-native-splash-screen] /var/REACTNATIVE_PROJECTS/NewGitMt/MT_Spa_Masseuse/massagedtodayaspamasseuse/node_modules/react-native-splash-screen/android/build/intermediates/library_manifest/debug/AndroidManifest.xml:11:5-12:19
MERGED from [:react-native-webview] /var/REACTNATIVE_PROJECTS/NewGitMt/MT_Spa_Masseuse/massagedtodayaspamasseuse/node_modules/react-native-webview/android/build/intermediates/library_manifest/debug/AndroidManifest.xml:11:5-21:19
MERGED from [:react-native-webview] /var/REACTNATIVE_PROJECTS/NewGitMt/MT_Spa_Masseuse/massagedtodayaspamasseuse/node_modules/react-native-webview/android/build/intermediates/library_manifest/debug/AndroidManifest.xml:11:5-21:19
MERGED from [com.facebook.react:react-native:0.61.2] /home/natit/.gradle/caches/transforms-2/files-2.1/34bd01ab9a71b8cc36164998a584cdb5/AndroidManifest.xml:11:5-20
MERGED from [com.facebook.react:react-native:0.61.2] /home/natit/.gradle/caches/transforms-2/files-2.1/34bd01ab9a71b8cc36164998a584cdb5/AndroidManifest.xml:11:5-20
MERGED from [com.facebook.soloader:soloader:0.6.0] /home/natit/.gradle/caches/transforms-2/files-2.1/46c4048e692669c5c7c59dbbd4c718b3/AndroidManifest.xml:11:5-20
MERGED from [com.facebook.soloader:soloader:0.6.0] /home/natit/.gradle/caches/transforms-2/files-2.1/46c4048e692669c5c7c59dbbd4c718b3/AndroidManifest.xml:11:5-20
MERGED from [com.google.android.gms:play-services-location:16.0.0] /home/natit/.gradle/caches/transforms-2/files-2.1/3d6b64608ec72b8467e2803460d7c94f/AndroidManifest.xml:7:5-20
MERGED from [com.google.android.gms:play-services-location:16.0.0] /home/natit/.gradle/caches/transforms-2/files-2.1/3d6b64608ec72b8467e2803460d7c94f/AndroidManifest.xml:7:5-20
MERGED from [com.google.android.gms:play-services-base:16.0.1] /home/natit/.gradle/caches/transforms-2/files-2.1/195925090d6f93eb2f17e925a19c7179/AndroidManifest.xml:22:5-27:19
MERGED from [com.google.android.gms:play-services-base:16.0.1] /home/natit/.gradle/caches/transforms-2/files-2.1/195925090d6f93eb2f17e925a19c7179/AndroidManifest.xml:22:5-27:19
MERGED from [com.google.android.gms:play-services-places-placereport:16.0.0] /home/natit/.gradle/caches/transforms-2/files-2.1/484e695fd6a7789d6f9425ea1bd7cac7/AndroidManifest.xml:22:5-20
MERGED from [com.google.android.gms:play-services-places-placereport:16.0.0] /home/natit/.gradle/caches/transforms-2/files-2.1/484e695fd6a7789d6f9425ea1bd7cac7/AndroidManifest.xml:22:5-20
MERGED from [com.google.android.gms:play-services-tasks:16.0.1] /home/natit/.gradle/caches/transforms-2/files-2.1/49f239ec616f235e1dbad457c93ff931/AndroidManifest.xml:7:5-20
MERGED from [com.google.android.gms:play-services-tasks:16.0.1] /home/natit/.gradle/caches/transforms-2/files-2.1/49f239ec616f235e1dbad457c93ff931/AndroidManifest.xml:7:5-20
MERGED from [com.google.android.gms:play-services-basement:16.0.1] /home/natit/.gradle/caches/transforms-2/files-2.1/b830f2f38b6e2d17f737d37c53c0969e/AndroidManifest.xml:22:5-26:19
MERGED from [com.google.android.gms:play-services-basement:16.0.1] /home/natit/.gradle/caches/transforms-2/files-2.1/b830f2f38b6e2d17f737d37c53c0969e/AndroidManifest.xml:22:5-26:19
MERGED from [androidx.core:core:1.0.1] /home/natit/.gradle/caches/transforms-2/files-2.1/2dd1a5d57fe2b7203b94a11b8e844293/AndroidManifest.xml:22:5-89
MERGED from [androidx.core:core:1.0.1] /home/natit/.gradle/caches/transforms-2/files-2.1/2dd1a5d57fe2b7203b94a11b8e844293/AndroidManifest.xml:22:5-89
MERGED from [androidx.versionedparcelable:versionedparcelable:1.0.0] /home/natit/.gradle/caches/transforms-2/files-2.1/fbb08af1b97e208085730b3bfcec35d8/AndroidManifest.xml:22:5-23:19
MERGED from [androidx.versionedparcelable:versionedparcelable:1.0.0] /home/natit/.gradle/caches/transforms-2/files-2.1/fbb08af1b97e208085730b3bfcec35d8/AndroidManifest.xml:22:5-23:19
	android:appComponentFactory
		ADDED from [androidx.core:core:1.0.1] /home/natit/.gradle/caches/transforms-2/files-2.1/2dd1a5d57fe2b7203b94a11b8e844293/AndroidManifest.xml:22:18-86
	android:label
		ADDED from /var/REACTNATIVE_PROJECTS/NewGitMt/MT_Spa_Masseuse/massagedtodayaspamasseuse/android/app/src/main/AndroidManifest.xml:11:7-39
		ADDED from /var/REACTNATIVE_PROJECTS/NewGitMt/MT_Spa_Masseuse/massagedtodayaspamasseuse/android/app/src/main/AndroidManifest.xml:11:7-39
	tools:ignore
		ADDED from /var/REACTNATIVE_PROJECTS/NewGitMt/MT_Spa_Masseuse/massagedtodayaspamasseuse/android/app/src/debug/AndroidManifest.xml:7:75-114
	android:roundIcon
		ADDED from /var/REACTNATIVE_PROJECTS/NewGitMt/MT_Spa_Masseuse/massagedtodayaspamasseuse/android/app/src/main/AndroidManifest.xml:13:7-52
		ADDED from /var/REACTNATIVE_PROJECTS/NewGitMt/MT_Spa_Masseuse/massagedtodayaspamasseuse/android/app/src/main/AndroidManifest.xml:13:7-52
	tools:targetApi
		ADDED from /var/REACTNATIVE_PROJECTS/NewGitMt/MT_Spa_Masseuse/massagedtodayaspamasseuse/android/app/src/debug/AndroidManifest.xml:7:54-74
	android:icon
		ADDED from /var/REACTNATIVE_PROJECTS/NewGitMt/MT_Spa_Masseuse/massagedtodayaspamasseuse/android/app/src/main/AndroidManifest.xml:12:7-41
		ADDED from /var/REACTNATIVE_PROJECTS/NewGitMt/MT_Spa_Masseuse/massagedtodayaspamasseuse/android/app/src/main/AndroidManifest.xml:12:7-41
	android:allowBackup
		ADDED from /var/REACTNATIVE_PROJECTS/NewGitMt/MT_Spa_Masseuse/massagedtodayaspamasseuse/android/app/src/main/AndroidManifest.xml:14:7-34
		ADDED from /var/REACTNATIVE_PROJECTS/NewGitMt/MT_Spa_Masseuse/massagedtodayaspamasseuse/android/app/src/main/AndroidManifest.xml:14:7-34
	android:theme
		ADDED from /var/REACTNATIVE_PROJECTS/NewGitMt/MT_Spa_Masseuse/massagedtodayaspamasseuse/android/app/src/main/AndroidManifest.xml:15:7-38
		ADDED from /var/REACTNATIVE_PROJECTS/NewGitMt/MT_Spa_Masseuse/massagedtodayaspamasseuse/android/app/src/main/AndroidManifest.xml:15:7-38
	android:usesCleartextTraffic
		ADDED from /var/REACTNATIVE_PROJECTS/NewGitMt/MT_Spa_Masseuse/massagedtodayaspamasseuse/android/app/src/debug/AndroidManifest.xml:7:18-53
	android:name
		ADDED from /var/REACTNATIVE_PROJECTS/NewGitMt/MT_Spa_Masseuse/massagedtodayaspamasseuse/android/app/src/main/AndroidManifest.xml:10:7-38
		ADDED from /var/REACTNATIVE_PROJECTS/NewGitMt/MT_Spa_Masseuse/massagedtodayaspamasseuse/android/app/src/main/AndroidManifest.xml:10:7-38
activity#com.massegetodayspaportal.MainActivity
ADDED from /var/REACTNATIVE_PROJECTS/NewGitMt/MT_Spa_Masseuse/massagedtodayaspamasseuse/android/app/src/main/AndroidManifest.xml:16:7-25:18
	android:label
		ADDED from /var/REACTNATIVE_PROJECTS/NewGitMt/MT_Spa_Masseuse/massagedtodayaspamasseuse/android/app/src/main/AndroidManifest.xml:18:9-41
	android:windowSoftInputMode
		ADDED from /var/REACTNATIVE_PROJECTS/NewGitMt/MT_Spa_Masseuse/massagedtodayaspamasseuse/android/app/src/main/AndroidManifest.xml:20:9-51
	android:configChanges
		ADDED from /var/REACTNATIVE_PROJECTS/NewGitMt/MT_Spa_Masseuse/massagedtodayaspamasseuse/android/app/src/main/AndroidManifest.xml:19:9-79
	android:name
		ADDED from /var/REACTNATIVE_PROJECTS/NewGitMt/MT_Spa_Masseuse/massagedtodayaspamasseuse/android/app/src/main/AndroidManifest.xml:17:9-37
intent-filter#action:name:android.intent.action.MAIN+category:name:android.intent.category.LAUNCHER
ADDED from /var/REACTNATIVE_PROJECTS/NewGitMt/MT_Spa_Masseuse/massagedtodayaspamasseuse/android/app/src/main/AndroidManifest.xml:21:9-24:25
action#android.intent.action.MAIN
ADDED from /var/REACTNATIVE_PROJECTS/NewGitMt/MT_Spa_Masseuse/massagedtodayaspamasseuse/android/app/src/main/AndroidManifest.xml:22:13-65
	android:name
		ADDED from /var/REACTNATIVE_PROJECTS/NewGitMt/MT_Spa_Masseuse/massagedtodayaspamasseuse/android/app/src/main/AndroidManifest.xml:22:21-62
category#android.intent.category.LAUNCHER
ADDED from /var/REACTNATIVE_PROJECTS/NewGitMt/MT_Spa_Masseuse/massagedtodayaspamasseuse/android/app/src/main/AndroidManifest.xml:23:13-73
	android:name
		ADDED from /var/REACTNATIVE_PROJECTS/NewGitMt/MT_Spa_Masseuse/massagedtodayaspamasseuse/android/app/src/main/AndroidManifest.xml:23:23-70
activity#com.facebook.react.devsupport.DevSettingsActivity
ADDED from /var/REACTNATIVE_PROJECTS/NewGitMt/MT_Spa_Masseuse/massagedtodayaspamasseuse/android/app/src/main/AndroidManifest.xml:26:7-84
	android:name
		ADDED from /var/REACTNATIVE_PROJECTS/NewGitMt/MT_Spa_Masseuse/massagedtodayaspamasseuse/android/app/src/main/AndroidManifest.xml:26:17-81
uses-sdk
INJECTED from /var/REACTNATIVE_PROJECTS/NewGitMt/MT_Spa_Masseuse/massagedtodayaspamasseuse/android/app/src/main/AndroidManifest.xml reason: use-sdk injection requested
INJECTED from /var/REACTNATIVE_PROJECTS/NewGitMt/MT_Spa_Masseuse/massagedtodayaspamasseuse/android/app/src/main/AndroidManifest.xml
INJECTED from /var/REACTNATIVE_PROJECTS/NewGitMt/MT_Spa_Masseuse/massagedtodayaspamasseuse/android/app/src/main/AndroidManifest.xml
MERGED from [:react-native-vector-icons] /var/REACTNATIVE_PROJECTS/NewGitMt/MT_Spa_Masseuse/massagedtodayaspamasseuse/node_modules/react-native-vector-icons/android/build/intermediates/library_manifest/debug/AndroidManifest.xml:7:5-9:41
MERGED from [:react-native-vector-icons] /var/REACTNATIVE_PROJECTS/NewGitMt/MT_Spa_Masseuse/massagedtodayaspamasseuse/node_modules/react-native-vector-icons/android/build/intermediates/library_manifest/debug/AndroidManifest.xml:7:5-9:41
MERGED from [:@delightfulstudio_react-native-wheel-picker-android] /var/REACTNATIVE_PROJECTS/NewGitMt/MT_Spa_Masseuse/massagedtodayaspamasseuse/node_modules/@delightfulstudio/react-native-wheel-picker-android/android/build/intermediates/library_manifest/debug/AndroidManifest.xml:7:5-9:41
MERGED from [:@delightfulstudio_react-native-wheel-picker-android] /var/REACTNATIVE_PROJECTS/NewGitMt/MT_Spa_Masseuse/massagedtodayaspamasseuse/node_modules/@delightfulstudio/react-native-wheel-picker-android/android/build/intermediates/library_manifest/debug/AndroidManifest.xml:7:5-9:41
MERGED from [:@react-native-community_async-storage] /var/REACTNATIVE_PROJECTS/NewGitMt/MT_Spa_Masseuse/massagedtodayaspamasseuse/node_modules/@react-native-community/async-storage/android/build/intermediates/library_manifest/debug/AndroidManifest.xml:5:5-7:41
MERGED from [:@react-native-community_async-storage] /var/REACTNATIVE_PROJECTS/NewGitMt/MT_Spa_Masseuse/massagedtodayaspamasseuse/node_modules/@react-native-community/async-storage/android/build/intermediates/library_manifest/debug/AndroidManifest.xml:5:5-7:41
MERGED from [:react-native-geolocation-service] /var/REACTNATIVE_PROJECTS/NewGitMt/MT_Spa_Masseuse/massagedtodayaspamasseuse/node_modules/react-native-geolocation-service/android/build/intermediates/library_manifest/debug/AndroidManifest.xml:5:5-7:41
MERGED from [:react-native-geolocation-service] /var/REACTNATIVE_PROJECTS/NewGitMt/MT_Spa_Masseuse/massagedtodayaspamasseuse/node_modules/react-native-geolocation-service/android/build/intermediates/library_manifest/debug/AndroidManifest.xml:5:5-7:41
MERGED from [:react-native-gesture-handler] /var/REACTNATIVE_PROJECTS/NewGitMt/MT_Spa_Masseuse/massagedtodayaspamasseuse/node_modules/react-native-gesture-handler/android/build/intermediates/library_manifest/debug/AndroidManifest.xml:7:5-9:41
MERGED from [:react-native-gesture-handler] /var/REACTNATIVE_PROJECTS/NewGitMt/MT_Spa_Masseuse/massagedtodayaspamasseuse/node_modules/react-native-gesture-handler/android/build/intermediates/library_manifest/debug/AndroidManifest.xml:7:5-9:41
MERGED from [:react-native-image-crop-picker] /var/REACTNATIVE_PROJECTS/NewGitMt/MT_Spa_Masseuse/massagedtodayaspamasseuse/node_modules/react-native-image-crop-picker/android/build/intermediates/library_manifest/debug/AndroidManifest.xml:6:5-8:41
MERGED from [:react-native-image-crop-picker] /var/REACTNATIVE_PROJECTS/NewGitMt/MT_Spa_Masseuse/massagedtodayaspamasseuse/node_modules/react-native-image-crop-picker/android/build/intermediates/library_manifest/debug/AndroidManifest.xml:6:5-8:41
MERGED from [:react-native-image-picker] /var/REACTNATIVE_PROJECTS/NewGitMt/MT_Spa_Masseuse/massagedtodayaspamasseuse/node_modules/react-native-image-picker/android/build/intermediates/library_manifest/debug/AndroidManifest.xml:5:5-7:41
MERGED from [:react-native-image-picker] /var/REACTNATIVE_PROJECTS/NewGitMt/MT_Spa_Masseuse/massagedtodayaspamasseuse/node_modules/react-native-image-picker/android/build/intermediates/library_manifest/debug/AndroidManifest.xml:5:5-7:41
MERGED from [:react-native-splash-screen] /var/REACTNATIVE_PROJECTS/NewGitMt/MT_Spa_Masseuse/massagedtodayaspamasseuse/node_modules/react-native-splash-screen/android/build/intermediates/library_manifest/debug/AndroidManifest.xml:7:5-9:41
MERGED from [:react-native-splash-screen] /var/REACTNATIVE_PROJECTS/NewGitMt/MT_Spa_Masseuse/massagedtodayaspamasseuse/node_modules/react-native-splash-screen/android/build/intermediates/library_manifest/debug/AndroidManifest.xml:7:5-9:41
MERGED from [:react-native-webview] /var/REACTNATIVE_PROJECTS/NewGitMt/MT_Spa_Masseuse/massagedtodayaspamasseuse/node_modules/react-native-webview/android/build/intermediates/library_manifest/debug/AndroidManifest.xml:7:5-9:41
MERGED from [:react-native-webview] /var/REACTNATIVE_PROJECTS/NewGitMt/MT_Spa_Masseuse/massagedtodayaspamasseuse/node_modules/react-native-webview/android/build/intermediates/library_manifest/debug/AndroidManifest.xml:7:5-9:41
MERGED from [com.facebook.react:react-native:0.61.2] /home/natit/.gradle/caches/transforms-2/files-2.1/34bd01ab9a71b8cc36164998a584cdb5/AndroidManifest.xml:7:5-9:41
MERGED from [com.facebook.react:react-native:0.61.2] /home/natit/.gradle/caches/transforms-2/files-2.1/34bd01ab9a71b8cc36164998a584cdb5/AndroidManifest.xml:7:5-9:41
MERGED from [org.webkit:android-jsc:r245459] /home/natit/.gradle/caches/transforms-2/files-2.1/ce6eb6733a92d0bccb779af83aede304/AndroidManifest.xml:7:5-9:41
MERGED from [org.webkit:android-jsc:r245459] /home/natit/.gradle/caches/transforms-2/files-2.1/ce6eb6733a92d0bccb779af83aede304/AndroidManifest.xml:7:5-9:41
MERGED from [com.github.yalantis:ucrop:2.2.2-native] /home/natit/.gradle/caches/transforms-2/files-2.1/2515b5ea445f6eb23f3e0cda8b6e066a/AndroidManifest.xml:7:5-9:41
MERGED from [com.github.yalantis:ucrop:2.2.2-native] /home/natit/.gradle/caches/transforms-2/files-2.1/2515b5ea445f6eb23f3e0cda8b6e066a/AndroidManifest.xml:7:5-9:41
MERGED from [androidx.appcompat:appcompat:1.0.2] /home/natit/.gradle/caches/transforms-2/files-2.1/b51f9a4654927f325f2ef262d01beb49/AndroidManifest.xml:20:5-44
MERGED from [androidx.appcompat:appcompat:1.0.2] /home/natit/.gradle/caches/transforms-2/files-2.1/b51f9a4654927f325f2ef262d01beb49/AndroidManifest.xml:20:5-44
MERGED from [com.facebook.fresco:fresco:2.0.0] /home/natit/.gradle/caches/transforms-2/files-2.1/bdf7cd0f442874928f2d77b4ece5aecf/AndroidManifest.xml:5:5-7:41
MERGED from [com.facebook.fresco:fresco:2.0.0] /home/natit/.gradle/caches/transforms-2/files-2.1/bdf7cd0f442874928f2d77b4ece5aecf/AndroidManifest.xml:5:5-7:41
MERGED from [com.facebook.fresco:imagepipeline-okhttp3:2.0.0] /home/natit/.gradle/caches/transforms-2/files-2.1/a1d505133fc88cc24255098d564032b0/AndroidManifest.xml:5:5-7:41
MERGED from [com.facebook.fresco:imagepipeline-okhttp3:2.0.0] /home/natit/.gradle/caches/transforms-2/files-2.1/a1d505133fc88cc24255098d564032b0/AndroidManifest.xml:5:5-7:41
MERGED from [com.facebook.fresco:drawee:2.0.0] /home/natit/.gradle/caches/transforms-2/files-2.1/c771f3ee61b7216a00b9314b76438071/AndroidManifest.xml:5:5-7:41
MERGED from [com.facebook.fresco:drawee:2.0.0] /home/natit/.gradle/caches/transforms-2/files-2.1/c771f3ee61b7216a00b9314b76438071/AndroidManifest.xml:5:5-7:41
MERGED from [com.facebook.fresco:nativeimagefilters:2.0.0] /home/natit/.gradle/caches/transforms-2/files-2.1/79f548bfcd010422d0ba6c8fa3c0b271/AndroidManifest.xml:5:5-7:41
MERGED from [com.facebook.fresco:nativeimagefilters:2.0.0] /home/natit/.gradle/caches/transforms-2/files-2.1/79f548bfcd010422d0ba6c8fa3c0b271/AndroidManifest.xml:5:5-7:41
MERGED from [com.facebook.fresco:imagepipeline:2.0.0] /home/natit/.gradle/caches/transforms-2/files-2.1/945ee9cbed2f4b5593f3024487e3db95/AndroidManifest.xml:5:5-7:41
MERGED from [com.facebook.fresco:imagepipeline:2.0.0] /home/natit/.gradle/caches/transforms-2/files-2.1/945ee9cbed2f4b5593f3024487e3db95/AndroidManifest.xml:5:5-7:41
MERGED from [com.facebook.fresco:nativeimagetranscoder:2.0.0] /home/natit/.gradle/caches/transforms-2/files-2.1/89c1ae8e1bfd1e1a85f1c8c53c155ce0/AndroidManifest.xml:5:5-7:41
MERGED from [com.facebook.fresco:nativeimagetranscoder:2.0.0] /home/natit/.gradle/caches/transforms-2/files-2.1/89c1ae8e1bfd1e1a85f1c8c53c155ce0/AndroidManifest.xml:5:5-7:41
MERGED from [com.facebook.fresco:imagepipeline-base:2.0.0] /home/natit/.gradle/caches/transforms-2/files-2.1/7211062f2cd7fd71a3976765888f9b37/AndroidManifest.xml:5:5-7:41
MERGED from [com.facebook.fresco:imagepipeline-base:2.0.0] /home/natit/.gradle/caches/transforms-2/files-2.1/7211062f2cd7fd71a3976765888f9b37/AndroidManifest.xml:5:5-7:41
MERGED from [com.facebook.soloader:soloader:0.6.0] /home/natit/.gradle/caches/transforms-2/files-2.1/46c4048e692669c5c7c59dbbd4c718b3/AndroidManifest.xml:7:5-9:41
MERGED from [com.facebook.soloader:soloader:0.6.0] /home/natit/.gradle/caches/transforms-2/files-2.1/46c4048e692669c5c7c59dbbd4c718b3/AndroidManifest.xml:7:5-9:41
MERGED from [cn.aigestudio.wheelpicker:WheelPicker:1.1.2] /home/natit/.gradle/caches/transforms-2/files-2.1/7a73ce7b1412959dbb8c50eca2d6b70e/AndroidManifest.xml:8:5-10:41
MERGED from [cn.aigestudio.wheelpicker:WheelPicker:1.1.2] /home/natit/.gradle/caches/transforms-2/files-2.1/7a73ce7b1412959dbb8c50eca2d6b70e/AndroidManifest.xml:8:5-10:41
MERGED from [com.google.android.gms:play-services-location:16.0.0] /home/natit/.gradle/caches/transforms-2/files-2.1/3d6b64608ec72b8467e2803460d7c94f/AndroidManifest.xml:5:5-44
MERGED from [com.google.android.gms:play-services-location:16.0.0] /home/natit/.gradle/caches/transforms-2/files-2.1/3d6b64608ec72b8467e2803460d7c94f/AndroidManifest.xml:5:5-44
MERGED from [com.google.android.gms:play-services-base:16.0.1] /home/natit/.gradle/caches/transforms-2/files-2.1/195925090d6f93eb2f17e925a19c7179/AndroidManifest.xml:20:5-44
MERGED from [com.google.android.gms:play-services-base:16.0.1] /home/natit/.gradle/caches/transforms-2/files-2.1/195925090d6f93eb2f17e925a19c7179/AndroidManifest.xml:20:5-44
MERGED from [com.google.android.gms:play-services-places-placereport:16.0.0] /home/natit/.gradle/caches/transforms-2/files-2.1/484e695fd6a7789d6f9425ea1bd7cac7/AndroidManifest.xml:20:5-44
MERGED from [com.google.android.gms:play-services-places-placereport:16.0.0] /home/natit/.gradle/caches/transforms-2/files-2.1/484e695fd6a7789d6f9425ea1bd7cac7/AndroidManifest.xml:20:5-44
MERGED from [com.google.android.gms:play-services-tasks:16.0.1] /home/natit/.gradle/caches/transforms-2/files-2.1/49f239ec616f235e1dbad457c93ff931/AndroidManifest.xml:5:5-44
MERGED from [com.google.android.gms:play-services-tasks:16.0.1] /home/natit/.gradle/caches/transforms-2/files-2.1/49f239ec616f235e1dbad457c93ff931/AndroidManifest.xml:5:5-44
MERGED from [com.google.android.gms:play-services-basement:16.0.1] /home/natit/.gradle/caches/transforms-2/files-2.1/b830f2f38b6e2d17f737d37c53c0969e/AndroidManifest.xml:20:5-44
MERGED from [com.google.android.gms:play-services-basement:16.0.1] /home/natit/.gradle/caches/transforms-2/files-2.1/b830f2f38b6e2d17f737d37c53c0969e/AndroidManifest.xml:20:5-44
MERGED from [androidx.legacy:legacy-support-v4:1.0.0] /home/natit/.gradle/caches/transforms-2/files-2.1/e5f45239c9a864b3ec12c064e6a1bfb7/AndroidManifest.xml:20:5-44
MERGED from [androidx.legacy:legacy-support-v4:1.0.0] /home/natit/.gradle/caches/transforms-2/files-2.1/e5f45239c9a864b3ec12c064e6a1bfb7/AndroidManifest.xml:20:5-44
MERGED from [androidx.fragment:fragment:1.0.0] /home/natit/.gradle/caches/transforms-2/files-2.1/3e01c859fc06b47819ef1dc3af40f2b5/AndroidManifest.xml:20:5-44
MERGED from [androidx.fragment:fragment:1.0.0] /home/natit/.gradle/caches/transforms-2/files-2.1/3e01c859fc06b47819ef1dc3af40f2b5/AndroidManifest.xml:20:5-44
MERGED from [androidx.vectordrawable:vectordrawable-animated:1.0.0] /home/natit/.gradle/caches/transforms-2/files-2.1/fc6953d0ca3241b2ac1b1575f09641a4/AndroidManifest.xml:20:5-44
MERGED from [androidx.vectordrawable:vectordrawable-animated:1.0.0] /home/natit/.gradle/caches/transforms-2/files-2.1/fc6953d0ca3241b2ac1b1575f09641a4/AndroidManifest.xml:20:5-44
MERGED from [androidx.legacy:legacy-support-core-ui:1.0.0] /home/natit/.gradle/caches/transforms-2/files-2.1/850f445a801bf0d5d96462e7b4d5aa54/AndroidManifest.xml:20:5-44
MERGED from [androidx.legacy:legacy-support-core-ui:1.0.0] /home/natit/.gradle/caches/transforms-2/files-2.1/850f445a801bf0d5d96462e7b4d5aa54/AndroidManifest.xml:20:5-44
MERGED from [androidx.legacy:legacy-support-core-utils:1.0.0] /home/natit/.gradle/caches/transforms-2/files-2.1/2da00a16da0557467175e81fdca4b408/AndroidManifest.xml:20:5-44
MERGED from [androidx.legacy:legacy-support-core-utils:1.0.0] /home/natit/.gradle/caches/transforms-2/files-2.1/2da00a16da0557467175e81fdca4b408/AndroidManifest.xml:20:5-44
MERGED from [androidx.vectordrawable:vectordrawable:1.0.1] /home/natit/.gradle/caches/transforms-2/files-2.1/4f391a9220d6eeabeae72ffe2b6b0594/AndroidManifest.xml:20:5-44
MERGED from [androidx.vectordrawable:vectordrawable:1.0.1] /home/natit/.gradle/caches/transforms-2/files-2.1/4f391a9220d6eeabeae72ffe2b6b0594/AndroidManifest.xml:20:5-44
MERGED from [androidx.loader:loader:1.0.0] /home/natit/.gradle/caches/transforms-2/files-2.1/6e817d06a6b3ba733859c714032d2a9d/AndroidManifest.xml:20:5-44
MERGED from [androidx.loader:loader:1.0.0] /home/natit/.gradle/caches/transforms-2/files-2.1/6e817d06a6b3ba733859c714032d2a9d/AndroidManifest.xml:20:5-44
MERGED from [androidx.viewpager:viewpager:1.0.0] /home/natit/.gradle/caches/transforms-2/files-2.1/52a731fa00c0e0f8b0e9e9b7c8adee06/AndroidManifest.xml:20:5-44
MERGED from [androidx.viewpager:viewpager:1.0.0] /home/natit/.gradle/caches/transforms-2/files-2.1/52a731fa00c0e0f8b0e9e9b7c8adee06/AndroidManifest.xml:20:5-44
MERGED from [androidx.coordinatorlayout:coordinatorlayout:1.0.0] /home/natit/.gradle/caches/transforms-2/files-2.1/a83d8a0d7b4fd026621c5756a4c0c0a4/AndroidManifest.xml:20:5-44
MERGED from [androidx.coordinatorlayout:coordinatorlayout:1.0.0] /home/natit/.gradle/caches/transforms-2/files-2.1/a83d8a0d7b4fd026621c5756a4c0c0a4/AndroidManifest.xml:20:5-44
MERGED from [androidx.drawerlayout:drawerlayout:1.0.0] /home/natit/.gradle/caches/transforms-2/files-2.1/4e22c45acfac3538f27d12f86a9560c8/AndroidManifest.xml:20:5-44
MERGED from [androidx.drawerlayout:drawerlayout:1.0.0] /home/natit/.gradle/caches/transforms-2/files-2.1/4e22c45acfac3538f27d12f86a9560c8/AndroidManifest.xml:20:5-44
MERGED from [androidx.slidingpanelayout:slidingpanelayout:1.0.0] /home/natit/.gradle/caches/transforms-2/files-2.1/22cebf1941db95fa9f05209d311905df/AndroidManifest.xml:20:5-44
MERGED from [androidx.slidingpanelayout:slidingpanelayout:1.0.0] /home/natit/.gradle/caches/transforms-2/files-2.1/22cebf1941db95fa9f05209d311905df/AndroidManifest.xml:20:5-44
MERGED from [androidx.customview:customview:1.0.0] /home/natit/.gradle/caches/transforms-2/files-2.1/25d51578a38f7e4367b3daea49b14ee2/AndroidManifest.xml:20:5-44
MERGED from [androidx.customview:customview:1.0.0] /home/natit/.gradle/caches/transforms-2/files-2.1/25d51578a38f7e4367b3daea49b14ee2/AndroidManifest.xml:20:5-44
MERGED from [androidx.swiperefreshlayout:swiperefreshlayout:1.0.0] /home/natit/.gradle/caches/transforms-2/files-2.1/89e5e89be699f55ea423de9980e46a15/AndroidManifest.xml:20:5-44
MERGED from [androidx.swiperefreshlayout:swiperefreshlayout:1.0.0] /home/natit/.gradle/caches/transforms-2/files-2.1/89e5e89be699f55ea423de9980e46a15/AndroidManifest.xml:20:5-44
MERGED from [androidx.asynclayoutinflater:asynclayoutinflater:1.0.0] /home/natit/.gradle/caches/transforms-2/files-2.1/6b8823c7cd7349ad931cc5e5922118ef/AndroidManifest.xml:20:5-44
MERGED from [androidx.asynclayoutinflater:asynclayoutinflater:1.0.0] /home/natit/.gradle/caches/transforms-2/files-2.1/6b8823c7cd7349ad931cc5e5922118ef/AndroidManifest.xml:20:5-44
MERGED from [androidx.media:media:1.0.0] /home/natit/.gradle/caches/transforms-2/files-2.1/028bd18508ffc0a2e2578d66fb0eb09d/AndroidManifest.xml:20:5-44
MERGED from [androidx.media:media:1.0.0] /home/natit/.gradle/caches/transforms-2/files-2.1/028bd18508ffc0a2e2578d66fb0eb09d/AndroidManifest.xml:20:5-44
MERGED from [androidx.core:core:1.0.1] /home/natit/.gradle/caches/transforms-2/files-2.1/2dd1a5d57fe2b7203b94a11b8e844293/AndroidManifest.xml:20:5-44
MERGED from [androidx.core:core:1.0.1] /home/natit/.gradle/caches/transforms-2/files-2.1/2dd1a5d57fe2b7203b94a11b8e844293/AndroidManifest.xml:20:5-44
MERGED from [androidx.versionedparcelable:versionedparcelable:1.0.0] /home/natit/.gradle/caches/transforms-2/files-2.1/fbb08af1b97e208085730b3bfcec35d8/AndroidManifest.xml:20:5-44
MERGED from [androidx.versionedparcelable:versionedparcelable:1.0.0] /home/natit/.gradle/caches/transforms-2/files-2.1/fbb08af1b97e208085730b3bfcec35d8/AndroidManifest.xml:20:5-44
MERGED from [androidx.cursoradapter:cursoradapter:1.0.0] /home/natit/.gradle/caches/transforms-2/files-2.1/44e28abc4b5f895414707f766ed3e00d/AndroidManifest.xml:20:5-44
MERGED from [androidx.cursoradapter:cursoradapter:1.0.0] /home/natit/.gradle/caches/transforms-2/files-2.1/44e28abc4b5f895414707f766ed3e00d/AndroidManifest.xml:20:5-44
MERGED from [androidx.lifecycle:lifecycle-runtime:2.0.0] /home/natit/.gradle/caches/transforms-2/files-2.1/8898360fbd311ab741a2ac9a9f0ff368/AndroidManifest.xml:20:5-44
MERGED from [androidx.lifecycle:lifecycle-runtime:2.0.0] /home/natit/.gradle/caches/transforms-2/files-2.1/8898360fbd311ab741a2ac9a9f0ff368/AndroidManifest.xml:20:5-44
MERGED from [androidx.documentfile:documentfile:1.0.0] /home/natit/.gradle/caches/transforms-2/files-2.1/2680560e94d07f9f7ce1a8c6af4370be/AndroidManifest.xml:20:5-44
MERGED from [androidx.documentfile:documentfile:1.0.0] /home/natit/.gradle/caches/transforms-2/files-2.1/2680560e94d07f9f7ce1a8c6af4370be/AndroidManifest.xml:20:5-44
MERGED from [androidx.localbroadcastmanager:localbroadcastmanager:1.0.0] /home/natit/.gradle/caches/transforms-2/files-2.1/9f5082b56460d029313fe60d5c9b6416/AndroidManifest.xml:20:5-44
MERGED from [androidx.localbroadcastmanager:localbroadcastmanager:1.0.0] /home/natit/.gradle/caches/transforms-2/files-2.1/9f5082b56460d029313fe60d5c9b6416/AndroidManifest.xml:20:5-44
MERGED from [androidx.print:print:1.0.0] /home/natit/.gradle/caches/transforms-2/files-2.1/eaf6446969ec63702555aa3cc5121fd1/AndroidManifest.xml:20:5-44
MERGED from [androidx.print:print:1.0.0] /home/natit/.gradle/caches/transforms-2/files-2.1/eaf6446969ec63702555aa3cc5121fd1/AndroidManifest.xml:20:5-44
MERGED from [androidx.lifecycle:lifecycle-viewmodel:2.0.0] /home/natit/.gradle/caches/transforms-2/files-2.1/6c5d2a0ba40b29c5bced7a8962bd74f6/AndroidManifest.xml:20:5-44
MERGED from [androidx.lifecycle:lifecycle-viewmodel:2.0.0] /home/natit/.gradle/caches/transforms-2/files-2.1/6c5d2a0ba40b29c5bced7a8962bd74f6/AndroidManifest.xml:20:5-44
MERGED from [androidx.lifecycle:lifecycle-livedata:2.0.0] /home/natit/.gradle/caches/transforms-2/files-2.1/ec76986c2b4cccb4a23d4c7d09ed8105/AndroidManifest.xml:20:5-44
MERGED from [androidx.lifecycle:lifecycle-livedata:2.0.0] /home/natit/.gradle/caches/transforms-2/files-2.1/ec76986c2b4cccb4a23d4c7d09ed8105/AndroidManifest.xml:20:5-44
MERGED from [androidx.lifecycle:lifecycle-livedata-core:2.0.0] /home/natit/.gradle/caches/transforms-2/files-2.1/4a4c226fb926dad569739561d6f0cfd1/AndroidManifest.xml:20:5-44
MERGED from [androidx.lifecycle:lifecycle-livedata-core:2.0.0] /home/natit/.gradle/caches/transforms-2/files-2.1/4a4c226fb926dad569739561d6f0cfd1/AndroidManifest.xml:20:5-44
MERGED from [androidx.arch.core:core-runtime:2.0.0] /home/natit/.gradle/caches/transforms-2/files-2.1/e1ba7620851acfcd54617c4a9713fe2a/AndroidManifest.xml:20:5-44
MERGED from [androidx.arch.core:core-runtime:2.0.0] /home/natit/.gradle/caches/transforms-2/files-2.1/e1ba7620851acfcd54617c4a9713fe2a/AndroidManifest.xml:20:5-44
MERGED from [androidx.interpolator:interpolator:1.0.0] /home/natit/.gradle/caches/transforms-2/files-2.1/800de3691d37f0c0acf843f01722def6/AndroidManifest.xml:20:5-44
MERGED from [androidx.interpolator:interpolator:1.0.0] /home/natit/.gradle/caches/transforms-2/files-2.1/800de3691d37f0c0acf843f01722def6/AndroidManifest.xml:20:5-44
MERGED from [com.facebook.fresco:fbcore:2.0.0] /home/natit/.gradle/caches/transforms-2/files-2.1/3aacdf0d3e8c8089bd61d4e10ba9aa99/AndroidManifest.xml:5:5-7:41
MERGED from [com.facebook.fresco:fbcore:2.0.0] /home/natit/.gradle/caches/transforms-2/files-2.1/3aacdf0d3e8c8089bd61d4e10ba9aa99/AndroidManifest.xml:5:5-7:41
INJECTED from /var/REACTNATIVE_PROJECTS/NewGitMt/MT_Spa_Masseuse/massagedtodayaspamasseuse/android/app/src/debug/AndroidManifest.xml
INJECTED from /var/REACTNATIVE_PROJECTS/NewGitMt/MT_Spa_Masseuse/massagedtodayaspamasseuse/android/app/src/debug/AndroidManifest.xml
	android:targetSdkVersion
		INJECTED from /var/REACTNATIVE_PROJECTS/NewGitMt/MT_Spa_Masseuse/massagedtodayaspamasseuse/android/app/src/main/AndroidManifest.xml
		INJECTED from /var/REACTNATIVE_PROJECTS/NewGitMt/MT_Spa_Masseuse/massagedtodayaspamasseuse/android/app/src/debug/AndroidManifest.xml
	android:minSdkVersion
		INJECTED from /var/REACTNATIVE_PROJECTS/NewGitMt/MT_Spa_Masseuse/massagedtodayaspamasseuse/android/app/src/main/AndroidManifest.xml
		INJECTED from /var/REACTNATIVE_PROJECTS/NewGitMt/MT_Spa_Masseuse/massagedtodayaspamasseuse/android/app/src/debug/AndroidManifest.xml
uses-permission#android.permission.SYSTEM_ALERT_WINDOW
ADDED from /var/REACTNATIVE_PROJECTS/NewGitMt/MT_Spa_Masseuse/massagedtodayaspamasseuse/android/app/src/debug/AndroidManifest.xml:5:5-77
	android:name
		ADDED from /var/REACTNATIVE_PROJECTS/NewGitMt/MT_Spa_Masseuse/massagedtodayaspamasseuse/android/app/src/debug/AndroidManifest.xml:5:22-75
uses-permission#android.permission.ACCESS_NETWORK_STATE
ADDED from [:react-native-geolocation-service] /var/REACTNATIVE_PROJECTS/NewGitMt/MT_Spa_Masseuse/massagedtodayaspamasseuse/node_modules/react-native-geolocation-service/android/build/intermediates/library_manifest/debug/AndroidManifest.xml:10:5-79
	android:name
		ADDED from [:react-native-geolocation-service] /var/REACTNATIVE_PROJECTS/NewGitMt/MT_Spa_Masseuse/massagedtodayaspamasseuse/node_modules/react-native-geolocation-service/android/build/intermediates/library_manifest/debug/AndroidManifest.xml:10:22-76
uses-permission#android.permission.ACCESS_COARSE_LOCATION
ADDED from [:react-native-geolocation-service] /var/REACTNATIVE_PROJECTS/NewGitMt/MT_Spa_Masseuse/massagedtodayaspamasseuse/node_modules/react-native-geolocation-service/android/build/intermediates/library_manifest/debug/AndroidManifest.xml:11:5-81
	android:name
		ADDED from [:react-native-geolocation-service] /var/REACTNATIVE_PROJECTS/NewGitMt/MT_Spa_Masseuse/massagedtodayaspamasseuse/node_modules/react-native-geolocation-service/android/build/intermediates/library_manifest/debug/AndroidManifest.xml:11:22-78
provider#androidx.core.content.FileProvider
ADDED from [:react-native-image-crop-picker] /var/REACTNATIVE_PROJECTS/NewGitMt/MT_Spa_Masseuse/massagedtodayaspamasseuse/node_modules/react-native-image-crop-picker/android/build/intermediates/library_manifest/debug/AndroidManifest.xml:13:9-21:20
	android:grantUriPermissions
		ADDED from [:react-native-image-crop-picker] /var/REACTNATIVE_PROJECTS/NewGitMt/MT_Spa_Masseuse/massagedtodayaspamasseuse/node_modules/react-native-image-crop-picker/android/build/intermediates/library_manifest/debug/AndroidManifest.xml:17:13-47
	android:authorities
		ADDED from [:react-native-image-crop-picker] /var/REACTNATIVE_PROJECTS/NewGitMt/MT_Spa_Masseuse/massagedtodayaspamasseuse/node_modules/react-native-image-crop-picker/android/build/intermediates/library_manifest/debug/AndroidManifest.xml:15:13-60
	android:exported
		ADDED from [:react-native-image-crop-picker] /var/REACTNATIVE_PROJECTS/NewGitMt/MT_Spa_Masseuse/massagedtodayaspamasseuse/node_modules/react-native-image-crop-picker/android/build/intermediates/library_manifest/debug/AndroidManifest.xml:16:13-37
	android:name
		ADDED from [:react-native-image-crop-picker] /var/REACTNATIVE_PROJECTS/NewGitMt/MT_Spa_Masseuse/massagedtodayaspamasseuse/node_modules/react-native-image-crop-picker/android/build/intermediates/library_manifest/debug/AndroidManifest.xml:14:13-62
meta-data#android.support.FILE_PROVIDER_PATHS
ADDED from [:react-native-image-crop-picker] /var/REACTNATIVE_PROJECTS/NewGitMt/MT_Spa_Masseuse/massagedtodayaspamasseuse/node_modules/react-native-image-crop-picker/android/build/intermediates/library_manifest/debug/AndroidManifest.xml:18:13-20:58
	android:resource
		ADDED from [:react-native-image-crop-picker] /var/REACTNATIVE_PROJECTS/NewGitMt/MT_Spa_Masseuse/massagedtodayaspamasseuse/node_modules/react-native-image-crop-picker/android/build/intermediates/library_manifest/debug/AndroidManifest.xml:20:17-55
	android:name
		ADDED from [:react-native-image-crop-picker] /var/REACTNATIVE_PROJECTS/NewGitMt/MT_Spa_Masseuse/massagedtodayaspamasseuse/node_modules/react-native-image-crop-picker/android/build/intermediates/library_manifest/debug/AndroidManifest.xml:19:17-67
activity#com.yalantis.ucrop.UCropActivity
ADDED from [:react-native-image-crop-picker] /var/REACTNATIVE_PROJECTS/NewGitMt/MT_Spa_Masseuse/massagedtodayaspamasseuse/node_modules/react-native-image-crop-picker/android/build/intermediates/library_manifest/debug/AndroidManifest.xml:23:9-25:72
	android:theme
		ADDED from [:react-native-image-crop-picker] /var/REACTNATIVE_PROJECTS/NewGitMt/MT_Spa_Masseuse/massagedtodayaspamasseuse/node_modules/react-native-image-crop-picker/android/build/intermediates/library_manifest/debug/AndroidManifest.xml:25:13-69
	android:name
		ADDED from [:react-native-image-crop-picker] /var/REACTNATIVE_PROJECTS/NewGitMt/MT_Spa_Masseuse/massagedtodayaspamasseuse/node_modules/react-native-image-crop-picker/android/build/intermediates/library_manifest/debug/AndroidManifest.xml:24:13-60
provider#com.imagepicker.FileProvider
ADDED from [:react-native-image-picker] /var/REACTNATIVE_PROJECTS/NewGitMt/MT_Spa_Masseuse/massagedtodayaspamasseuse/node_modules/react-native-image-picker/android/build/intermediates/library_manifest/debug/AndroidManifest.xml:10:9-18:20
	android:grantUriPermissions
		ADDED from [:react-native-image-picker] /var/REACTNATIVE_PROJECTS/NewGitMt/MT_Spa_Masseuse/massagedtodayaspamasseuse/node_modules/react-native-image-picker/android/build/intermediates/library_manifest/debug/AndroidManifest.xml:14:13-47
	android:authorities
		ADDED from [:react-native-image-picker] /var/REACTNATIVE_PROJECTS/NewGitMt/MT_Spa_Masseuse/massagedtodayaspamasseuse/node_modules/react-native-image-picker/android/build/intermediates/library_manifest/debug/AndroidManifest.xml:12:13-60
	android:exported
		ADDED from [:react-native-image-picker] /var/REACTNATIVE_PROJECTS/NewGitMt/MT_Spa_Masseuse/massagedtodayaspamasseuse/node_modules/react-native-image-picker/android/build/intermediates/library_manifest/debug/AndroidManifest.xml:13:13-37
	android:name
		ADDED from [:react-native-image-picker] /var/REACTNATIVE_PROJECTS/NewGitMt/MT_Spa_Masseuse/massagedtodayaspamasseuse/node_modules/react-native-image-picker/android/build/intermediates/library_manifest/debug/AndroidManifest.xml:11:13-56
provider#com.reactnativecommunity.webview.RNCWebViewFileProvider
ADDED from [:react-native-webview] /var/REACTNATIVE_PROJECTS/NewGitMt/MT_Spa_Masseuse/massagedtodayaspamasseuse/node_modules/react-native-webview/android/build/intermediates/library_manifest/debug/AndroidManifest.xml:12:9-20:20
	android:grantUriPermissions
		ADDED from [:react-native-webview] /var/REACTNATIVE_PROJECTS/NewGitMt/MT_Spa_Masseuse/massagedtodayaspamasseuse/node_modules/react-native-webview/android/build/intermediates/library_manifest/debug/AndroidManifest.xml:16:13-47
	android:authorities
		ADDED from [:react-native-webview] /var/REACTNATIVE_PROJECTS/NewGitMt/MT_Spa_Masseuse/massagedtodayaspamasseuse/node_modules/react-native-webview/android/build/intermediates/library_manifest/debug/AndroidManifest.xml:14:13-64
	android:exported
		ADDED from [:react-native-webview] /var/REACTNATIVE_PROJECTS/NewGitMt/MT_Spa_Masseuse/massagedtodayaspamasseuse/node_modules/react-native-webview/android/build/intermediates/library_manifest/debug/AndroidManifest.xml:15:13-37
	android:name
		ADDED from [:react-native-webview] /var/REACTNATIVE_PROJECTS/NewGitMt/MT_Spa_Masseuse/massagedtodayaspamasseuse/node_modules/react-native-webview/android/build/intermediates/library_manifest/debug/AndroidManifest.xml:13:13-83
activity#com.google.android.gms.common.api.GoogleApiActivity
ADDED from [com.google.android.gms:play-services-base:16.0.1] /home/natit/.gradle/caches/transforms-2/files-2.1/195925090d6f93eb2f17e925a19c7179/AndroidManifest.xml:23:9-26:75
	android:exported
		ADDED from [com.google.android.gms:play-services-base:16.0.1] /home/natit/.gradle/caches/transforms-2/files-2.1/195925090d6f93eb2f17e925a19c7179/AndroidManifest.xml:25:13-37
	android:theme
		ADDED from [com.google.android.gms:play-services-base:16.0.1] /home/natit/.gradle/caches/transforms-2/files-2.1/195925090d6f93eb2f17e925a19c7179/AndroidManifest.xml:26:13-72
	android:name
		ADDED from [com.google.android.gms:play-services-base:16.0.1] /home/natit/.gradle/caches/transforms-2/files-2.1/195925090d6f93eb2f17e925a19c7179/AndroidManifest.xml:24:13-79
meta-data#com.google.android.gms.version
ADDED from [com.google.android.gms:play-services-basement:16.0.1] /home/natit/.gradle/caches/transforms-2/files-2.1/b830f2f38b6e2d17f737d37c53c0969e/AndroidManifest.xml:23:9-25:69
	android:value
		ADDED from [com.google.android.gms:play-services-basement:16.0.1] /home/natit/.gradle/caches/transforms-2/files-2.1/b830f2f38b6e2d17f737d37c53c0969e/AndroidManifest.xml:25:13-66
	android:name
		ADDED from [com.google.android.gms:play-services-basement:16.0.1] /home/natit/.gradle/caches/transforms-2/files-2.1/b830f2f38b6e2d17f737d37c53c0969e/AndroidManifest.xml:24:13-58
