<svg width="17" height="10" viewBox="0 0 17 10" fill="none" xmlns="http://www.w3.org/2000/svg">
<path d="M14.1532 1.10975L8.5 6.76298L2.84677 1.10975C2.36711 0.630084 1.58942 0.630084 1.10975 1.10975C0.630084 1.58941 0.630084 2.36711 1.10975 2.84677L7.63149 9.36851C7.87127 9.60829 8.18605 9.72826 8.5 9.72826C8.81395 9.72826 9.12873 9.60829 9.36851 9.36851L15.8903 2.84677C16.3699 2.36711 16.3699 1.58941 15.8903 1.10975C15.4106 0.630084 14.6329 0.630084 14.1532 1.10975Z" fill="#929292" stroke="#929292" stroke-width="0.5"/>
</svg>
