<svg width="22" height="18" viewBox="0 0 22 18" fill="none" xmlns="http://www.w3.org/2000/svg">
<path d="M1.55556 1.55556L9.42865 9.42865C10.2965 10.2965 11.7035 10.2965 12.5713 9.42865L20.4444 1.55556M2.11111 16.5556H19.8889C20.5025 16.5556 21 16.0581 21 15.4444V2.11111C21 1.49746 20.5025 1 19.8889 1H2.11111C1.49746 1 1 1.49746 1 2.11111V15.4444C1 16.0581 1.49746 16.5556 2.11111 16.5556Z" stroke="#3834A5" stroke-width="1.5" stroke-linecap="round" stroke-linejoin="round"/>
</svg>
