<svg width="20" height="17" viewBox="0 0 20 17" fill="none" xmlns="http://www.w3.org/2000/svg">
<path fill-rule="evenodd" clip-rule="evenodd" d="M9.19873 11.5911V15.0625C9.19873 15.3815 9.00934 15.6699 8.71649 15.7966C8.42384 15.9233 8.08384 15.8641 7.85119 15.6458L0.252652 8.51458C0.0914281 8.36335 0 8.15213 0 7.93132C0 7.7103 0.0914281 7.49907 0.252652 7.34785L7.85119 0.216659C8.08384 -0.00150278 8.42384 -0.0608903 8.71649 0.0658438C9.00934 0.192578 9.19873 0.481148 9.19873 0.800126V4.32133C14.1436 4.77603 18.3258 8.30723 19.5491 13.2005L19.9703 14.8848C20.0891 15.3668 19.8428 15.8641 19.3875 16.0619C18.9322 16.2598 18.4005 16.1003 18.1293 15.6843L18.1413 15.7021C16.3781 13.1499 13.4563 11.5911 10.2975 11.5911H9.19873Z" fill="#8E8E8E"/>
</svg>
