<svg width="22" height="22" viewBox="0 0 22 22" fill="none" xmlns="http://www.w3.org/2000/svg">
<path d="M21 11C21 16.5228 16.5228 21 11 21M21 11C21 5.47715 16.5228 1 11 1M21 11H1M11 21C5.47715 21 1 16.5228 1 11M11 21C11 21 15.4444 17.6667 15.4444 11C15.4444 4.33333 11 1 11 1M11 21C11 21 6.55556 17.6667 6.55556 11C6.55556 4.33333 11 1 11 1M1 11C1 5.47715 5.47715 1 11 1" stroke="#3834A5" stroke-width="1.5"/>
</svg>
