<svg width="15" height="3" viewBox="0 0 15 3" fill="none" xmlns="http://www.w3.org/2000/svg">
<path d="M1.41892 0C0.635291 0 0 0.635266 0 1.41892C0 2.20257 0.635291 2.83784 1.41892 2.83784C2.20257 2.83784 2.83784 2.20257 2.83784 1.41892C2.83784 0.635266 2.20257 0 1.41892 0ZM7.5 0C6.71637 0 6.08108 0.635266 6.08108 1.41892C6.08108 2.20257 6.71637 2.83784 7.5 2.83784C8.28365 2.83784 8.91892 2.20257 8.91892 1.41892C8.91892 0.635266 8.28365 0 7.5 0ZM13.5811 0C12.7975 0 12.1622 0.635266 12.1622 1.41892C12.1622 2.20257 12.7975 2.83784 13.5811 2.83784C14.3647 2.83784 15 2.20257 15 1.41892C15 0.635266 14.3647 0 13.5811 0Z" fill="#5D5D5D"/>
</svg>
