<svg width="12" height="12" viewBox="0 0 12 12" fill="none" xmlns="http://www.w3.org/2000/svg">
<path d="M5.99996 11.9999C4.81327 11.9999 3.65323 11.648 2.66654 10.9888C1.67984 10.3295 0.910805 9.3924 0.45668 8.29604C0.00255392 7.19968 -0.116266 5.99328 0.115245 4.8294C0.346757 3.66551 0.918201 2.59642 1.75732 1.7573C2.59643 0.918186 3.66553 0.346741 4.82941 0.11523C5.9933 -0.116281 7.1997 0.00253866 8.29606 0.456664C9.39241 0.91079 10.3295 1.67983 10.9888 2.66652C11.6481 3.65321 12 4.81325 12 5.99994C11.9981 7.59066 11.3653 9.11568 10.2405 10.2405C9.1157 11.3653 7.59067 11.998 5.99996 11.9999ZM5.99996 0.880675C4.98746 0.880675 3.9977 1.18092 3.15584 1.74343C2.31399 2.30594 1.65784 3.10546 1.27037 4.04088C0.882906 4.97631 0.781528 6.00562 0.979056 6.99866C1.17658 7.9917 1.66415 8.90386 2.38009 9.61981C3.09603 10.3357 4.0082 10.8233 5.00124 11.0208C5.99428 11.2184 7.02359 11.117 7.95901 10.7295C8.89444 10.3421 9.69396 9.68591 10.2565 8.84405C10.819 8.00219 11.1192 7.01244 11.1192 5.99994C11.1176 4.64272 10.5778 3.34154 9.61805 2.38184C8.65835 1.42214 7.35718 0.882278 5.99996 0.880675Z" fill="black"/>
<path d="M6.49542 5.72478C6.49542 5.45117 6.27361 5.22937 6.00001 5.22937C5.7264 5.22937 5.50459 5.45117 5.50459 5.72478V8.91744C5.50459 9.19105 5.7264 9.41286 6.00001 9.41286C6.27361 9.41286 6.49542 9.19105 6.49542 8.91744V5.72478Z" fill="black"/>
<path d="M5.99997 4.29359C6.39519 4.29359 6.71557 3.97321 6.71557 3.57799C6.71557 3.18278 6.39519 2.8624 5.99997 2.8624C5.60476 2.8624 5.28438 3.18278 5.28438 3.57799C5.28438 3.97321 5.60476 4.29359 5.99997 4.29359Z" fill="black"/>
</svg>
