<svg width="200" height="29" viewBox="0 0 200 29" fill="none" xmlns="http://www.w3.org/2000/svg">
<path d="M112.909 28.3102C111.869 28.1412 110.819 28.0252 109.795 27.7932C103.186 26.2872 99.29 21.1342 99.396 14.0872C99.515 6.24017 105.091 0.61815 112.921 0.355149C117.112 0.205149 120.702 1.48616 123.79 4.38617C122.666 5.45117 121.576 6.48516 120.426 7.56816C118.03 5.43216 115.211 4.77817 112.122 5.18817C111.013 5.30417 109.938 5.63917 108.958 6.17317C107.979 6.70717 107.115 7.42918 106.416 8.29818C103.506 11.9252 103.794 17.8332 106.935 21.0282C109.823 23.9632 116.266 24.7862 120.598 20.9562L123.978 24.4012C121.718 26.5052 118.824 27.8002 115.75 28.0852C115.349 28.1322 114.951 28.2262 114.55 28.2982L112.909 28.3102Z" fill="#262166"/>
<path d="M199.997 27.7022H195.274V25.1002C195.274 22.7692 195.274 20.4412 195.274 18.1152C195.274 14.7292 193.601 12.7212 190.754 12.6872C187.757 12.6522 185.671 14.8452 185.633 18.1372C185.599 20.9742 185.633 23.8182 185.633 26.6592C185.633 26.9292 185.608 27.2012 185.589 27.5492H181.054V8.89017H185.163C185.263 9.60417 185.367 10.3662 185.492 11.2642C185.805 11.0302 186.053 10.8762 186.266 10.6852C190.892 6.52916 198.826 8.38917 199.891 15.6682C199.975 16.1142 200.011 16.5682 199.997 17.0222V27.7022Z" fill="#262166"/>
<path d="M96.1679 27.5682H74.3359C74.3359 24.6112 74.1639 21.7042 74.3949 18.8292C74.5579 16.7962 75.9299 15.3022 77.7279 14.2902C79.4179 13.3752 81.2879 12.8412 83.2059 12.7242C84.7729 12.5932 86.3569 12.5932 87.9049 12.3332C89.8969 12.0012 90.9619 10.9112 91.1179 9.37919C91.2839 7.75318 90.2819 6.19018 88.5159 5.47918C86.4419 4.60418 84.1109 4.55718 82.0039 5.34819C80.7509 5.81419 79.7549 6.61918 79.3789 8.01918C79.3319 8.14518 79.2549 8.25719 79.1549 8.34719C79.0559 8.43619 78.9359 8.50019 78.8059 8.53319C77.3399 8.57719 75.8739 8.55819 74.3269 8.55819C74.2999 7.43118 74.5499 6.31519 75.0539 5.30719C75.5579 4.29818 76.3009 3.42817 77.2179 2.77317C78.7909 1.60216 80.6529 0.880174 82.6049 0.684174C85.7749 0.314173 88.8909 0.558167 91.8079 2.01517C95.9859 4.09818 97.5049 9.57619 95.0019 13.5352C94.4999 14.3172 93.8399 14.9862 93.0649 15.4982C92.2889 16.0102 91.4149 16.3542 90.4979 16.5082C88.8629 16.8212 87.1779 16.8992 85.5179 17.1002C84.2999 17.2472 83.0499 17.2972 81.8779 17.6202C79.9139 18.1582 79.2379 19.1862 79.2349 21.2252V22.9852H96.1709L96.1679 27.5682Z" fill="#262166"/>
<path d="M163.287 11.3431C163.372 10.4031 163.438 9.66712 163.51 8.87812H167.876V27.5612H163.557C163.481 26.7312 163.409 25.9642 163.337 25.1752C162.52 25.8422 161.825 26.5872 160.982 27.0702C155.591 30.1422 148.653 26.9542 147.463 20.7901C147.169 19.1771 147.153 17.5271 147.416 15.9101C148.127 11.4711 151.607 8.59911 156.102 8.39211C158.877 8.26411 161.326 8.82812 163.287 11.3431ZM151.877 18.1961C151.877 21.5981 154.213 23.9692 157.571 23.9882C160.847 24.0062 163.268 21.5161 163.243 18.1521C163.218 14.7881 160.854 12.4391 157.574 12.4581C154.138 12.4731 151.87 14.7601 151.877 18.1961Z" fill="#262166"/>
<path d="M125.617 0.906128H130.168V11.2581C130.365 11.1361 130.552 11.0001 130.729 10.8511C133.191 8.27314 136.198 8.07014 139.349 9.05014C142.328 9.99015 143.715 12.4011 143.875 15.2862C144.101 19.3392 143.931 23.4112 143.931 27.5522H139.509C139.49 27.2392 139.449 26.9572 139.449 26.6662C139.449 23.9282 139.449 21.1902 139.449 18.4532C139.449 18.1122 139.449 17.7702 139.449 17.4262C139.377 14.5811 137.93 12.9592 135.308 12.7742C134.115 12.7172 132.945 13.1122 132.03 13.8802C131.115 14.6482 130.524 15.7332 130.375 16.9182C130.237 18.3462 130.184 19.7812 130.215 21.2162C130.193 23.2982 130.215 25.3812 130.215 27.5462H125.617V0.906128Z" fill="#262166"/>
<path d="M176.672 27.5652H172.124V8.82812H176.672V27.5652Z" fill="#262166"/>
<path d="M65.3242 8.79907H69.8252V27.5361H65.3242V8.79907Z" fill="#262166"/>
<path d="M64.8199 3.3872C64.8379 1.80219 65.9409 0.765197 67.5919 0.778197C69.2419 0.790197 70.3389 1.8712 70.3389 3.4372C70.3389 5.0032 69.1329 6.15621 67.4909 6.11821C65.8499 6.08121 64.7979 4.9782 64.8199 3.3872Z" fill="#262166"/>
<path d="M171.642 3.46214C171.642 1.86813 172.716 0.793125 174.345 0.778125C176.024 0.762125 177.192 1.87413 177.164 3.46813C177.145 5.00314 175.977 6.11813 174.382 6.11813C172.788 6.11813 171.654 5.03714 171.642 3.46214Z" fill="#262166"/>
<path d="M24.5862 0.179142C25.9425 0.289142 27.258 0.756149 28.5203 1.23815C33.7074 3.22715 37.2906 8.33316 37.3126 13.6102C37.3126 15.3302 36.2726 16.5142 34.7159 16.5612C33.1591 16.6082 32.0629 15.5022 31.969 13.7582C31.7184 9.02816 28.0755 5.52616 23.3458 5.50116C20.199 5.48216 17.0521 5.48216 13.9053 5.50116C9.1725 5.53216 5.34799 9.29416 5.33239 13.9112C5.31359 18.5752 9.1505 22.3492 13.946 22.3842C15.4181 22.3842 16.8903 22.3842 18.3593 22.3842C20.1165 22.4062 21.2942 23.4582 21.3161 24.9872C21.3381 26.5152 20.1353 27.7062 18.3343 27.6552C15.8128 27.5902 13.2444 27.6842 10.7856 27.2232C5.25409 26.1862 1.07558 21.4942 0.151575 15.9472C-0.0505251 14.6492 -0.0505251 13.3272 0.151575 12.0292C1.22908 6.16516 4.66519 2.44714 10.3157 0.715138C11.0843 0.453138 11.8778 0.272145 12.6837 0.173145C15.7815 -0.108856 22.3404 -0.00185885 24.5862 0.179142Z" fill="#BE060A"/>
<path d="M32.3925 28.3102C31.5631 28.1462 30.7434 27.9372 29.9368 27.6842C24.4085 26.0052 20.4806 20.7931 20.5151 15.2301C20.5151 13.6481 21.5706 12.5201 23.0741 12.4741C23.4247 12.4571 23.7751 12.5111 24.1043 12.6331C24.4335 12.7551 24.7349 12.9411 24.9906 13.1821C25.2463 13.4221 25.451 13.7121 25.5926 14.0331C25.7342 14.3541 25.8097 14.7001 25.8148 15.0511C26.128 19.9031 29.4388 23.0452 34.3 23.0572C37.5325 23.1112 40.1855 23.1142 43.1267 23.0572C49.0779 22.9162 52.8807 16.8741 50.2777 11.6371C48.9151 8.88712 46.6222 7.34012 43.5339 7.14912C41.9302 7.04812 40.3171 7.14913 38.7102 7.10213C36.928 7.06113 35.8286 6.01512 35.8442 4.43311C35.8442 3.14311 36.7839 1.90811 38.0556 1.92711C40.8151 1.94311 43.6498 1.79311 46.3153 2.36011C52.5327 3.67811 56.6898 9.44513 56.4107 15.7871C56.1407 21.8582 51.3207 27.1322 45.1783 28.1132C43.2739 28.4172 33.8459 28.5702 32.3925 28.3102Z" fill="#262166"/>
</svg>
