<svg width="14" height="14" viewBox="0 0 14 14" fill="none" xmlns="http://www.w3.org/2000/svg">
<path d="M9.53029 5.53033C9.82318 5.23744 9.82318 4.76256 9.53029 4.46967C9.23739 4.17678 8.76252 4.17678 8.46963 4.46967L9.53029 5.53033ZM4.46963 8.46967C4.17674 8.76256 4.17674 9.23743 4.46963 9.53033C4.76253 9.82322 5.2374 9.82322 5.53029 9.53033L4.46963 8.46967ZM5.53037 4.46967C5.23748 4.17678 4.76261 4.17678 4.46971 4.46967C4.17682 4.76256 4.17682 5.23744 4.46971 5.53033L5.53037 4.46967ZM8.46971 9.53033C8.7626 9.82322 9.23748 9.82322 9.53037 9.53033C9.82326 9.23743 9.82326 8.76256 9.53037 8.46967L8.46971 9.53033ZM8.46963 4.46967L4.46963 8.46967L5.53029 9.53033L9.53029 5.53033L8.46963 4.46967ZM4.46971 5.53033L8.46971 9.53033L9.53037 8.46967L5.53037 4.46967L4.46971 5.53033ZM12.25 7C12.25 9.8995 9.8995 12.25 7 12.25V13.75C10.7279 13.75 13.75 10.7279 13.75 7H12.25ZM7 12.25C4.10051 12.25 1.75 9.8995 1.75 7H0.25C0.25 10.7279 3.27208 13.75 7 13.75V12.25ZM1.75 7C1.75 4.10051 4.10051 1.75 7 1.75V0.25C3.27208 0.25 0.25 3.27208 0.25 7H1.75ZM7 1.75C9.8995 1.75 12.25 4.10051 12.25 7H13.75C13.75 3.27208 10.7279 0.25 7 0.25V1.75Z" fill="#C2C2C2"/>
</svg>
