{
    "txtYouDidIt": "Du gjorde det!",
    "txtCategoryLegs": "Ben",
    "txtSettings": "Inställningar",
    "txtEmailCouldNotBeSent": "E-posten kunde inte skickas",
    "txtCategoryFullBody": "Hela kroppen",
    "txtDuration": "Varaktighet",
    "txtNotificationInfoTitle": "Daglig avisering",
    "txtAboutFeeel": "Om Feeel",
    "txtTheme": "Tema",
    "txtThemeLight": "Ljust",
    "txtSourceCode": "Källkod",
    "txtStrength": "Styrka",
    "txtLanguage": "Språk",
    "btnDelete": "Ta bort",
    "btnEdit": "Redigera",
    "btnOK": "OK",
    "btnMoreInfo": "Mer info",
    "btnDone": "Klart",
    "btnCancel": "Avbryt",
    "btnTakeAPhoto": "Ta ett foto",
    "btnAddPhotoFromGallery": "Lägg till foto från galleriet",
    "btnDisableTTS": "Ljud istället för röst",
    "txtSecondsLeft5plus": "%d sekunder kvar",
    "txtSubmitNewExercise": "Bidra",
    "txtImageMissing": "Bild saknas",
    "txtNotificationTitle": "Dags att ta på sig träningskläderna!",
    "txtThemeDark": "Mörkt",
    "txtNotificationInfoDesc": "En daglig påminnelse om att träna"
}
