%YAML 1.1
%TAG !u! tag:unity3d.com,2011:
--- !u!114 &11400000
MonoBehaviour:
  m_ObjectHideFlags: 0
  m_CorrespondingSourceObject: {fileID: 0}
  m_PrefabInstance: {fileID: 0}
  m_PrefabAsset: {fileID: 0}
  m_GameObject: {fileID: 0}
  m_Enabled: 1
  m_EditorHideFlags: 0
  m_Script: {fileID: 11500000, guid: e3ba8fb18ddbf4d66ae62d1545f49317, type: 3}
  m_Name: Item_19_Map
  m_EditorClassIdentifier: 
  itemName: Map
  itemDes: Record some treasure in this game
  itemSprite: {fileID: 21300000, guid: e2d341e5e80a14498bdbcd0fffb7f403, type: 3}
  itemPrice: 880
