<?xml version="1.0" encoding="UTF-8" standalone="no"?>
<!-- Created with Inkscape (http://www.inkscape.org/) -->

<svg
   xmlns:dc="http://purl.org/dc/elements/1.1/"
   xmlns:cc="http://creativecommons.org/ns#"
   xmlns:rdf="http://www.w3.org/1999/02/22-rdf-syntax-ns#"
   xmlns:svg="http://www.w3.org/2000/svg"
   xmlns="http://www.w3.org/2000/svg"
   xmlns:xlink="http://www.w3.org/1999/xlink"
   xmlns:sodipodi="http://sodipodi.sourceforge.net/DTD/sodipodi-0.dtd"
   xmlns:inkscape="http://www.inkscape.org/namespaces/inkscape"
   sodipodi:docname="_tutorial-header.svg"
   inkscape:version="0.92pre1_64bit r15016"
   sodipodi:version="0.32"
   id="svg2708"
   height="1052.3622"
   width="256pt"
   version="1.1"
   viewBox="0 0 341.33333 1052.3622">
  <defs
     id="defs3">
    <linearGradient
       id="linearGradient841">
      <stop
         id="stop842"
         offset="0.00000000"
         style="stop-color:#0082ab;stop-opacity:1;" />
      <stop
         id="stop843"
         offset="1"
         style="stop-color:white;stop-opacity:0;" />
    </linearGradient>
    <linearGradient
       y2="0.91666669"
       x2="0.5161857"
       y1="0.16666391"
       x1="0.5161857"
       id="linearGradient1657"
       xlink:href="#linearGradient841" />
    <filter
       id="filter48"
       height="1.2"
       width="1.2"
       y="-0.1"
       x="-0.1"
       inkscape:label="Drop shadow, custom"
       style="color-interpolation-filters:sRGB">
      <feFlood
         id="feFlood50"
         flood-opacity="0.686275"
         flood-color="rgb(255,255,255)"
         result="flood" />
      <feComposite
         id="feComposite52"
         in2="SourceGraphic"
         in="flood"
         operator="in"
         result="composite1" />
      <feGaussianBlur
         id="feGaussianBlur54"
         in="composite1"
         stdDeviation="20"
         result="blur" />
      <feOffset
         id="feOffset56"
         dx="0"
         dy="0"
         result="offset" />
      <feComposite
         id="feComposite58"
         in2="offset"
         in="SourceGraphic"
         operator="over"
         result="composite2" />
    </filter>
  </defs>
  <sodipodi:namedview
     inkscape:window-y="25"
     inkscape:window-x="0"
     inkscape:window-height="947"
     inkscape:window-width="1235"
     inkscape:current-layer="layer1"
     inkscape:document-units="px"
     inkscape:cy="943.37247"
     inkscape:cx="42.359864"
     inkscape:zoom="2.0364078"
     inkscape:pageshadow="2"
     inkscape:pageopacity="0.0"
     borderopacity="1.0"
     bordercolor="#666666"
     pagecolor="#ffffff"
     id="base"
     showgrid="false"
     inkscape:window-maximized="0" />
  <metadata
     id="metadata4">
    <rdf:RDF>
      <cc:Work
         rdf:about="">
        <dc:format>image/svg+xml</dc:format>
        <dc:type
           rdf:resource="http://purl.org/dc/dcmitype/StillImage" />
      </cc:Work>
    </rdf:RDF>
  </metadata>
  <g
     id="layer1"
     inkscape:groupmode="layer"
     inkscape:label="Layer 1">
    <rect
       rx="0.0000000"
       ry="6.1828303"
       y="0.27752987"
       x="0.1821477"
       height="69.247704"
       width="319.89233"
       id="rect582"
       style="font-size:12px;fill:url(#linearGradient1657);fill-opacity:1;fill-rule:evenodd;stroke:none;stroke-width:3.06115007" />
    <path
       id="path93"
       d="m 150.96825,4.9606428 h -9.5795 v 0.612928 h 0.28691 c 1.29108,0 1.43454,0.065212 1.43454,0.612929 v 0.3781941 6.2075221 0.378193 c 0,0.547725 -0.14346,0.612929 -1.43454,0.612929 h -0.28691 v 0.612929 h 9.78671 l 0.31879,-3.481955 h -0.70133 c -0.20721,0.912868 -0.57381,1.721416 -0.95636,2.099602 -0.49411,0.521645 -1.40265,0.769424 -2.74155,0.769424 h -1.05199 c -0.47817,0 -0.87666,-0.07825 -1.02011,-0.195619 -0.11158,-0.07825 -0.12752,-0.156487 -0.12752,-0.430354 V 9.8119059 h 0.31879 c 0.9723,0 1.37077,0.078248 1.68956,0.3521061 0.41442,0.33907 0.57381,0.75638 0.6057,1.525805 h 0.74914 V 7.4123579 h -0.74914 c -0.0797,1.278018 -0.71728,1.786619 -2.2315,1.786619 h -0.38255 V 6.2256238 c 0,-0.560761 0.14346,-0.652053 1.00417,-0.652053 h 0.82885 c 1.40265,0 2.08804,0.117372 2.62998,0.482522 0.52599,0.339062 0.90853,1.0693631 1.14763,2.2430531 h 0.68538 z M 129.81685,10.1901 h 1.80114 c 1.43453,0 2.18367,-0.09129 2.82124,-0.3390701 1.1317,-0.443398 1.76927,-1.278018 1.76927,-2.308264 0,-0.991116 -0.55788,-1.7474961 -1.60987,-2.1778501 -0.62164,-0.260822 -1.60987,-0.404273 -2.70968,-0.404273 h -5.57874 v 0.612928 h 0.28691 c 1.29108,0 1.43453,0.065212 1.43453,0.612929 v 0.3781941 6.2075221 0.378193 c 0,0.547725 -0.14345,0.612929 -1.43453,0.612929 h -0.28691 v 0.612929 h 5.3556 v -0.612929 h -0.41443 c -1.29108,0 -1.43453,-0.0652 -1.43453,-0.612929 v -0.378193 z m 0,-0.6129291 V 6.2386678 c 0,-0.599885 0.0956,-0.665097 0.9723,-0.665097 h 1.02011 c 1.65768,0 2.4387,0.639017 2.4387,2.0213621 0,1.343222 -0.8129,1.982238 -2.50246,1.982238 z M 115.94969,4.7780748 h -0.66945 l -3.66604,7.6029102 c -0.31878,0.678133 -0.38253,0.769424 -0.62162,0.978079 -0.25503,0.247779 -0.70133,0.404274 -1.13169,0.404274 h -0.0638 v 0.612929 h 4.2239 v -0.612929 h -0.31878 c -0.86072,0 -1.29108,-0.247779 -1.29108,-0.743336 0,-0.156495 0.0478,-0.33907 0.14345,-0.547725 l 0.526,-1.147611 h 4.22391 l 0.86072,1.747496 c 0.0956,0.195618 0.12751,0.286902 0.12751,0.352106 0,0.208655 -0.39848,0.33907 -0.98823,0.33907 h -0.66945 v 0.612929 h 4.94116 v -0.612929 h -0.22314 c -0.79697,0 -0.9723,-0.104328 -1.3389,-0.834628 z m -0.78103,2.1387261 1.80114,3.7036521 h -3.5704 z M 104.17057,4.8693588 h -0.60569 l -0.63757,0.769424 c -1.13169,-0.67814 -1.75332,-0.873752 -2.82125,-0.873752 -1.546122,0 -2.821262,0.508601 -3.905132,1.56492 -1.020117,0.9911231 -1.498287,2.0865661 -1.498287,3.4297951 0,2.8038141 2.247437,4.8121321 5.387479,4.8121321 2.55028,0 4.17609,-1.225858 4.54269,-3.416743 L 103.88367,11.0508 c -0.1594,0.691176 -0.35067,1.160654 -0.63757,1.551884 -0.65352,0.899832 -1.67363,1.356265 -2.96471,1.356265 -2.359022,0 -3.474772,-1.343221 -3.474772,-4.1470431 0,-1.473637 0.23909,-2.464752 0.78103,-3.247212 0.49411,-0.7303001 1.482337,-1.1867341 2.502472,-1.1867341 1.11575,0 2.10398,0.482514 2.70968,1.3171421 0.30284,0.430354 0.54193,0.938955 0.90854,1.943114 h 0.70132 z m -15.955216,0.013044 h -0.589747 l -0.63757,0.78246 c -0.74914,-0.586849 -1.76926,-0.899832 -2.900937,-0.899832 -2.08804,0 -3.490697,1.095443 -3.490697,2.7255741 0,1.42147 0.860717,2.12569 3.203797,2.6212471 l 1.514217,0.312983 c 1.17951,0.247779 1.29108,0.273859 1.62581,0.482514 0.47818,0.299946 0.7332,0.7303 0.7332,1.238901 0,0.521638 -0.23909,0.951992 -0.71726,1.304105 -0.526,0.378187 -1.052,0.521638 -1.92866,0.521638 -1.179497,0 -2.024277,-0.299946 -2.773417,-0.978079 -0.66946,-0.612929 -1.00418,-1.225858 -1.243267,-2.230009 h -0.68539 l 0.06376,3.71669 h 0.62163 l 0.717257,-0.886789 c 1.06794,0.71725 1.96053,0.978072 3.347247,0.978072 2.34308,0 3.841367,-1.121523 3.841367,-2.869025 0,-0.808541 -0.33473,-1.499717 -0.956357,-1.9952751 -0.43036,-0.339069 -1.05199,-0.560761 -2.32714,-0.821584 L 83.9277,8.5338879 c -1.41859,-0.299946 -2.08804,-0.808548 -2.08804,-1.604044 0,-0.9128751 0.90854,-1.5388471 2.26338,-1.5388471 1.115737,0 2.024277,0.391237 2.661857,1.1345731 0.46224,0.534682 0.74914,1.082407 0.95635,1.747496 h 0.685387 z M 66.665476,10.111852 V 6.5646939 6.1864998 c 0,-0.547717 0.143459,-0.612929 1.434538,-0.612929 h 0.302847 v -0.612928 h -5.244029 v 0.612928 h 0.286912 c 1.291074,0 1.434532,0.065212 1.434532,0.612929 v 0.3781941 6.2075221 0.378193 c 0,0.547725 -0.143458,0.612929 -1.434532,0.612929 h -0.286912 v 0.612929 h 5.244029 v -0.612929 h -0.302847 c -1.291079,0 -1.434538,-0.0652 -1.434538,-0.612929 v -0.378193 -1.656205 l 1.848957,-1.5258041 2.773438,3.3254601 c 0.255025,0.31299 0.318782,0.417317 0.318782,0.547725 0,0.208655 -0.302842,0.299946 -1.08387,0.299946 h -0.494121 v 0.612929 h 5.451234 v -0.612929 h -0.30284 c -0.87666,0 -1.09981,-0.09129 -1.562058,-0.652053 L 69.757696,8.5599679 72.132644,6.6168539 C 72.897731,5.9517648 73.870028,5.5735708 74.826396,5.5735708 V 4.9606428 H 69.91709 v 0.612928 h 0.398484 c 0.733201,0 1.036053,0.117372 1.036053,0.391231 0,0.182575 -0.318787,0.5607681 -0.781028,0.9389551 z M 48.845329,4.9606428 H 45.56184 v 0.612928 h 0.398479 c 0.812903,0 1.179512,0.104328 1.466413,0.430354 v 5.5424402 c 0,1.786619 -0.318782,2.164806 -1.848952,2.216973 v 0.612929 h 4.54273 v -0.612929 c -1.514266,-0.05217 -1.833059,-0.430354 -1.833059,-2.216973 V 6.7081449 l 7.108957,7.8506971 h 0.669455 V 7.7905439 c 0,-1.7866191 0.318788,-2.1648051 1.848957,-2.2169731 v -0.612928 h -4.542697 v 0.612928 c 1.514229,0.052168 1.833011,0.430354 1.833011,2.2169731 V 11.885427 Z M 38.484798,6.5646939 V 6.1864998 c 0,-0.547717 0.143459,-0.612929 1.418596,-0.612929 h 0.318787 v -0.612928 h -5.275899 v 0.612928 h 0.318788 c 1.291076,0 1.434534,0.065212 1.434534,0.612929 v 0.3781941 6.2075221 0.378193 c 0,0.547725 -0.143458,0.612929 -1.434534,0.612929 h -0.318788 v 0.612929 h 5.275899 v -0.612929 h -0.318787 c -1.275137,0 -1.418596,-0.0652 -1.418596,-0.612929 v -0.378193 z"
       style="fill:#ffffff;fill-opacity:1;stroke-width:1.00000003pt"
       inkscape:connector-curvature="0" />
    <path
       sodipodi:nodetypes="cccccccccccccccccccccccccccccccccccccccccccccccccccccccccccccccccccccccccccccccccccccccccccccccccccccccccccccccccccccccccccccccccccccccccccccccccccccccccccccccccccccccccccccccccccccccccccccccccc"
       id="path1124"
       d="m 139.23126,12.451027 h 1.49925 l -0.92097,3.019917 h 1.69201 l -0.14993,0.492611 h -1.69201 l -0.40694,1.242235 c -0.34268,1.056614 -0.70679,2.334546 -1.09231,3.833796 -0.38552,1.484971 -0.57828,2.348824 -0.57828,2.59156 0,0.328407 0.14993,0.49261 0.44978,0.49261 0.5283,0 1.1637,-0.728207 1.90618,-2.184621 0.0714,-0.157064 0.17849,-0.349825 0.32127,-0.578282 l 0.42836,0.214179 c -0.55686,1.156564 -0.97094,1.899049 -1.24224,2.227456 -0.58542,0.69965 -1.20653,1.049475 -1.86335,1.049475 -0.44263,0 -0.7996,-0.135646 -1.07089,-0.406939 -0.27129,-0.285571 -0.40694,-0.649675 -0.40694,-1.09231 0,-0.3998 0.0642,-0.849575 0.19276,-1.349325 0.14279,-0.556864 0.5997,-2.156064 1.37074,-4.797599 l 0.36411,-1.242235 h -1.71343 l 0.17134,-0.492611 h 1.71343 z m 10.76611,2.848574 h 1.60634 c -1.35647,4.326406 -2.0347,7.067891 -2.0347,8.224455 0,0.428357 0.11423,0.642536 0.34269,0.642536 0.27129,0 0.59256,-0.257014 0.9638,-0.771043 0.38552,-0.528307 0.72107,-1.177982 1.00664,-1.949024 l 0.47119,0.19276 c -0.75676,2.141786 -1.69915,3.212678 -2.82715,3.212678 -0.97095,0 -1.45642,-0.542585 -1.45642,-1.627757 0,-0.285571 0.0357,-0.749624 0.10709,-1.39216 -0.55686,0.856714 -1.00664,1.477832 -1.34932,1.863353 -0.68538,0.771043 -1.46356,1.156564 -2.33455,1.156564 -0.51403,0 -0.94239,-0.178482 -1.28507,-0.535446 -0.34269,-0.356964 -0.51403,-0.7996 -0.51403,-1.327907 0,-0.257014 0.21418,-1.120867 0.64254,-2.59156 l 0.38552,-1.327907 c 0.42835,-1.470692 0.64253,-2.377381 0.64253,-2.720067 0,-0.271293 -0.0928,-0.406939 -0.27843,-0.406939 -0.5997,0 -1.39216,0.942385 -2.37738,2.827156 l -0.47119,-0.235596 c 1.08517,-2.227457 2.17748,-3.341185 3.27693,-3.341185 0.3998,0 0.72107,0.149925 0.9638,0.449775 0.25702,0.29985 0.38552,0.692511 0.38552,1.177982 0,0.5997 -0.14278,1.349325 -0.42835,2.248874 l -0.57829,1.820518 c -0.47119,1.484971 -0.70679,2.348824 -0.70679,2.59156 0,0.49975 0.25702,0.749625 0.77105,0.749625 0.45691,0 0.95666,-0.278433 1.49925,-0.835297 0.55686,-0.556864 1.05661,-1.29221 1.49925,-2.206038 0.67109,-1.385022 1.3636,-3.348324 2.07753,-5.88991 z m 6.33262,-2.848574 h 1.49925 l -0.92097,3.019917 h 1.69201 l -0.14993,0.492611 h -1.69201 l -0.40694,1.242235 c -0.34268,1.056614 -0.70679,2.334546 -1.09231,3.833796 -0.38552,1.484971 -0.57828,2.348824 -0.57828,2.59156 0,0.328407 0.14993,0.49261 0.44978,0.49261 0.5283,0 1.1637,-0.728207 1.90618,-2.184621 0.0714,-0.157064 0.17849,-0.349825 0.32127,-0.578282 l 0.42836,0.214179 c -0.55686,1.156564 -0.97094,1.899049 -1.24224,2.227456 -0.58542,0.69965 -1.20653,1.049475 -1.86335,1.049475 -0.44263,0 -0.7996,-0.135646 -1.07089,-0.406939 -0.27129,-0.285571 -0.40694,-0.649675 -0.40694,-1.09231 0,-0.3998 0.0643,-0.849575 0.19276,-1.349325 0.14279,-0.556864 0.5997,-2.156064 1.37074,-4.797599 l 0.36411,-1.242235 h -1.71343 l 0.17134,-0.492611 h 1.71343 z m 7.41066,3.234096 c -1.02806,-0.05712 -1.94189,0.970942 -2.74149,3.08417 -0.55686,1.470693 -0.83529,2.79146 -0.83529,3.962303 0,1.085171 0.47833,1.627757 1.43499,1.627757 0.77105,0 1.44214,-0.492611 2.01328,-1.477832 0.37124,-0.628257 0.69251,-1.456414 0.96381,-2.484471 0.27129,-1.042335 0.42835,-2.020417 0.47119,-2.934246 0.0571,-1.128006 -0.37838,-1.720567 -1.30649,-1.777681 z m -0.0214,-0.492611 c 0.84244,0 1.52781,0.335547 2.05612,1.006639 0.5283,0.656814 0.79246,1.513528 0.79246,2.570142 0,1.29935 -0.46406,2.612978 -1.39216,3.940885 -0.9995,1.427857 -2.21318,2.141785 -3.64104,2.141785 -0.87099,0 -1.58492,-0.29985 -2.14178,-0.89955 -0.55687,-0.613978 -0.8353,-1.39216 -0.8353,-2.334545 0,-1.5992 0.58542,-3.112728 1.75626,-4.540585 1.02806,-1.256514 2.16321,-1.884771 3.40544,-1.884771 z m 4.17653,3.384021 -0.44978,-0.192761 c 0.37124,-0.913828 0.82102,-1.670592 1.34933,-2.270292 0.5283,-0.613979 0.9995,-0.920968 1.41357,-0.920968 0.92811,0 1.39216,0.678232 1.39216,2.034696 0,0.242736 -0.0428,0.728207 -0.1285,1.456414 0.98522,-2.327407 2.03469,-3.49111 3.14842,-3.49111 0.31413,0 0.57828,0.09995 0.79246,0.29985 0.22846,0.185621 0.34269,0.414079 0.34269,0.685371 0,0.228457 -0.0785,0.421218 -0.2356,0.578282 -0.15706,0.157065 -0.34982,0.235597 -0.57828,0.235597 -0.48547,0 -0.72821,-0.278432 -0.72821,-0.835296 0,-0.157065 -0.05,-0.235597 -0.14992,-0.235597 -0.14279,0 -0.34269,0.128507 -0.5997,0.385521 -0.25702,0.257015 -0.47833,0.556865 -0.66396,0.89955 -0.57114,1.028057 -1.49925,3.483971 -2.78432,7.367741 h -1.60634 c 0.6711,-2.013278 1.10659,-3.48397 1.30649,-4.412077 0.31413,-1.456414 0.4712,-2.513028 0.4712,-3.169842 0,-0.69965 -0.11423,-1.049475 -0.34269,-1.049475 -0.1999,0 -0.49261,0.257014 -0.87813,0.771043 -0.37124,0.514028 -0.72821,1.135146 -1.07089,1.863353 z m 12.10109,-8.224455 c 0.27129,0 0.49975,0.09995 0.68537,0.29985 0.1999,0.185621 0.29985,0.414078 0.29985,0.685371 0,0.271293 -0.1,0.506889 -0.29985,0.706789 -0.18562,0.1999 -0.41408,0.29985 -0.68537,0.29985 -0.27129,0 -0.50689,-0.09995 -0.70679,-0.29985 -0.1999,-0.1999 -0.29985,-0.435496 -0.29985,-0.706789 0,-0.271293 0.1,-0.49975 0.29985,-0.685371 0.1999,-0.1999 0.4355,-0.29985 0.70679,-0.29985 z m 0.32127,11.244372 0.42835,0.214178 c -0.95666,2.027557 -1.999,3.041335 -3.127,3.041335 -0.3998,0 -0.72821,-0.142785 -0.98522,-0.428357 -0.25702,-0.29985 -0.38552,-0.678232 -0.38552,-1.135146 0,-0.314128 0.0428,-0.606839 0.1285,-0.878132 0.0857,-0.271293 0.32127,-0.878132 0.70679,-1.820517 l 0.81388,-1.949025 c 0.48547,-1.156564 0.72821,-1.934746 0.72821,-2.334546 0,-0.285571 -0.12137,-0.428357 -0.36411,-0.428357 -0.49975,0 -1.18512,0.785322 -2.05611,2.355964 l -0.42836,-0.257014 c 1.01378,-1.856214 1.98472,-2.784321 2.91283,-2.784321 0.38552,0 0.69965,0.142786 0.94239,0.428357 0.24273,0.285572 0.3641,0.656814 0.3641,1.113729 0,0.542585 -0.29271,1.549224 -0.87813,3.019916 l -0.89955,2.248875 c -0.37125,0.928107 -0.55687,1.534946 -0.55687,1.820517 0,0.257015 0.11423,0.385522 0.34269,0.385522 0.27129,0 0.62112,-0.242736 1.04947,-0.728207 0.44264,-0.49975 0.86386,-1.128007 1.26366,-1.884771 z m 7.26069,-5.868492 c -0.42835,-0.02856 -0.9281,0.221318 -1.49925,0.749625 -0.55686,0.514029 -1.07803,1.206539 -1.5635,2.077532 -0.97094,1.727706 -1.45641,3.176981 -1.45641,4.347824 0,0.913828 0.35696,1.370742 1.07089,1.370742 1.15656,0 2.24887,-1.135146 3.27693,-3.405438 0.69965,-1.542086 1.09231,-2.820017 1.17798,-3.833796 0.0286,-0.371242 -0.05,-0.678232 -0.23559,-0.920967 -0.18563,-0.242736 -0.44264,-0.371243 -0.77105,-0.385522 z m 1.7991,-0.257014 h 1.52067 c -0.35696,0.956664 -0.84244,2.355964 -1.45641,4.197899 -0.65682,1.984721 -0.98523,3.334046 -0.98523,4.047974 0,0.29985 0.11423,0.449775 0.34269,0.449775 0.49975,0 1.1994,-0.970943 2.09895,-2.912828 l 0.47119,0.192761 c -0.5997,1.299349 -1.11373,2.19176 -1.54208,2.677231 -0.42836,0.485472 -0.91383,0.728207 -1.45642,0.728207 -0.88527,0 -1.3279,-0.3998 -1.3279,-1.199399 0,-0.214179 0.0642,-0.649675 0.19276,-1.306489 -1.01378,1.684871 -2.09895,2.527306 -3.25552,2.527306 -0.7282,0 -1.32076,-0.242736 -1.77768,-0.728207 -0.45691,-0.485471 -0.68537,-1.120867 -0.68537,-1.906189 0,-1.627756 0.64254,-3.205538 1.92761,-4.733345 1.28507,-1.542085 2.60584,-2.313128 3.9623,-2.313128 0.71393,0 1.25651,0.392661 1.62776,1.177982 z m 4.3979,-4.690509 0.12851,-0.492611 c 1.07089,-0.04284 2.28457,-0.114228 3.64103,-0.214178 -0.11422,0.385521 -0.1999,0.663953 -0.25701,0.835296 -0.15706,0.442635 -0.37838,1.113728 -0.66395,2.013278 l -1.73485,5.654313 c -0.82816,2.698649 -1.24223,4.354963 -1.24223,4.968941 0,0.442636 0.1285,0.663954 0.38552,0.663954 0.35696,0 0.7996,-0.385522 1.3279,-1.156564 0.2713,-0.3998 0.57829,-0.928107 0.92097,-1.584921 l 0.49261,0.235596 c -0.42836,0.785321 -0.74962,1.342185 -0.9638,1.670592 -0.65682,0.985222 -1.40644,1.477832 -2.24888,1.477832 -0.42835,0 -0.77818,-0.157064 -1.04947,-0.471193 -0.27129,-0.314128 -0.40694,-0.713928 -0.40694,-1.199399 0,-0.5997 0.24274,-1.692011 0.72821,-3.276932 l 1.88477,-6.146923 c 0.41408,-1.356464 0.62112,-2.120367 0.62112,-2.29171 0,-0.257014 -0.0999,-0.428357 -0.29985,-0.514029 -0.1999,-0.09995 -0.62112,-0.157064 -1.26366,-0.171342 z"
       style="fill:#ffffff;stroke-width:1.00000003pt"
       inkscape:connector-curvature="0" />
    <use
       style="opacity:0.0786517"
       height="1052.3622"
       width="320"
       transform="matrix(2.39436,0,0,2.331219,-82.96365,-14.49494)"
       id="use1325"
       xlink:href="#path93"
       y="0"
       x="0" />
    <g
       id="g839"
       transform="matrix(0.058837,0,0,0.058837,-4.7689003,-3.296641)"
       style="filter:url(#filter48)">
      <path
         style="font-size:12px;fill:#ffffff;fill-rule:evenodd;stroke:#000000;stroke-width:0.93619296pt"
         d="M 397.64309,320.25301 280.39197,282.517 l -29.6497,-157.68253 94.33998,-95.687687 48.51771,17.520281 90.29683,88.949126 z"
         id="path805"
         inkscape:connector-curvature="0" />
      <path
         style="font-size:12px;fill:#000000;fill-opacity:1;fill-rule:evenodd;stroke-width:1.00000003pt"
         d="m 476.95792,339.17168 c 18.82405,3.76439 22.5905,16.94193 18.82405,20.70634 -3.76341,3.76538 -13.17547,7.52979 -20.70534,1.88212 -7.53185,-5.64653 -7.53185,-18.82407 1.88129,-22.58846 z"
         id="path1791"
         inkscape:connector-curvature="0" />
      <path
         style="font-size:12px;fill:#000000;fill-opacity:1;fill-rule:evenodd;stroke-width:1.00000003pt"
         d="m 286.46194,340.42914 c -1.83424,0.48921 -17.15789,-12.71577 -29.29285,-6.59534 -12.13187,6.11956 -20.27633,19.82286 -8.94233,25.44602 11.33508,5.62316 19.43757,-0.86115 29.37437,-7.83863 9.9379,-6.97642 9.57933,-8.32059 8.86081,-11.01205 z"
         id="path1792"
         inkscape:connector-curvature="0" />
      <path
         style="font-size:12px;fill:#000000;fill-opacity:1;fill-rule:evenodd;stroke-width:1.00000003pt"
         d="m 510.35756,306.92856 c 10.23738,-2.55977 33.88577,0 30.11932,15.05778 -3.76334,15.06172 -35.76391,9.41193 -56.47317,1.88522 -1.8823,-15.06073 21.52866,-15.73733 26.35385,-16.943 z"
         id="path1793"
         inkscape:connector-curvature="0" />
      <path
         style="font-size:12px;fill:#000000;fill-opacity:1;fill-rule:evenodd;stroke-width:1.00000003pt"
         d="m 359.2403,21.362537 c -11.31337,0 -22.6056,4.320558 -31.27474,12.989693 L 173.87387,188.41466 c -8.4969,8.49674 -12.76227,19.54347 -12.93118,30.63111 h -0.0585 c 0,0.0395 0.0566,0.0774 0.0585,0.11702 -0.002,0.18609 -0.0585,0.36977 -0.0585,0.55586 h 0.2633 c 2.94912,11.22052 79.14951,25.52333 87.65118,34.02481 12.83905,12.83917 -49.23346,22.26805 -36.39456,35.10728 12.83906,12.83905 77.59023,24.84256 90.4305,37.6818 12.83908,12.83907 -26.2385,26.51035 -13.39928,39.34942 12.83907,12.83922 55.96669,-3.20939 48.15548,30.28002 17.33829,17.33828 53.51222,9.05882 77.73337,-8.27946 12.83906,-12.83907 -24.62937,-11.70675 -11.7902,-24.54584 12.83907,-12.83923 45.24731,-12.90848 72.55505,-43.62079 -10.99163,-17.09473 -46.98101,-24.37453 -34.14183,-37.21372 12.83906,-12.83906 37.79989,-6.31794 91.65925,-30.77738 26.29193,-11.94081 24.11992,-21.0102 24.01923,-32.00614 -0.002,-0.23138 0,-0.43973 0,-0.67288 h -0.0585 C 557.3983,207.95812 553.10345,196.9114 544.60673,188.41466 L 390.54428,34.35223 C 381.87515,25.683095 370.55366,21.362537 359.2403,21.362537 Z m -1.31652,20.040402 c 5.02949,0.131024 9.09163,3.965079 17.05628,9.127893 l 72.78909,53.977438 c 0.79681,0.51671 1.55569,1.05573 2.25272,1.60908 0.69703,0.55327 1.33373,1.1401 1.9309,1.72612 0.5972,0.58495 1.14004,1.17206 1.63834,1.78461 0.49726,0.61244 0.94845,1.23853 1.34577,1.8724 0.39844,0.6349 0.75476,1.27981 1.05322,1.93089 0.29867,0.65226 0.53281,1.32502 0.7314,1.98941 0.19976,0.66341 0.36832,1.31895 0.46811,1.98941 0.0999,0.67165 0.14627,1.34516 0.14627,2.01867 l -43.12343,-20.830311 -4.30065,32.562001 -23.72668,-11.11731 -36.62858,24.45807 -14.01366,-48.33101 -18.05098,42.275 -50.40821,5.03205 0.55587,-22.4394 c 0,-5.38972 29.05729,-43.122051 46.75119,-52.105048 l 32.38646,-23.258575 c 4.77873,-3.097693 8.12887,-4.35 11.14657,-4.271388 z m -66.9964,220.210391 c 22.94411,5.95032 48.47561,13.75705 68.95655,13.89664 l 0.87768,9.21566 c -17.53811,-1.80778 -54.64815,-10.27551 -63.39789,-14.74506 z"
         id="path831"
         inkscape:connector-curvature="0" />
    </g>
    <use
       style="color:#000000;font-family:sans-serif;display:inline;overflow:visible;visibility:visible;opacity:1;fill:#ffffff;fill-opacity:0.110769;fill-rule:nonzero;stroke:none;stroke-width:0.26322169pt;stroke-linecap:butt;stroke-linejoin:miter;stroke-miterlimit:4;stroke-dasharray:none;stroke-dashoffset:0;stroke-opacity:1;marker:none;marker-start:none;marker-mid:none;marker-end:none"
       height="1052.3622"
       width="320"
       transform="matrix(3.799079,0,0,3.799079,-428.7368,-36.47549)"
       id="use2086"
       xlink:href="#path1124"
       y="0"
       x="0" />
    <text
       xml:space="preserve"
       style="font-style:normal;font-variant:normal;font-weight:normal;font-stretch:normal;font-size:6.96932268px;line-height:125%;font-family:sans-serif;text-align:start;writing-mode:lr-tb;text-anchor:start;opacity:0.5;fill:#000000;fill-opacity:1;stroke:none"
       x="3.6203015"
       y="-326.81229"
       id="text7519"
       sodipodi:linespacing="125%"
       transform="rotate(90)"><tspan
         sodipodi:role="line"
         id="tspan7521"
         x="3.6203015"
         y="-326.81229"
         style="letter-spacing:0.29056421">Use <tspan
   style="font-weight:bold"
   id="tspan7523">Ctrl+seta para baixo</tspan> para baixar </tspan></text>
    <path
       style="color:#000000;display:inline;overflow:visible;visibility:visible;opacity:0.5;fill:#000000;fill-opacity:1;fill-rule:evenodd;stroke:none;stroke-width:2.28966284;marker:none"
       d="m 332.8863,155.61845 -8.13967,-0.0221 4.04377,5.19057 z"
       id="path7527"
       inkscape:connector-curvature="0" />
  </g>
</svg>
