<?xml version="1.0" encoding="UTF-8" standalone="no"?>
<!-- Created with Inkscape (http://www.inkscape.org/) -->

<svg
   xmlns:dc="http://purl.org/dc/elements/1.1/"
   xmlns:cc="http://creativecommons.org/ns#"
   xmlns:rdf="http://www.w3.org/1999/02/22-rdf-syntax-ns#"
   xmlns:svg="http://www.w3.org/2000/svg"
   xmlns="http://www.w3.org/2000/svg"
   xmlns:xlink="http://www.w3.org/1999/xlink"
   xmlns:sodipodi="http://sodipodi.sourceforge.net/DTD/sodipodi-0.dtd"
   xmlns:inkscape="http://www.inkscape.org/namespaces/inkscape"
   width="744.09448"
   height="1052.3622"
   id="svg1918"
   sodipodi:version="0.32"
   inkscape:version="0.92pre1_64bit r15016"
   sodipodi:docname="_tutorial-footer.pt-BR.svg"
   version="1.1"
   viewBox="0 0 744.09448 1052.3622">
  <defs
     id="defs3">
    <linearGradient
       id="linearGradient841">
      <stop
         style="stop-color:#0082ab;stop-opacity:1;"
         offset="0.00000000"
         id="stop842" />
      <stop
         style="stop-color:white;stop-opacity:0;"
         offset="1"
         id="stop843" />
    </linearGradient>
    <linearGradient
       inkscape:collect="always"
       xlink:href="#linearGradient841"
       id="linearGradient2465"
       x1="76.846634"
       y1="-7656.4473"
       x2="76.846634"
       y2="-7528.6606"
       gradientTransform="matrix(2.149642,0,0,0.465194,-0.130153,3495.428)"
       gradientUnits="userSpaceOnUse" />
    <filter
       id="filter56"
       height="1.2"
       width="1.2"
       y="-0.1"
       x="-0.1"
       inkscape:label="Drop shadow, custom"
       style="color-interpolation-filters:sRGB">
      <feFlood
         id="feFlood58"
         flood-opacity="0.686275"
         flood-color="rgb(255,255,255)"
         result="flood" />
      <feComposite
         id="feComposite60"
         in2="SourceGraphic"
         in="flood"
         operator="in"
         result="composite1" />
      <feGaussianBlur
         id="feGaussianBlur62"
         in="composite1"
         stdDeviation="20"
         result="blur" />
      <feOffset
         id="feOffset64"
         dx="0"
         dy="0"
         result="offset" />
      <feComposite
         id="feComposite66"
         in2="offset"
         in="SourceGraphic"
         operator="over"
         result="composite2" />
    </filter>
  </defs>
  <sodipodi:namedview
     id="base"
     pagecolor="#ffffff"
     bordercolor="#666666"
     borderopacity="1.0"
     inkscape:pageopacity="0.0"
     inkscape:pageshadow="2"
     inkscape:zoom="2.0734783"
     inkscape:cx="127.81405"
     inkscape:cy="1032.4219"
     inkscape:document-units="px"
     inkscape:current-layer="layer1"
     inkscape:window-width="1235"
     inkscape:window-height="947"
     inkscape:window-x="0"
     inkscape:window-y="25"
     showgrid="false"
     inkscape:window-maximized="0" />
  <metadata
     id="metadata4">
    <rdf:RDF>
      <cc:Work
         rdf:about="">
        <dc:format>image/svg+xml</dc:format>
        <dc:type
           rdf:resource="http://purl.org/dc/dcmitype/StillImage" />
      </cc:Work>
    </rdf:RDF>
  </metadata>
  <g
     inkscape:label="Layer 1"
     inkscape:groupmode="layer"
     id="layer1">
    <rect
       style="font-size:12px;fill:url(#linearGradient2465);fill-opacity:1;fill-rule:evenodd;stroke:none;stroke-width:3.06115007"
       id="rect1494"
       width="319.99103"
       height="69.247704"
       x="-0.11217058"
       y="-70.334389"
       ry="6.1828303"
       rx="0.0000000"
       transform="scale(1,-1)" />
    <path
       style="fill:#ffffff;stroke-width:1.00000003pt"
       d="m 80.493022,57.97598 h -4.95673 v 0.3171 h 0.148457 c 0.668048,0 0.74228,0.0338 0.74228,0.3172 v 0.1956 3.212 0.1957 c 0,0.2835 -0.07423,0.3172 -0.74228,0.3172 h -0.148457 v 0.3171 h 5.063943 l 0.164953,-1.8016 h -0.362887 c -0.10722,0.4723 -0.296906,0.8907 -0.494854,1.0864 -0.255662,0.2699 -0.725769,0.3981 -1.418558,0.3981 h -0.544332 c -0.24742,0 -0.45361,-0.0405 -0.527835,-0.1012 -0.05773,-0.0406 -0.06598,-0.081 -0.06598,-0.2227 v -1.7206 h 0.164946 c 0.503102,0 0.709279,0.0404 0.874233,0.1821 0.214431,0.1754 0.296905,0.3914 0.31341,0.7895 h 0.387627 v -2.2133 h -0.387627 c -0.04124,0.6612 -0.371145,0.9244 -1.154648,0.9244 h -0.197941 v -1.5385 c 0,-0.2901 0.07423,-0.3374 0.519586,-0.3374 h 0.428871 c 0.725775,0 1.080415,0.0608 1.36083,0.2497 0.272166,0.1754 0.470107,0.5533 0.593825,1.1606 h 0.354632 l -0.115462,-1.7274 z m -10.944379,2.7059 h 0.931964 c 0.74227,0 1.129898,-0.0472 1.459796,-0.1755 0.585576,-0.2294 0.915473,-0.6612 0.915473,-1.1943 0,-0.5129 -0.288663,-0.9043 -0.832995,-1.1269 -0.321655,-0.135 -0.832995,-0.2092 -1.402071,-0.2092 h -2.886609 v 0.3171 h 0.148455 c 0.668045,0 0.74227,0.0338 0.74227,0.3172 v 0.1956 3.212 0.1957 c 0,0.2835 -0.07422,0.3172 -0.74227,0.3172 h -0.148455 v 0.3171 h 2.771151 v -0.3171 h -0.21444 c -0.668044,0 -0.742269,-0.0337 -0.742269,-0.3172 v -0.1957 z m 0,-0.3172 v -1.7274 c 0,-0.3104 0.04948,-0.3442 0.503097,-0.3442 h 0.527836 c 0.857735,0 1.261858,0.3307 1.261858,1.046 0,0.695 -0.42062,1.0256 -1.294849,1.0256 z m -7.17529,-2.4832 h -0.346394 l -1.896921,3.9341 c -0.164946,0.3508 -0.197932,0.398 -0.321645,0.506 -0.13196,0.1281 -0.362889,0.2092 -0.585571,0.2092 h -0.03299 v 0.3171 h 2.185575 v -0.3171 H 61.21046 c -0.445363,0 -0.668044,-0.1282 -0.668044,-0.3846 0,-0.081 0.02474,-0.1755 0.07422,-0.2835 l 0.272168,-0.5938 h 2.18558 l 0.445362,0.9042 c 0.04948,0.1012 0.06598,0.1485 0.06598,0.1823 0,0.1079 -0.206187,0.1754 -0.511341,0.1754 h -0.346394 v 0.3171 h 2.556706 v -0.3171 h -0.115458 c -0.412377,0 -0.503098,-0.054 -0.692789,-0.4319 l -2.1031,-4.2174 z m -0.404129,1.1067 0.931964,1.9164 h -1.847433 z m -5.690746,-1.0594 h -0.313402 l -0.329899,0.3981 c -0.585571,-0.3509 -0.907221,-0.4521 -1.459801,-0.4521 -0.80001,0 -1.459806,0.2632 -2.020633,0.8097 -0.52784,0.5129 -0.77526,1.0797 -0.77526,1.7747 0,1.4508 1.162893,2.4899 2.787646,2.4899 1.319593,0 2.160836,-0.6342 2.350526,-1.7678 l -0.387628,-0.054 c -0.08248,0.3576 -0.181447,0.6005 -0.329898,0.803 -0.338151,0.4655 -0.865987,0.7017 -1.534031,0.7017 -1.22063,0 -1.797953,-0.695 -1.797953,-2.1457 0,-0.7626 0.123713,-1.2754 0.404129,-1.6804 0.255667,-0.3778 0.767006,-0.614 1.294855,-0.614 0.577323,0 1.088663,0.2497 1.402071,0.6816 0.156698,0.2226 0.280411,0.4858 0.470106,1.0053 h 0.362884 z m -8.255714,0.0067 h -0.305153 l -0.329898,0.4049 c -0.387628,-0.3036 -0.915469,-0.4656 -1.501033,-0.4656 -1.080416,0 -1.806193,0.5668 -1.806193,1.4102 0,0.7356 0.445361,1.1 1.657742,1.3564 l 0.783502,0.1619 c 0.610314,0.1283 0.668044,0.1418 0.841244,0.2496 0.247424,0.1553 0.37938,0.3779 0.37938,0.6411 0,0.2699 -0.123712,0.4926 -0.371132,0.6749 -0.27217,0.1956 -0.544338,0.2699 -0.997949,0.2699 -0.610306,0 -1.047422,-0.1552 -1.435049,-0.5061 -0.346399,-0.3171 -0.519594,-0.6343 -0.643304,-1.1539 H 43.94028 l 0.03299,1.9231 h 0.321651 l 0.37113,-0.4588 c 0.552585,0.371 1.014438,0.506 1.731968,0.506 1.21238,0 1.98764,-0.5802 1.98764,-1.4845 0,-0.4183 -0.1732,-0.776 -0.494848,-1.0324 -0.222682,-0.1754 -0.544332,-0.2902 -1.204133,-0.4251 l -0.882476,-0.1822 c -0.734022,-0.1552 -1.080416,-0.4183 -1.080416,-0.83 0,-0.4724 0.470106,-0.7963 1.171142,-0.7963 0.577316,0 1.047422,0.2026 1.377325,0.5871 0.239178,0.2767 0.387628,0.5601 0.494845,0.9042 h 0.35464 l -0.09897,-1.7544 z m -11.150561,2.7059 v -1.8355 -0.1956 c 0,-0.2834 0.07423,-0.3172 0.742272,-0.3172 h 0.156703 v -0.3171 h -2.71342 v 0.3171 h 0.148457 c 0.668041,0 0.74227,0.0338 0.74227,0.3172 v 0.1956 3.212 0.1957 c 0,0.2835 -0.07423,0.3172 -0.74227,0.3172 h -0.148457 v 0.3171 h 2.71342 v -0.3171 h -0.156703 c -0.668043,0 -0.742272,-0.0337 -0.742272,-0.3172 v -0.1957 -0.8569 l 0.956705,-0.7894 1.435061,1.7206 c 0.131959,0.1619 0.164948,0.216 0.164948,0.2834 0,0.108 -0.1567,0.1552 -0.560827,0.1552 h -0.255673 v 0.3171 h 2.820634 v -0.3171 h -0.156699 c -0.453611,0 -0.569074,-0.0472 -0.808256,-0.3373 l -1.995886,-2.3551 1.228871,-1.0054 c 0.395879,-0.3442 0.898976,-0.5399 1.39383,-0.5399 v -0.3171 h -2.540225 v 0.3171 h 0.206187 c 0.379381,0 0.536086,0.0608 0.536086,0.2025 0,0.0944 -0.16495,0.2901 -0.404127,0.4858 z m -9.220686,-2.6654 H 25.95254 v 0.3171 h 0.206185 c 0.42062,0 0.610315,0.054 0.758766,0.2227 v 2.8679 c 0,0.9245 -0.164948,1.1201 -0.956704,1.1471 v 0.3171 h 2.350547 v -0.3171 c -0.783528,-0.027 -0.94848,-0.2226 -0.94848,-1.1471 v -2.5035 l 3.67839,4.0622 h 0.346396 v -3.5021 c 0,-0.9245 0.164951,-1.1202 0.956707,-1.1472 v -0.3171 h -2.35053 v 0.3171 c 0.783508,0.027 0.948456,0.2227 0.948456,1.1472 v 2.1189 z m -5.360855,0.8299 v -0.1956 c 0,-0.2834 0.07423,-0.3172 0.734025,-0.3172 h 0.16495 v -0.3171 h -2.72991 v 0.3171 h 0.164951 c 0.668041,0 0.742271,0.0338 0.742271,0.3172 v 0.1956 3.212 0.1957 c 0,0.2835 -0.07423,0.3172 -0.742271,0.3172 h -0.164951 v 0.3171 h 2.72991 v -0.3171 h -0.16495 c -0.659794,0 -0.734025,-0.0337 -0.734025,-0.3172 v -0.1957 z"
       id="path1508"
       inkscape:connector-curvature="0" />
    <path
       style="fill:#ffffff;stroke-width:1.00000003pt"
       d="m 305.96725,58.20398 h 1.35571 v 2.8174 c 0,0.5319 -0.0188,0.8614 -0.0565,0.9885 -0.12709,0.4849 -0.41659,0.8191 -0.8685,1.0027 -0.31068,0.1271 -0.76965,0.1906 -1.37689,0.1906 -1.43574,0 -2.1536,-0.4284 -2.1536,-1.2851 l 1.43338,-0.007 c 0.0941,0.2683 0.36246,0.4024 0.80495,0.4024 0.32481,0 0.55311,-0.1012 0.68492,-0.3036 0.0989,-0.1553 0.14828,-0.4095 0.14828,-0.7626 v -0.12 c -0.42837,0.3436 -0.8991,0.5154 -1.4122,0.5154 -0.55546,0 -1.00031,-0.1765 -1.33453,-0.5295 -0.33422,-0.3578 -0.50133,-0.8144 -0.50133,-1.3699 0,-0.4848 0.19065,-0.8897 0.57194,-1.2145 0.35776,-0.3012 0.78613,-0.4519 1.2851,-0.4519 0.64491,0 1.11799,0.2095 1.41926,0.6285 z m -0.0635,1.6382 c 0,-0.226 -0.0894,-0.4048 -0.26831,-0.5367 -0.17418,-0.1365 -0.37894,-0.2047 -0.61431,-0.2047 -0.2542,0 -0.46367,0.0729 -0.62843,0.2189 -0.16005,0.1459 -0.24007,0.3436 -0.24007,0.5931 0,0.2071 0.0824,0.386 0.24713,0.5366 0.08,0.0706 0.16711,0.1248 0.26126,0.1624 0.0941,0.0377 0.19535,0.0565 0.30362,0.0565 0.27303,0 0.49192,-0.0682 0.65667,-0.2048 0.1883,-0.1506 0.28244,-0.3577 0.28244,-0.6213 z m -6.2984,-1.6382 h 1.4122 v 0.6143 c 0.24478,-0.4519 0.60018,-0.6778 1.06621,-0.6778 l 0.42366,0.0423 v 1.2922 c -0.21183,-0.0376 -0.39777,-0.0565 -0.55782,-0.0565 -0.59783,0 -0.89675,0.3554 -0.89675,1.0662 v 1.3699 h -1.4475 z m -2.66906,-0.1271 c 0.62608,0 1.14624,0.1648 1.56048,0.4943 0.43778,0.3531 0.65668,0.8403 0.65668,1.4616 0,0.6073 -0.21419,1.0898 -0.64256,1.4475 -0.40953,0.3295 -0.92263,0.4943 -1.53929,0.4943 -0.68256,0 -1.22861,-0.153 -1.63815,-0.459 -0.46132,-0.3389 -0.69198,-0.8402 -0.69198,-1.504 0,-0.6213 0.23301,-1.1085 0.69904,-1.4616 0.42366,-0.3154 0.95559,-0.4731 1.59578,-0.4731 z m -0.0353,2.8668 c 0.24007,0 0.43543,-0.0894 0.58606,-0.2683 0.15064,-0.1789 0.22595,-0.3931 0.22595,-0.6426 0,-0.2495 -0.0706,-0.4636 -0.21183,-0.6425 -0.14122,-0.1789 -0.33422,-0.2683 -0.579,-0.2683 -0.25419,0 -0.45896,0.087 -0.6143,0.2612 -0.0753,0.0895 -0.13181,0.186 -0.16947,0.2895 -0.0377,0.0989 -0.0565,0.2189 -0.0565,0.3601 0,0.2589 0.0706,0.4755 0.21183,0.6496 0.14122,0.1742 0.34364,0.2613 0.60725,0.2613 z m -4.04595,-0.5155 h 1.4475 v 1.4264 h -1.4475 z m -3.5658,-0.0141 c 0.15534,0.3766 0.40248,0.5649 0.7414,0.5649 0.35776,0 0.58371,-0.0989 0.67786,-0.2966 0.0847,0 0.29656,0.0142 0.63549,0.0424 0.33893,0.0282 0.63549,0.0424 0.88968,0.0424 -0.24007,0.466 -0.54369,0.7908 -0.91087,0.9744 -0.33422,0.16 -0.7767,0.2401 -1.32746,0.2401 -0.64491,0 -1.16271,-0.1671 -1.55342,-0.5014 -0.41895,-0.353 -0.62843,-0.8473 -0.62843,-1.4828 0,-0.6072 0.22831,-1.0874 0.68492,-1.4404 0.40954,-0.3107 0.9344,-0.466 1.5746,-0.466 0.62607,0 1.13917,0.16 1.5393,0.4801 0.40012,0.3154 0.62842,0.7814 0.68491,1.3981 l 0.0141,0.4448 z m 1.52517,-0.8614 c -0.0565,-0.3295 -0.2942,-0.4943 -0.71316,-0.4943 -0.16005,0 -0.32716,0.0447 -0.50133,0.1342 -0.16946,0.0894 -0.26125,0.2094 -0.27538,0.3601 z m -7.76709,-1.3487 h 1.44044 l -0.007,0.459 c 0.39542,-0.3813 0.84262,-0.5719 1.34159,-0.5719 0.55547,0 0.9956,0.1741 1.32041,0.5225 0.32951,0.3436 0.49427,0.7955 0.49427,1.3557 0,0.579 -0.16005,1.0521 -0.48015,1.4192 -0.33422,0.3907 -0.78377,0.5861 -1.34865,0.5861 -0.30598,0 -0.5484,-0.0353 -0.72728,-0.1059 -0.17417,-0.0706 -0.37188,-0.2142 -0.59313,-0.4307 v 1.6875 h -1.44044 z m 2.27364,2.7468 c 0.2589,0 0.46838,-0.0895 0.62843,-0.2684 0.16005,-0.1835 0.24007,-0.4048 0.24007,-0.6637 0,-0.2636 -0.0753,-0.4778 -0.22595,-0.6425 -0.14122,-0.1695 -0.34363,-0.2542 -0.60724,-0.2542 -0.23537,0 -0.44014,0.0847 -0.61431,0.2542 -0.17417,0.1694 -0.26126,0.3765 -0.26126,0.6213 0,0.2542 0.0777,0.4778 0.23302,0.6708 0.15534,0.1883 0.35775,0.2825 0.60724,0.2825 z m -6.81386,-1.6453 c 0.11769,-0.4754 0.37894,-0.812 0.78377,-1.0097 0.29657,-0.1412 0.72729,-0.2118 1.29217,-0.2118 0.52722,0 0.95323,0.1036 1.27804,0.3107 0.3907,0.2495 0.58606,0.6237 0.58606,1.1227 v 1.6876 c 0,0.1082 0.009,0.2071 0.0282,0.2965 0.0188,0.0895 0.0565,0.2071 0.11298,0.3531 h -1.48987 l -0.0494,-0.4237 c -0.34363,0.3531 -0.75552,0.5296 -1.23567,0.5296 -0.39071,0 -0.72728,-0.0918 -1.00972,-0.2754 -0.31539,-0.2165 -0.47309,-0.5131 -0.47309,-0.8897 0,-0.4095 0.13416,-0.7131 0.40248,-0.9109 0.193,-0.1412 0.50133,-0.2447 0.92499,-0.3106 l 1.02384,-0.1201 c 0.22124,-0.0376 0.33187,-0.0965 0.33187,-0.1765 0,-0.1836 -0.13887,-0.2754 -0.4166,-0.2754 -0.16005,0 -0.2895,0.0189 -0.38836,0.0565 -0.0989,0.033 -0.17652,0.1153 -0.23301,0.2471 z m 1.27098,1.3558 c 0,0.1977 0.16711,0.2965 0.50133,0.2965 0.20713,0 0.39071,-0.0659 0.55076,-0.1977 0.16476,-0.1318 0.24714,-0.2966 0.24714,-0.4943 l -0.95324,0.1201 c -0.0659,0.0047 -0.14122,0.0353 -0.22595,0.0918 -0.08,0.0518 -0.12004,0.1129 -0.12004,0.1836 z m -1.5746,-1.038 -1.44044,0.0706 c -0.0894,-0.193 -0.17653,-0.3319 -0.26126,-0.4166 -0.11297,-0.0989 -0.26831,-0.1483 -0.46602,-0.1483 -0.26361,0 -0.46838,0.0942 -0.61431,0.2825 -0.14122,0.1835 -0.21183,0.4119 -0.21183,0.6849 0,0.2353 0.08,0.4354 0.24007,0.6002 0.16005,0.16 0.35776,0.24 0.59313,0.24 0.37658,0 0.62137,-0.2094 0.73434,-0.6284 l 1.45457,0.0636 c -0.24008,1.0685 -0.97442,1.6028 -2.20303,1.6028 -0.65432,0 -1.1839,-0.16 -1.58873,-0.4801 -0.4519,-0.3484 -0.67785,-0.838 -0.67785,-1.4687 0,-0.6402 0.24478,-1.1345 0.73434,-1.4828 0.43308,-0.3107 0.98148,-0.4661 1.64521,-0.4661 0.52722,0 0.97207,0.1318 1.33453,0.3954 0.36717,0.259 0.6096,0.6426 0.72728,1.151 z m -7.40698,1.038 c 0.0989,0.1647 0.22595,0.273 0.38129,0.3248 0.10827,0.0329 0.27538,0.0494 0.50134,0.0494 0.0612,0 0.10591,-0.0024 0.13415,-0.0071 0.0283,-0.0094 0.0659,-0.0259 0.11298,-0.0494 0.10356,-0.0424 0.15534,-0.1059 0.15534,-0.1906 0,-0.1271 -0.2236,-0.2142 -0.67079,-0.2613 -0.60725,-0.0706 -1.02149,-0.1506 -1.24274,-0.2401 -0.44719,-0.1789 -0.67079,-0.4872 -0.67079,-0.925 0,-0.4754 0.2283,-0.8214 0.68491,-1.0379 0.34364,-0.1648 0.78142,-0.2472 1.31335,-0.2472 1.11093,0 1.75819,0.379 1.94177,1.1369 l -1.36983,0.0917 c -0.0706,-0.1223 -0.16005,-0.2118 -0.26832,-0.2683 -0.0988,-0.0329 -0.22595,-0.0494 -0.38129,-0.0494 -0.35776,0 -0.53664,0.0847 -0.53664,0.2542 0,0.0565 0.0612,0.1059 0.18359,0.1483 0.1271,0.0423 0.44013,0.0941 0.93911,0.1553 0.49898,0.0612 0.84497,0.1507 1.03797,0.2683 0.29656,0.1695 0.44484,0.4472 0.44484,0.8332 0,0.4425 -0.20242,0.7862 -0.60725,1.0309 -0.33422,0.1977 -0.74375,0.2966 -1.22861,0.2966 -0.60254,0 -1.06856,-0.0683 -1.39808,-0.2048 -0.46602,-0.1883 -0.75787,-0.5295 -0.87556,-1.0238 z m -5.92417,-3.7847 h 1.44044 v 2.2807 l 1.17213,-0.9533 h 1.99826 l -1.75113,1.3699 1.75819,2.2877 h -1.7017 l -1.08033,-1.4898 -0.39542,0.2895 v 1.1933 h -1.44044 z m -4.8509,1.3204 h 1.4475 v 0.4801 c 0.37188,-0.386 0.82614,-0.579 1.36277,-0.579 0.42837,0 0.77436,0.1201 1.03797,0.3601 0.26832,0.2354 0.40247,0.5696 0.40247,1.0027 v 2.4078 h -1.41925 l -0.0141,-2.0548 c 0,-0.1883 -0.0588,-0.3412 -0.17652,-0.4589 -0.11768,-0.1177 -0.26832,-0.1766 -0.45191,-0.1766 -0.23536,0 -0.41895,0.0918 -0.55075,0.2754 -0.1271,0.1836 -0.19065,0.3978 -0.19065,0.6426 v 1.7582 h -1.4475 z m -1.98414,0.007 h 1.44044 v 3.6364 h -1.44044 z m 0.007,-1.3345 h 1.44044 v 0.9815 h -1.44044 z m -2.12536,3.5587 h 1.4475 v 1.4264 h -1.4475 z m -5.69822,-2.2242 0.61431,2.2737 c 0.0424,-0.2731 0.13651,-0.652 0.28244,-1.1368 0.0612,-0.2166 0.12003,-0.4378 0.17652,-0.6638 0.0424,-0.16 0.08,-0.3177 0.11298,-0.4731 l 1.48281,0.0071 0.33186,1.1368 c 0.10827,0.419 0.1883,0.8073 0.24008,1.1651 0.0282,-0.1883 0.0612,-0.3672 0.0988,-0.5367 0.0377,-0.1741 0.0941,-0.3836 0.16946,-0.6284 0.0565,-0.1883 0.11063,-0.3672 0.16241,-0.5366 0.0518,-0.1742 0.11533,-0.3766 0.19064,-0.6073 h 1.47575 l -1.2851,3.6576 h -1.56048 l -0.55782,-2.0971 -0.60018,2.0971 h -1.55342 l -1.2851,-3.6576 z m -6.53142,0 0.61431,2.2737 c 0.0424,-0.2731 0.13651,-0.652 0.28244,-1.1368 0.0612,-0.2166 0.12004,-0.4378 0.17652,-0.6638 0.0424,-0.16 0.08,-0.3177 0.11298,-0.4731 l 1.48281,0.0071 0.33186,1.1368 c 0.10827,0.419 0.1883,0.8073 0.24008,1.1651 0.0282,-0.1883 0.0612,-0.3672 0.0988,-0.5367 0.0377,-0.1741 0.0942,-0.3836 0.16947,-0.6284 0.0565,-0.1883 0.11062,-0.3672 0.1624,-0.5366 0.0518,-0.1742 0.11533,-0.3766 0.19065,-0.6073 h 1.47574 l -1.2851,3.6576 h -1.56048 l -0.55782,-2.0971 -0.60018,2.0971 h -1.55342 l -1.2851,-3.6576 z m -6.53141,0 0.6143,2.2737 c 0.0424,-0.2731 0.13651,-0.652 0.28244,-1.1368 0.0612,-0.2166 0.12004,-0.4378 0.17653,-0.6638 0.0424,-0.16 0.08,-0.3177 0.11297,-0.4731 l 1.48281,0.0071 0.33187,1.1368 c 0.10827,0.419 0.18829,0.8073 0.24007,1.1651 0.0282,-0.1883 0.0612,-0.3672 0.0988,-0.5367 0.0377,-0.1741 0.0942,-0.3836 0.16947,-0.6284 0.0565,-0.1883 0.11062,-0.3672 0.1624,-0.5366 0.0518,-0.1742 0.11533,-0.3766 0.19065,-0.6073 h 1.47575 l -1.28511,3.6576 h -1.56047 l -0.55782,-2.0971 -0.60019,2.0971 h -1.55342 l -1.2851,-3.6576 z"
       id="path1517"
       inkscape:connector-curvature="0" />
    <g
       transform="matrix(0.0294185,0,0,0.0294185,0.1569075,53.985559)"
       id="g1515"
       style="filter:url(#filter56)">
      <path
         id="path1516"
         d="M 397.64309,320.25301 280.39197,282.517 l -29.6497,-157.68253 94.33998,-95.687687 48.51771,17.520281 90.29683,88.949126 z"
         style="font-size:12px;fill:#ffffff;fill-rule:evenodd;stroke:#000000;stroke-width:0.93619296pt"
         inkscape:connector-curvature="0" />
      <path
         id="path1518"
         d="m 476.95792,339.17168 c 18.82405,3.76439 22.5905,16.94193 18.82405,20.70634 -3.76341,3.76538 -13.17547,7.52979 -20.70534,1.88212 -7.53185,-5.64653 -7.53185,-18.82407 1.88129,-22.58846 z"
         style="font-size:12px;fill:#000000;fill-opacity:1;fill-rule:evenodd;stroke-width:1.00000003pt"
         inkscape:connector-curvature="0" />
      <path
         id="path1519"
         d="m 286.46194,340.42914 c -1.83424,0.48921 -17.15789,-12.71577 -29.29285,-6.59534 -12.13187,6.11956 -20.27633,19.82286 -8.94233,25.44602 11.33508,5.62316 19.43757,-0.86115 29.37437,-7.83863 9.9379,-6.97642 9.57933,-8.32059 8.86081,-11.01205 z"
         style="font-size:12px;fill:#000000;fill-opacity:1;fill-rule:evenodd;stroke-width:1.00000003pt"
         inkscape:connector-curvature="0" />
      <path
         id="path1520"
         d="m 510.35756,306.92856 c 10.23738,-2.55977 33.88577,0 30.11932,15.05778 -3.76334,15.06172 -35.76391,9.41193 -56.47317,1.88522 -1.8823,-15.06073 21.52866,-15.73733 26.35385,-16.943 z"
         style="font-size:12px;fill:#000000;fill-opacity:1;fill-rule:evenodd;stroke-width:1.00000003pt"
         inkscape:connector-curvature="0" />
      <path
         id="path1521"
         d="m 359.2403,21.362537 c -11.31337,0 -22.6056,4.320558 -31.27474,12.989693 L 173.87387,188.41466 c -8.4969,8.49674 -12.76227,19.54347 -12.93118,30.63111 h -0.0585 c 0,0.0395 0.0566,0.0774 0.0585,0.11702 -0.002,0.18609 -0.0585,0.36977 -0.0585,0.55586 h 0.2633 c 2.94912,11.22052 79.14951,25.52333 87.65118,34.02481 12.83905,12.83917 -49.23346,22.26805 -36.39456,35.10728 12.83906,12.83905 77.59023,24.84256 90.4305,37.6818 12.83908,12.83907 -26.2385,26.51035 -13.39928,39.34942 12.83907,12.83922 55.96669,-3.20939 48.15548,30.28002 17.33829,17.33828 53.51222,9.05882 77.73337,-8.27946 12.83906,-12.83907 -24.62937,-11.70675 -11.7902,-24.54584 12.83907,-12.83923 45.24731,-12.90848 72.55505,-43.62079 -10.99163,-17.09473 -46.98101,-24.37453 -34.14183,-37.21372 12.83906,-12.83906 37.79989,-6.31794 91.65925,-30.77738 26.29193,-11.94081 24.11992,-21.0102 24.01923,-32.00614 -0.002,-0.23138 0,-0.43973 0,-0.67288 h -0.0585 C 557.3983,207.95812 553.10345,196.9114 544.60673,188.41466 L 390.54428,34.35223 C 381.87515,25.683095 370.55366,21.362537 359.2403,21.362537 Z m -1.31652,20.040402 c 5.02949,0.131024 9.09163,3.965079 17.05628,9.127893 l 72.78909,53.977438 c 0.79681,0.51671 1.55569,1.05573 2.25272,1.60908 0.69703,0.55327 1.33373,1.1401 1.9309,1.72612 0.5972,0.58495 1.14004,1.17206 1.63834,1.78461 0.49726,0.61244 0.94845,1.23853 1.34577,1.8724 0.39844,0.6349 0.75476,1.27981 1.05322,1.93089 0.29867,0.65226 0.53281,1.32502 0.7314,1.98941 0.19976,0.66341 0.36832,1.31895 0.46811,1.98941 0.0999,0.67165 0.14627,1.34516 0.14627,2.01867 l -43.12343,-20.830311 -4.30065,32.562001 -23.72668,-11.11731 -36.62858,24.45807 -14.01366,-48.33101 -18.05098,42.275 -50.40821,5.03205 0.55587,-22.4394 c 0,-5.38972 29.05729,-43.122051 46.75119,-52.105048 l 32.38646,-23.258575 c 4.77873,-3.097693 8.12887,-4.35 11.14657,-4.271388 z m -66.9964,220.210391 c 22.94411,5.95032 48.47561,13.75705 68.95655,13.89664 l 0.87768,9.21566 c -17.53811,-1.80778 -54.64815,-10.27551 -63.39789,-14.74506 z"
         style="font-size:12px;fill:#000000;fill-opacity:1;fill-rule:evenodd;stroke-width:1.00000003pt"
         inkscape:connector-curvature="0" />
    </g>
    <use
       style="color:#000000;font-family:sans-serif;display:inline;overflow:visible;visibility:visible;fill:#ffffff;fill-opacity:0.06461535;fill-rule:nonzero;stroke:none;stroke-width:1.00000003pt;marker:none"
       height="1052.3622"
       width="744.09448"
       transform="matrix(5.176729,0,0,5.176729,-102.7023,-256.6246)"
       id="use1328"
       xlink:href="#path1508"
       y="0"
       x="0" />
    <text
       xml:space="preserve"
       style="font-style:normal;font-variant:normal;font-weight:normal;font-stretch:normal;font-size:6.96932268px;line-height:125%;font-family:sans-serif;text-align:start;writing-mode:lr-tb;text-anchor:start;opacity:0.5;fill:#000000;fill-opacity:1;stroke:none"
       x="-70.83046"
       y="-6.5672836"
       id="text7519"
       sodipodi:linespacing="125%"
       transform="rotate(-90)"><tspan
         sodipodi:role="line"
         id="tspan7521"
         x="-70.83046"
         y="-6.5672836"
         style="letter-spacing:0.29056421">Use <tspan
   style="font-weight:bold"
   id="tspan7523">Ctrl+seta para cima</tspan> para subir </tspan></text>
    <path
       style="color:#000000;display:inline;overflow:visible;visibility:visible;opacity:0.5;fill:#000000;fill-opacity:1;fill-rule:evenodd;stroke:none;stroke-width:2.28966284;marker:none"
       d="m -12.6413,-72.167647 8.139674,0.02212 -4.043769,-5.19057 z"
       id="path7527"
       inkscape:connector-curvature="0" />
  </g>
</svg>
