{
	"$schema": "https://json.schemastore.org/nest-cli",
	"collection": "@nestjs/schematics",
	"sourceRoot": "src",
	"compilerOptions": {
		"deleteOutDir": true,
		"webpack": true,
		"assets": ["email/templates/**/*"],
		"watchAssets": true
	},
	"projects": {
		"interfaces": {
			"type": "library",
			"root": "libs/interfaces",
			"entryFile": "index",
			"sourceRoot": "libs/interfaces/src",
			"compilerOptions": {
				"tsConfigPath": "libs/interfaces/tsconfig.lib.json"
			}
		}
	}
}
