{
  "cycleRecord": {
    "activated": [],
    "activatedPublicKeys": [],
    "active": 9,
    "apoptosized": [],
    "counter": 48,
    "desired": 10,
    "duration": 60,
    "expired": 9,
    "joined": [],
    "joinedArchivers": [],
    "joinedConsensors": [],
    "leavingArchivers": [],
    "lost": [],
    "marker": "c690e9a51428502398dfde2a660ce07bdd259551dbcd0462ec626399b436b4f1",
    "networkDataHash": [
      {
        "cycle": 46,
        "hash": "a516257dcd8fa314f3ed28bb1d7decf3c0411fbb261059efe2414122da124dbc"
      }
    ],
    "networkId": "e83641c2242f5d8d14f3c1ebcced1c1500fac8aad8603f8aed155d94d0987fea",
    "networkReceiptHash": [
      {
        "cycle": 46,
        "hash": "f550a7604b927f7dc9ff06e03f7a013478fbc2ec7fdc24689677f358459b0be2"
      }
    ],
    "networkStateHash": "09f26cda190a513ba09d30ad07b6dc953b134a915f9abc827c0c7be3328d6afd",
    "networkSummaryHash": [
      {
        "cycle": 46,
        "hash": "78c7d4bfca718a92b57a31832c1c8460f43dee960b5f4cf4bbdae3bcce2deb6d"
      }
    ],
    "previous": "00039f43f6c2cb50f09998d0db4a1916908da068ed5baabcfe3fd0140441ae55",
    "refreshedArchivers": [
      {
        "curvePk": "363afebb8cca474bd4e3c29d0109ad068736b7802c34ed8b7038cd6a95bb1e24",
        "ip": "localhost",
        "port": 4000,
        "publicKey": "758b1c119412298802cd28dbfa394cdfeecc4074492d60844cc192d632d84de3"
      }
    ],
    "refreshedConsensors": [
      {
        "activeTimestamp": 1651136972,
        "address": "0fb0e8a0b16c703a72ddc7558ec55219018d815b7ad66136cd0360a0b6446214",
        "counterRefreshed": 45,
        "curvePublicKey": "3e80af5febf57545ce97ba5c6ca551afe0ca5fb8aea78f01a1811b161156f95b",
        "cycleJoined": "0000000000000000000000000000000000000000000000000000000000000000",
        "externalIp": "127.0.0.1",
        "externalPort": 9004,
        "id": "7b25555a3318f7fc14d00c853727cad574cd073041e5cb44ecdb181ce62eeb64",
        "internalIp": "127.0.0.1",
        "internalPort": 10004,
        "joinRequestTimestamp": 1651136794,
        "publicKey": "0fb0e8a0b16c703a72ddc7558ec55219018d815b7ad66136cd0360a0b6446214",
        "status": "active"
      },
      {
        "activeTimestamp": 1651136972,
        "address": "c79aa725c768977447b0ff8184397e2a8a4d6fe2b4b48571f39f7fab46194163",
        "counterRefreshed": 45,
        "curvePublicKey": "fb7f7cf293cef2e849385286aeab895be84604648777c6ff6f6a03ea9340001c",
        "cycleJoined": "0000000000000000000000000000000000000000000000000000000000000000",
        "externalIp": "127.0.0.1",
        "externalPort": 9007,
        "id": "bae49ffc815aba757e142d68cfe4e1ac3cafef37c940e7269d291506ac37b856",
        "internalIp": "127.0.0.1",
        "internalPort": 10007,
        "joinRequestTimestamp": 1651136795,
        "publicKey": "c79aa725c768977447b0ff8184397e2a8a4d6fe2b4b48571f39f7fab46194163",
        "status": "active"
      },
      {
        "activeTimestamp": 1651136972,
        "address": "177e411307f01f0a68e8979c8c27c24dac0eceb35dd97a1734e6b0eea631a0c3",
        "counterRefreshed": 45,
        "curvePublicKey": "4226179ce00e739dbefd57eb801ff4e09aca45dd3bbe35cb8ae67a99a95a1176",
        "cycleJoined": "0000000000000000000000000000000000000000000000000000000000000000",
        "externalIp": "127.0.0.1",
        "externalPort": 9005,
        "id": "cb65ca8f6e3c5d28cef43baea9983d39407480c8bb24ce83b4d19bd7504e72de",
        "internalIp": "127.0.0.1",
        "internalPort": 10005,
        "joinRequestTimestamp": 1651136794,
        "publicKey": "177e411307f01f0a68e8979c8c27c24dac0eceb35dd97a1734e6b0eea631a0c3",
        "status": "active"
      }
    ],
    "refuted": [],
    "removed": [],
    "returned": [],
    "safetyMode": false,
    "safetyNum": 0,
    "start": 1651139612,
    "syncing": 0
  },
  "cycleMarker": "c690e9a51428502398dfde2a660ce07bdd259551dbcd0462ec626399b436b4f1",
  "data": {
    "parentCycle": "c690e9a51428502398dfde2a660ce07bdd259551dbcd0462ec626399b436b4f1",
    "networkHash": "2d785ec5801a59ffe89ec9e62d092f03d819140d6304d4fa675f5ecbe72e57cc",
    "partitionHashes": {
      "0": "7ba92d61c8055b404bd4359f5fc13bd2d10fcd8260948e65d33a0a2e63f13303",
      "1": "241c2245270699b30cdcf37250fc63f9e4a54ce57a2868df4fa7251cdb3bd370",
      "2": "28f92368e6ac75387484560633e3a5dace85f82809e88f8423e483e29131a399",
      "3": "038a3de6ead45721b44220ffa3efe77a402bcb43e04fbfb1b0f6120e3c1a9ba2",
      "4": "435e5ca73933ad53503e46c48c9902002a5532d450db04b06ed3d9168463e062",
      "5": "78c7d4bfca718a92b57a31832c1c8460f43dee960b5f4cf4bbdae3bcce2deb6d",
      "6": "439b6616e835648b37c763f1522b70243966416e1d55898e89099c3389af47b2",
      "7": "a6f3e4044b09dbcde088568e7f6f0fda01cd4d6400d1fe3a87c2deb930dca41a",
      "8": "19aa323ab391ca0146fd33024c1707108c20641f9151a02474a7e8f2c4119ca7",
      "-1": "b7c46e72a5067a4fd15083c242a2492920eeee177f6837eb5cde073d3a3cb76c"
    }
  },
  "receipt": {
    "parentCycle": "c690e9a51428502398dfde2a660ce07bdd259551dbcd0462ec626399b436b4f1",
    "networkHash": "ebb55f25e4be33cb0c1c3c6f7793efc1060dbb8f6440ad4414ec448641583997",
    "partitionHashes": {
      "0": "f366f9e863c44dd07ff347d5e3e6fd643424f5246090cdfdc811bedff683772c",
      "1": "e032069bdd107c442258d0a6b95c1117a3b1d29cb54c6bb164a2caceaa3b8a88",
      "2": "bf38d874ecbf3c7ccf6fd082e0c444c4384defc333191cec6f16205809012e45",
      "3": "f2fcde3bda258bf4c8ab6fad568f448460b73b35d95c383f912465f8001184ed",
      "4": "0a16d16c347e209c5e6d25a141e864ca88089ef52af27b76096543b2b6fcb453",
      "5": "221484c81020595f4e0cfc304fa399f82c033ac1759c63e77e5534ec7ec12f45",
      "6": "196e729fa0421fa9c68550be8144677caefaf7d241c02a29342d16a96ba7447e",
      "7": "b5e7c35be2a7c09db52bea1b036a0e9a65993a3e71974b44858267602a40e51c",
      "8": "554d58f6e4ac7bf9cc5e6fc5026a5b1d217ccc3e058f000bf180608dceae4bec",
      "-1": "573808deeba726aaec51c2fe4df03130516189de016b9c53448261a5b5c88b1d"
    },
    "partitionMaps": {
      "0": {
        "9354cf3c": [
          "d5e6bc2d",
          "d5e6bc2d"
        ],
        "2231b1d7": [
          "23462f6d",
          "23462f6d"
        ]
      },
      "1": {
        "2231b1d7": [
          "23462f6d"
        ]
      },
      "2": {},
      "3": {
        "9354cf3c": [
          "d5e6bc2d"
        ]
      },
      "4": {
        "2231b1d7": [
          "23462f6d"
        ]
      },
      "5": {},
      "6": {},
      "7": {
        "9354cf3c": [
          "d5e6bc2d"
        ]
      },
      "8": {}
    },
    "partitionTxs": {
      "0": {
        "9354cf3c": [
          {
            "accountId": "0x9354cf3c63f016fe8787707501680f1e2205273ab0c0582776b5802f63794769",
            "data": {
              "timestamp": 1651139612952,
              "ethAddress": "0x9354cf3c63f016fe8787707501680f1e2205273ab0c0582776b5802f63794769",
              "accountType": 7,
              "readableReceipt": {
                "transactionHash": "0x9354cf3c63f016fe8787707501680f1e2205273ab0c0582776b5802f63794769",
                "transactionIndex": "0x1",
                "blockNumber": "0xb",
                "nonce": "0x",
                "blockHash": "0xc6ef2fc5426d6ad6fd9e2a26abeab0aa2411b7ab17f30a99d3cb96aed1d1055b",
                "cumulativeGasUsed": "0x0",
                "gasUsed": "0x0",
                "logs": null,
                "contractAddress": null,
                "from": "c9223615095dd5d49796227b0651405380d692c7dacc754fb16b5599092c2f2f",
                "to": "0x5d0312e96092fae4e857e7726c4a84774c2f6e5d",
                "value": "de0b6b3a7640000",
                "data": "0x"
              },
              "txId": "9354cf3c63f016fe8787707501680f1e2205273ab0c0582776b5802f63794769",
              "txFrom": "c9223615095dd5d49796227b0651405380d692c7dacc754fb16b5599092c2f2f",
              "hash": "9d0ec06f513bec8c8b47c0e5717d7e0e9429ae1cc80484b1710b2227a7ae5623"
            },
            "txId": "9354cf3c63f016fe8787707501680f1e2205273ab0c0582776b5802f63794769",
            "timestamp": 1651139612952,
            "hash": "9d0ec06f513bec8c8b47c0e5717d7e0e9429ae1cc80484b1710b2227a7ae5623",
            "stateId": "9d0ec06f513bec8c8b47c0e5717d7e0e9429ae1cc80484b1710b2227a7ae5623"
          },
          {
            "accountId": "5d0312e96092fae4e857e7726c4a84774c2f6e5d000000000000000000000000",
            "data": {
              "timestamp": 1651139612952,
              "account": {
                "nonce": "00",
                "balance": "3782dace9d900000",
                "stateRoot": {
                  "type": "Buffer",
                  "data": [
                    86,
                    232,
                    31,
                    23,
                    27,
                    204,
                    85,
                    166,
                    255,
                    131,
                    69,
                    230,
                    146,
                    192,
                    248,
                    110,
                    91,
                    72,
                    224,
                    27,
                    153,
                    108,
                    173,
                    192,
                    1,
                    98,
                    47,
                    181,
                    227,
                    99,
                    180,
                    33
                  ]
                },
                "codeHash": {
                  "type": "Buffer",
                  "data": [
                    197,
                    210,
                    70,
                    1,
                    134,
                    247,
                    35,
                    60,
                    146,
                    126,
                    125,
                    178,
                    220,
                    199,
                    3,
                    192,
                    229,
                    0,
                    182,
                    83,
                    202,
                    130,
                    39,
                    59,
                    123,
                    250,
                    216,
                    4,
                    93,
                    133,
                    164,
                    112
                  ]
                }
              },
              "ethAddress": "0x5d0312e96092fae4e857e7726c4a84774c2f6e5d",
              "accountType": 0,
              "hash": "efaefe300900d3f96d408158850225da096a8bc9cffd1cff2f242de34d85dcc8"
            },
            "txId": "9354cf3c63f016fe8787707501680f1e2205273ab0c0582776b5802f63794769",
            "timestamp": 1651139612952,
            "hash": "efaefe300900d3f96d408158850225da096a8bc9cffd1cff2f242de34d85dcc8",
            "stateId": "efaefe300900d3f96d408158850225da096a8bc9cffd1cff2f242de34d85dcc8"
          },
          {
            "accountId": "c9223615095dd5d49796227b0651405380d692c7dacc754fb16b5599092c2f2f",
            "data": {
              "id": "c9223615095dd5d49796227b0651405380d692c7dacc754fb16b5599092c2f2f",
              "accountType": 6,
              "balance": 4,
              "nodeRewardTime": 1651139612952,
              "timestamp": 1651139612952,
              "hash": "14c7ac115ba7b56b5ebeafd24fef1e5df519fb1050c4b545065e368358ae9863"
            },
            "txId": "9354cf3c63f016fe8787707501680f1e2205273ab0c0582776b5802f63794769",
            "timestamp": 1651139612952,
            "hash": "14c7ac115ba7b56b5ebeafd24fef1e5df519fb1050c4b545065e368358ae9863",
            "stateId": "14c7ac115ba7b56b5ebeafd24fef1e5df519fb1050c4b545065e368358ae9863"
          }
        ],
        "2231b1d7": [
          {
            "accountId": "0x2231b1d718b4fcf82404feba2268230cb5600f2bcaaf48e3da930271fe00d28a",
            "data": {
              "timestamp": 1651139615197,
              "ethAddress": "0x2231b1d718b4fcf82404feba2268230cb5600f2bcaaf48e3da930271fe00d28a",
              "accountType": 7,
              "readableReceipt": {
                "transactionHash": "0x2231b1d718b4fcf82404feba2268230cb5600f2bcaaf48e3da930271fe00d28a",
                "transactionIndex": "0x1",
                "blockNumber": "0xb",
                "nonce": "0x",
                "blockHash": "0xc6ef2fc5426d6ad6fd9e2a26abeab0aa2411b7ab17f30a99d3cb96aed1d1055b",
                "cumulativeGasUsed": "0x0",
                "gasUsed": "0x0",
                "logs": null,
                "contractAddress": null,
                "from": "3065208b9e54d36617597bafb589993dfa2a6f483634c677912c086ec3b45659",
                "to": "0x8af0d431acc6242c74164ac779894584dd110323",
                "value": "de0b6b3a7640000",
                "data": "0x"
              },
              "txId": "2231b1d718b4fcf82404feba2268230cb5600f2bcaaf48e3da930271fe00d28a",
              "txFrom": "3065208b9e54d36617597bafb589993dfa2a6f483634c677912c086ec3b45659",
              "hash": "ca3b2cf426fdb0fea7bc888db53dad5cd694f9c08401707acd85675175c6c8b8"
            },
            "txId": "2231b1d718b4fcf82404feba2268230cb5600f2bcaaf48e3da930271fe00d28a",
            "timestamp": 1651139615197,
            "hash": "ca3b2cf426fdb0fea7bc888db53dad5cd694f9c08401707acd85675175c6c8b8",
            "stateId": "ca3b2cf426fdb0fea7bc888db53dad5cd694f9c08401707acd85675175c6c8b8"
          },
          {
            "accountId": "3065208b9e54d36617597bafb589993dfa2a6f483634c677912c086ec3b45659",
            "data": {
              "id": "3065208b9e54d36617597bafb589993dfa2a6f483634c677912c086ec3b45659",
              "accountType": 6,
              "balance": 4,
              "nodeRewardTime": 1651139615197,
              "timestamp": 1651139615197,
              "hash": "a700d234f8727271de9abbccfaa3d3b348c9baaa444cb6047809a731d39cc54d"
            },
            "txId": "2231b1d718b4fcf82404feba2268230cb5600f2bcaaf48e3da930271fe00d28a",
            "timestamp": 1651139615197,
            "hash": "a700d234f8727271de9abbccfaa3d3b348c9baaa444cb6047809a731d39cc54d",
            "stateId": "a700d234f8727271de9abbccfaa3d3b348c9baaa444cb6047809a731d39cc54d"
          },
          {
            "accountId": "8af0d431acc6242c74164ac779894584dd110323000000000000000000000000",
            "data": {
              "timestamp": 1651139615197,
              "account": {
                "nonce": "00",
                "balance": "3782dace9d900000",
                "stateRoot": {
                  "type": "Buffer",
                  "data": [
                    86,
                    232,
                    31,
                    23,
                    27,
                    204,
                    85,
                    166,
                    255,
                    131,
                    69,
                    230,
                    146,
                    192,
                    248,
                    110,
                    91,
                    72,
                    224,
                    27,
                    153,
                    108,
                    173,
                    192,
                    1,
                    98,
                    47,
                    181,
                    227,
                    99,
                    180,
                    33
                  ]
                },
                "codeHash": {
                  "type": "Buffer",
                  "data": [
                    197,
                    210,
                    70,
                    1,
                    134,
                    247,
                    35,
                    60,
                    146,
                    126,
                    125,
                    178,
                    220,
                    199,
                    3,
                    192,
                    229,
                    0,
                    182,
                    83,
                    202,
                    130,
                    39,
                    59,
                    123,
                    250,
                    216,
                    4,
                    93,
                    133,
                    164,
                    112
                  ]
                }
              },
              "ethAddress": "0x8af0d431acc6242c74164ac779894584dd110323",
              "accountType": 0,
              "hash": "efaefe300900d3f96d408158850225da096a8bc9cffd1cff2f242de34d85dcc8"
            },
            "txId": "2231b1d718b4fcf82404feba2268230cb5600f2bcaaf48e3da930271fe00d28a",
            "timestamp": 1651139615197,
            "hash": "efaefe300900d3f96d408158850225da096a8bc9cffd1cff2f242de34d85dcc8",
            "stateId": "efaefe300900d3f96d408158850225da096a8bc9cffd1cff2f242de34d85dcc8"
          }
        ]
      },
      "1": {
        "2231b1d7": [
          {
            "accountId": "0x2231b1d718b4fcf82404feba2268230cb5600f2bcaaf48e3da930271fe00d28a",
            "data": {
              "timestamp": 1651139615197,
              "ethAddress": "0x2231b1d718b4fcf82404feba2268230cb5600f2bcaaf48e3da930271fe00d28a",
              "accountType": 7,
              "readableReceipt": {
                "transactionHash": "0x2231b1d718b4fcf82404feba2268230cb5600f2bcaaf48e3da930271fe00d28a",
                "transactionIndex": "0x1",
                "blockNumber": "0xb",
                "nonce": "0x",
                "blockHash": "0xc6ef2fc5426d6ad6fd9e2a26abeab0aa2411b7ab17f30a99d3cb96aed1d1055b",
                "cumulativeGasUsed": "0x0",
                "gasUsed": "0x0",
                "logs": null,
                "contractAddress": null,
                "from": "3065208b9e54d36617597bafb589993dfa2a6f483634c677912c086ec3b45659",
                "to": "0x8af0d431acc6242c74164ac779894584dd110323",
                "value": "de0b6b3a7640000",
                "data": "0x"
              },
              "txId": "2231b1d718b4fcf82404feba2268230cb5600f2bcaaf48e3da930271fe00d28a",
              "txFrom": "3065208b9e54d36617597bafb589993dfa2a6f483634c677912c086ec3b45659",
              "hash": "ca3b2cf426fdb0fea7bc888db53dad5cd694f9c08401707acd85675175c6c8b8"
            },
            "txId": "2231b1d718b4fcf82404feba2268230cb5600f2bcaaf48e3da930271fe00d28a",
            "timestamp": 1651139615197,
            "hash": "ca3b2cf426fdb0fea7bc888db53dad5cd694f9c08401707acd85675175c6c8b8",
            "stateId": "ca3b2cf426fdb0fea7bc888db53dad5cd694f9c08401707acd85675175c6c8b8"
          },
          {
            "accountId": "3065208b9e54d36617597bafb589993dfa2a6f483634c677912c086ec3b45659",
            "data": {
              "id": "3065208b9e54d36617597bafb589993dfa2a6f483634c677912c086ec3b45659",
              "accountType": 6,
              "balance": 4,
              "nodeRewardTime": 1651139615197,
              "timestamp": 1651139615197,
              "hash": "a700d234f8727271de9abbccfaa3d3b348c9baaa444cb6047809a731d39cc54d"
            },
            "txId": "2231b1d718b4fcf82404feba2268230cb5600f2bcaaf48e3da930271fe00d28a",
            "timestamp": 1651139615197,
            "hash": "a700d234f8727271de9abbccfaa3d3b348c9baaa444cb6047809a731d39cc54d",
            "stateId": "a700d234f8727271de9abbccfaa3d3b348c9baaa444cb6047809a731d39cc54d"
          },
          {
            "accountId": "8af0d431acc6242c74164ac779894584dd110323000000000000000000000000",
            "data": {
              "timestamp": 1651139615197,
              "account": {
                "nonce": "00",
                "balance": "3782dace9d900000",
                "stateRoot": {
                  "type": "Buffer",
                  "data": [
                    86,
                    232,
                    31,
                    23,
                    27,
                    204,
                    85,
                    166,
                    255,
                    131,
                    69,
                    230,
                    146,
                    192,
                    248,
                    110,
                    91,
                    72,
                    224,
                    27,
                    153,
                    108,
                    173,
                    192,
                    1,
                    98,
                    47,
                    181,
                    227,
                    99,
                    180,
                    33
                  ]
                },
                "codeHash": {
                  "type": "Buffer",
                  "data": [
                    197,
                    210,
                    70,
                    1,
                    134,
                    247,
                    35,
                    60,
                    146,
                    126,
                    125,
                    178,
                    220,
                    199,
                    3,
                    192,
                    229,
                    0,
                    182,
                    83,
                    202,
                    130,
                    39,
                    59,
                    123,
                    250,
                    216,
                    4,
                    93,
                    133,
                    164,
                    112
                  ]
                }
              },
              "ethAddress": "0x8af0d431acc6242c74164ac779894584dd110323",
              "accountType": 0,
              "hash": "efaefe300900d3f96d408158850225da096a8bc9cffd1cff2f242de34d85dcc8"
            },
            "txId": "2231b1d718b4fcf82404feba2268230cb5600f2bcaaf48e3da930271fe00d28a",
            "timestamp": 1651139615197,
            "hash": "efaefe300900d3f96d408158850225da096a8bc9cffd1cff2f242de34d85dcc8",
            "stateId": "efaefe300900d3f96d408158850225da096a8bc9cffd1cff2f242de34d85dcc8"
          }
        ]
      },
      "2": {},
      "3": {
        "9354cf3c": [
          {
            "accountId": "0x9354cf3c63f016fe8787707501680f1e2205273ab0c0582776b5802f63794769",
            "data": {
              "timestamp": 1651139612952,
              "ethAddress": "0x9354cf3c63f016fe8787707501680f1e2205273ab0c0582776b5802f63794769",
              "accountType": 7,
              "readableReceipt": {
                "transactionHash": "0x9354cf3c63f016fe8787707501680f1e2205273ab0c0582776b5802f63794769",
                "transactionIndex": "0x1",
                "blockNumber": "0xb",
                "nonce": "0x",
                "blockHash": "0xc6ef2fc5426d6ad6fd9e2a26abeab0aa2411b7ab17f30a99d3cb96aed1d1055b",
                "cumulativeGasUsed": "0x0",
                "gasUsed": "0x0",
                "logs": null,
                "contractAddress": null,
                "from": "c9223615095dd5d49796227b0651405380d692c7dacc754fb16b5599092c2f2f",
                "to": "0x5d0312e96092fae4e857e7726c4a84774c2f6e5d",
                "value": "de0b6b3a7640000",
                "data": "0x"
              },
              "txId": "9354cf3c63f016fe8787707501680f1e2205273ab0c0582776b5802f63794769",
              "txFrom": "c9223615095dd5d49796227b0651405380d692c7dacc754fb16b5599092c2f2f",
              "hash": "9d0ec06f513bec8c8b47c0e5717d7e0e9429ae1cc80484b1710b2227a7ae5623"
            },
            "txId": "9354cf3c63f016fe8787707501680f1e2205273ab0c0582776b5802f63794769",
            "timestamp": 1651139612952,
            "hash": "9d0ec06f513bec8c8b47c0e5717d7e0e9429ae1cc80484b1710b2227a7ae5623",
            "stateId": "9d0ec06f513bec8c8b47c0e5717d7e0e9429ae1cc80484b1710b2227a7ae5623"
          },
          {
            "accountId": "5d0312e96092fae4e857e7726c4a84774c2f6e5d000000000000000000000000",
            "data": {
              "timestamp": 1651139612952,
              "account": {
                "nonce": "00",
                "balance": "3782dace9d900000",
                "stateRoot": {
                  "type": "Buffer",
                  "data": [
                    86,
                    232,
                    31,
                    23,
                    27,
                    204,
                    85,
                    166,
                    255,
                    131,
                    69,
                    230,
                    146,
                    192,
                    248,
                    110,
                    91,
                    72,
                    224,
                    27,
                    153,
                    108,
                    173,
                    192,
                    1,
                    98,
                    47,
                    181,
                    227,
                    99,
                    180,
                    33
                  ]
                },
                "codeHash": {
                  "type": "Buffer",
                  "data": [
                    197,
                    210,
                    70,
                    1,
                    134,
                    247,
                    35,
                    60,
                    146,
                    126,
                    125,
                    178,
                    220,
                    199,
                    3,
                    192,
                    229,
                    0,
                    182,
                    83,
                    202,
                    130,
                    39,
                    59,
                    123,
                    250,
                    216,
                    4,
                    93,
                    133,
                    164,
                    112
                  ]
                }
              },
              "ethAddress": "0x5d0312e96092fae4e857e7726c4a84774c2f6e5d",
              "accountType": 0,
              "hash": "efaefe300900d3f96d408158850225da096a8bc9cffd1cff2f242de34d85dcc8"
            },
            "txId": "9354cf3c63f016fe8787707501680f1e2205273ab0c0582776b5802f63794769",
            "timestamp": 1651139612952,
            "hash": "efaefe300900d3f96d408158850225da096a8bc9cffd1cff2f242de34d85dcc8",
            "stateId": "efaefe300900d3f96d408158850225da096a8bc9cffd1cff2f242de34d85dcc8"
          },
          {
            "accountId": "c9223615095dd5d49796227b0651405380d692c7dacc754fb16b5599092c2f2f",
            "data": {
              "id": "c9223615095dd5d49796227b0651405380d692c7dacc754fb16b5599092c2f2f",
              "accountType": 6,
              "balance": 4,
              "nodeRewardTime": 1651139612952,
              "timestamp": 1651139612952,
              "hash": "14c7ac115ba7b56b5ebeafd24fef1e5df519fb1050c4b545065e368358ae9863"
            },
            "txId": "9354cf3c63f016fe8787707501680f1e2205273ab0c0582776b5802f63794769",
            "timestamp": 1651139612952,
            "hash": "14c7ac115ba7b56b5ebeafd24fef1e5df519fb1050c4b545065e368358ae9863",
            "stateId": "14c7ac115ba7b56b5ebeafd24fef1e5df519fb1050c4b545065e368358ae9863"
          }
        ]
      },
      "4": {
        "2231b1d7": [
          {
            "accountId": "0x2231b1d718b4fcf82404feba2268230cb5600f2bcaaf48e3da930271fe00d28a",
            "data": {
              "timestamp": 1651139615197,
              "ethAddress": "0x2231b1d718b4fcf82404feba2268230cb5600f2bcaaf48e3da930271fe00d28a",
              "accountType": 7,
              "readableReceipt": {
                "transactionHash": "0x2231b1d718b4fcf82404feba2268230cb5600f2bcaaf48e3da930271fe00d28a",
                "transactionIndex": "0x1",
                "blockNumber": "0xb",
                "nonce": "0x",
                "blockHash": "0xc6ef2fc5426d6ad6fd9e2a26abeab0aa2411b7ab17f30a99d3cb96aed1d1055b",
                "cumulativeGasUsed": "0x0",
                "gasUsed": "0x0",
                "logs": null,
                "contractAddress": null,
                "from": "3065208b9e54d36617597bafb589993dfa2a6f483634c677912c086ec3b45659",
                "to": "0x8af0d431acc6242c74164ac779894584dd110323",
                "value": "de0b6b3a7640000",
                "data": "0x"
              },
              "txId": "2231b1d718b4fcf82404feba2268230cb5600f2bcaaf48e3da930271fe00d28a",
              "txFrom": "3065208b9e54d36617597bafb589993dfa2a6f483634c677912c086ec3b45659",
              "hash": "ca3b2cf426fdb0fea7bc888db53dad5cd694f9c08401707acd85675175c6c8b8"
            },
            "txId": "2231b1d718b4fcf82404feba2268230cb5600f2bcaaf48e3da930271fe00d28a",
            "timestamp": 1651139615197,
            "hash": "ca3b2cf426fdb0fea7bc888db53dad5cd694f9c08401707acd85675175c6c8b8",
            "stateId": "ca3b2cf426fdb0fea7bc888db53dad5cd694f9c08401707acd85675175c6c8b8"
          },
          {
            "accountId": "3065208b9e54d36617597bafb589993dfa2a6f483634c677912c086ec3b45659",
            "data": {
              "id": "3065208b9e54d36617597bafb589993dfa2a6f483634c677912c086ec3b45659",
              "accountType": 6,
              "balance": 4,
              "nodeRewardTime": 1651139615197,
              "timestamp": 1651139615197,
              "hash": "a700d234f8727271de9abbccfaa3d3b348c9baaa444cb6047809a731d39cc54d"
            },
            "txId": "2231b1d718b4fcf82404feba2268230cb5600f2bcaaf48e3da930271fe00d28a",
            "timestamp": 1651139615197,
            "hash": "a700d234f8727271de9abbccfaa3d3b348c9baaa444cb6047809a731d39cc54d",
            "stateId": "a700d234f8727271de9abbccfaa3d3b348c9baaa444cb6047809a731d39cc54d"
          },
          {
            "accountId": "8af0d431acc6242c74164ac779894584dd110323000000000000000000000000",
            "data": {
              "timestamp": 1651139615197,
              "account": {
                "nonce": "00",
                "balance": "3782dace9d900000",
                "stateRoot": {
                  "type": "Buffer",
                  "data": [
                    86,
                    232,
                    31,
                    23,
                    27,
                    204,
                    85,
                    166,
                    255,
                    131,
                    69,
                    230,
                    146,
                    192,
                    248,
                    110,
                    91,
                    72,
                    224,
                    27,
                    153,
                    108,
                    173,
                    192,
                    1,
                    98,
                    47,
                    181,
                    227,
                    99,
                    180,
                    33
                  ]
                },
                "codeHash": {
                  "type": "Buffer",
                  "data": [
                    197,
                    210,
                    70,
                    1,
                    134,
                    247,
                    35,
                    60,
                    146,
                    126,
                    125,
                    178,
                    220,
                    199,
                    3,
                    192,
                    229,
                    0,
                    182,
                    83,
                    202,
                    130,
                    39,
                    59,
                    123,
                    250,
                    216,
                    4,
                    93,
                    133,
                    164,
                    112
                  ]
                }
              },
              "ethAddress": "0x8af0d431acc6242c74164ac779894584dd110323",
              "accountType": 0,
              "hash": "efaefe300900d3f96d408158850225da096a8bc9cffd1cff2f242de34d85dcc8"
            },
            "txId": "2231b1d718b4fcf82404feba2268230cb5600f2bcaaf48e3da930271fe00d28a",
            "timestamp": 1651139615197,
            "hash": "efaefe300900d3f96d408158850225da096a8bc9cffd1cff2f242de34d85dcc8",
            "stateId": "efaefe300900d3f96d408158850225da096a8bc9cffd1cff2f242de34d85dcc8"
          }
        ]
      },
      "5": {},
      "6": {},
      "7": {
        "9354cf3c": [
          {
            "accountId": "0x9354cf3c63f016fe8787707501680f1e2205273ab0c0582776b5802f63794769",
            "data": {
              "timestamp": 1651139612952,
              "ethAddress": "0x9354cf3c63f016fe8787707501680f1e2205273ab0c0582776b5802f63794769",
              "accountType": 7,
              "readableReceipt": {
                "transactionHash": "0x9354cf3c63f016fe8787707501680f1e2205273ab0c0582776b5802f63794769",
                "transactionIndex": "0x1",
                "blockNumber": "0xb",
                "nonce": "0x",
                "blockHash": "0xc6ef2fc5426d6ad6fd9e2a26abeab0aa2411b7ab17f30a99d3cb96aed1d1055b",
                "cumulativeGasUsed": "0x0",
                "gasUsed": "0x0",
                "logs": null,
                "contractAddress": null,
                "from": "c9223615095dd5d49796227b0651405380d692c7dacc754fb16b5599092c2f2f",
                "to": "0x5d0312e96092fae4e857e7726c4a84774c2f6e5d",
                "value": "de0b6b3a7640000",
                "data": "0x"
              },
              "txId": "9354cf3c63f016fe8787707501680f1e2205273ab0c0582776b5802f63794769",
              "txFrom": "c9223615095dd5d49796227b0651405380d692c7dacc754fb16b5599092c2f2f",
              "hash": "9d0ec06f513bec8c8b47c0e5717d7e0e9429ae1cc80484b1710b2227a7ae5623"
            },
            "txId": "9354cf3c63f016fe8787707501680f1e2205273ab0c0582776b5802f63794769",
            "timestamp": 1651139612952,
            "hash": "9d0ec06f513bec8c8b47c0e5717d7e0e9429ae1cc80484b1710b2227a7ae5623",
            "stateId": "9d0ec06f513bec8c8b47c0e5717d7e0e9429ae1cc80484b1710b2227a7ae5623"
          },
          {
            "accountId": "5d0312e96092fae4e857e7726c4a84774c2f6e5d000000000000000000000000",
            "data": {
              "timestamp": 1651139612952,
              "account": {
                "nonce": "00",
                "balance": "3782dace9d900000",
                "stateRoot": {
                  "type": "Buffer",
                  "data": [
                    86,
                    232,
                    31,
                    23,
                    27,
                    204,
                    85,
                    166,
                    255,
                    131,
                    69,
                    230,
                    146,
                    192,
                    248,
                    110,
                    91,
                    72,
                    224,
                    27,
                    153,
                    108,
                    173,
                    192,
                    1,
                    98,
                    47,
                    181,
                    227,
                    99,
                    180,
                    33
                  ]
                },
                "codeHash": {
                  "type": "Buffer",
                  "data": [
                    197,
                    210,
                    70,
                    1,
                    134,
                    247,
                    35,
                    60,
                    146,
                    126,
                    125,
                    178,
                    220,
                    199,
                    3,
                    192,
                    229,
                    0,
                    182,
                    83,
                    202,
                    130,
                    39,
                    59,
                    123,
                    250,
                    216,
                    4,
                    93,
                    133,
                    164,
                    112
                  ]
                }
              },
              "ethAddress": "0x5d0312e96092fae4e857e7726c4a84774c2f6e5d",
              "accountType": 0,
              "hash": "efaefe300900d3f96d408158850225da096a8bc9cffd1cff2f242de34d85dcc8"
            },
            "txId": "9354cf3c63f016fe8787707501680f1e2205273ab0c0582776b5802f63794769",
            "timestamp": 1651139612952,
            "hash": "efaefe300900d3f96d408158850225da096a8bc9cffd1cff2f242de34d85dcc8",
            "stateId": "efaefe300900d3f96d408158850225da096a8bc9cffd1cff2f242de34d85dcc8"
          },
          {
            "accountId": "c9223615095dd5d49796227b0651405380d692c7dacc754fb16b5599092c2f2f",
            "data": {
              "id": "c9223615095dd5d49796227b0651405380d692c7dacc754fb16b5599092c2f2f",
              "accountType": 6,
              "balance": 4,
              "nodeRewardTime": 1651139612952,
              "timestamp": 1651139612952,
              "hash": "14c7ac115ba7b56b5ebeafd24fef1e5df519fb1050c4b545065e368358ae9863"
            },
            "txId": "9354cf3c63f016fe8787707501680f1e2205273ab0c0582776b5802f63794769",
            "timestamp": 1651139612952,
            "hash": "14c7ac115ba7b56b5ebeafd24fef1e5df519fb1050c4b545065e368358ae9863",
            "stateId": "14c7ac115ba7b56b5ebeafd24fef1e5df519fb1050c4b545065e368358ae9863"
          }
        ]
      },
      "8": {}
    }
  },
  "summary": {
    "parentCycle": "c690e9a51428502398dfde2a660ce07bdd259551dbcd0462ec626399b436b4f1",
    "networkHash": "78c7d4bfca718a92b57a31832c1c8460f43dee960b5f4cf4bbdae3bcce2deb6d",
    "partitionHashes": {},
    "partitionBlobs": {}
  }
}
