{
    "name": "PlayerInputController",
    "maps": [
        {
            "name": "Player",
            "id": "2c5966c9-24cb-408a-855a-8c480a4d3e49",
            "actions": [
                {
                    "name": "Shoot",
                    "type": "PassThrough",
                    "id": "e5d7a253-2180-400c-a0b4-f2190204100b",
                    "expectedControlType": "Button",
                    "processors": "",
                    "interactions": "",
                    "initialStateCheck": false
                },
                {
                    "name": "Movement",
                    "type": "PassThrough",
                    "id": "06730826-7db2-4d6a-8ed7-004a6e37a5e9",
                    "expectedControlType": "Vector2",
                    "processors": "",
                    "interactions": "",
                    "initialStateCheck": false
                },
                {
                    "name": "Next",
                    "type": "Button",
                    "id": "d8858346-9b08-4eb9-84f9-470b67275369",
                    "expectedControlType": "Button",
                    "processors": "",
                    "interactions": "",
                    "initialStateCheck": false
                },
                {
                    "name": "Previous",
                    "type": "Button",
                    "id": "f80cd74e-7e23-48c2-8bcb-5120f60cc8cd",
                    "expectedControlType": "Button",
                    "processors": "",
                    "interactions": "",
                    "initialStateCheck": false
                },
                {
                    "name": "Look",
                    "type": "PassThrough",
                    "id": "5e69951a-b851-44be-8eb2-26ee88f6f39f",
                    "expectedControlType": "Vector2",
                    "processors": "",
                    "interactions": "",
                    "initialStateCheck": false
                },
                {
                    "name": "MousePosition",
                    "type": "PassThrough",
                    "id": "33a8f60e-b7c8-4314-8a62-c4018fda3cb4",
                    "expectedControlType": "Vector2",
                    "processors": "",
                    "interactions": "",
                    "initialStateCheck": false
                },
                {
                    "name": "MouseClick",
                    "type": "PassThrough",
                    "id": "ff604936-78e2-4b14-accf-a007871a4bf4",
                    "expectedControlType": "Button",
                    "processors": "",
                    "interactions": "",
                    "initialStateCheck": false
                }
            ],
            "bindings": [
                {
                    "name": "",
                    "id": "8bd82adb-e230-4267-98f0-a25388c0196a",
                    "path": "<Mouse>/leftButton",
                    "interactions": "Press",
                    "processors": "",
                    "groups": "",
                    "action": "Shoot",
                    "isComposite": false,
                    "isPartOfComposite": false
                },
                {
                    "name": "",
                    "id": "fe0c8f82-74d5-4e3b-9f11-24a683d9c582",
                    "path": "<XInputController>/buttonSouth",
                    "interactions": "Press",
                    "processors": "",
                    "groups": "",
                    "action": "Shoot",
                    "isComposite": false,
                    "isPartOfComposite": false
                },
                {
                    "name": "",
                    "id": "eb9a6601-c88a-4ac6-bcaf-4f6369ee454d",
                    "path": "<XInputController>/buttonWest",
                    "interactions": "Press",
                    "processors": "",
                    "groups": "",
                    "action": "Shoot",
                    "isComposite": false,
                    "isPartOfComposite": false
                },
                {
                    "name": "",
                    "id": "3e1b1e84-31e4-40e3-b1fb-2ecd6c8a82e2",
                    "path": "<Keyboard>/space",
                    "interactions": "Press",
                    "processors": "",
                    "groups": "",
                    "action": "Shoot",
                    "isComposite": false,
                    "isPartOfComposite": false
                },
                {
                    "name": "WASD",
                    "id": "43cfeeda-0ecd-4f2a-bdac-2639007d885f",
                    "path": "2DVector",
                    "interactions": "",
                    "processors": "",
                    "groups": "",
                    "action": "Movement",
                    "isComposite": true,
                    "isPartOfComposite": false
                },
                {
                    "name": "up",
                    "id": "c661276b-114a-466a-81b0-7153e195d3cc",
                    "path": "<Keyboard>/w",
                    "interactions": "",
                    "processors": "",
                    "groups": "",
                    "action": "Movement",
                    "isComposite": false,
                    "isPartOfComposite": true
                },
                {
                    "name": "down",
                    "id": "2cea69c8-7b7d-4274-ba99-f9d9668398eb",
                    "path": "<Keyboard>/s",
                    "interactions": "",
                    "processors": "",
                    "groups": "",
                    "action": "Movement",
                    "isComposite": false,
                    "isPartOfComposite": true
                },
                {
                    "name": "left",
                    "id": "8c70635d-fcc1-47db-a673-1362cb774779",
                    "path": "<Keyboard>/a",
                    "interactions": "",
                    "processors": "",
                    "groups": "",
                    "action": "Movement",
                    "isComposite": false,
                    "isPartOfComposite": true
                },
                {
                    "name": "right",
                    "id": "ece56f14-502c-4670-a577-449b2e07aa5d",
                    "path": "<Keyboard>/d",
                    "interactions": "",
                    "processors": "",
                    "groups": "",
                    "action": "Movement",
                    "isComposite": false,
                    "isPartOfComposite": true
                },
                {
                    "name": "",
                    "id": "d764d5b6-5a16-4886-854a-84820b07d925",
                    "path": "<XInputController>/leftStick",
                    "interactions": "",
                    "processors": "",
                    "groups": "",
                    "action": "Movement",
                    "isComposite": false,
                    "isPartOfComposite": false
                },
                {
                    "name": "",
                    "id": "4299b32c-95ea-4544-b89e-cd536c7d9c23",
                    "path": "<Keyboard>/e",
                    "interactions": "",
                    "processors": "",
                    "groups": "",
                    "action": "Next",
                    "isComposite": false,
                    "isPartOfComposite": false
                },
                {
                    "name": "",
                    "id": "5127527f-3886-4c42-a099-37bd859dceca",
                    "path": "<XInputController>/buttonEast",
                    "interactions": "Press",
                    "processors": "",
                    "groups": "",
                    "action": "Next",
                    "isComposite": false,
                    "isPartOfComposite": false
                },
                {
                    "name": "",
                    "id": "4c83ed9c-4566-4aaf-badc-f10da7afd035",
                    "path": "<Keyboard>/q",
                    "interactions": "",
                    "processors": "",
                    "groups": "",
                    "action": "Previous",
                    "isComposite": false,
                    "isPartOfComposite": false
                },
                {
                    "name": "",
                    "id": "47d8d334-8bb1-4345-b508-7d91e416fa9d",
                    "path": "<XInputController>/buttonNorth",
                    "interactions": "Press",
                    "processors": "",
                    "groups": "",
                    "action": "Previous",
                    "isComposite": false,
                    "isPartOfComposite": false
                },
                {
                    "name": "",
                    "id": "0494b522-6c95-42d0-b754-7d6233b68e4c",
                    "path": "<XInputController>/rightStick",
                    "interactions": "",
                    "processors": "",
                    "groups": "",
                    "action": "Look",
                    "isComposite": false,
                    "isPartOfComposite": false
                },
                {
                    "name": "",
                    "id": "a8479c03-6e31-4b03-accd-d8d1110118d6",
                    "path": "<Mouse>/position",
                    "interactions": "",
                    "processors": "",
                    "groups": "",
                    "action": "MousePosition",
                    "isComposite": false,
                    "isPartOfComposite": false
                },
                {
                    "name": "",
                    "id": "29dfd30d-d3ab-4b36-af17-2d465a36ca9f",
                    "path": "<Mouse>/leftButton",
                    "interactions": "Press",
                    "processors": "",
                    "groups": "",
                    "action": "MouseClick",
                    "isComposite": false,
                    "isPartOfComposite": false
                }
            ]
        }
    ],
    "controlSchemes": []
}