%YAML 1.1
%TAG !u! tag:unity3d.com,2011:
--- !u!114 &11400000
MonoBehaviour:
  m_ObjectHideFlags: 0
  m_CorrespondingSourceObject: {fileID: 0}
  m_PrefabInstance: {fileID: 0}
  m_PrefabAsset: {fileID: 0}
  m_GameObject: {fileID: 0}
  m_Enabled: 1
  m_EditorHideFlags: 0
  m_Script: {fileID: 11500000, guid: af4322c770ffaa141b4cf76ed8a00363, type: 3}
  m_Name: ExampleGameWindow
  m_EditorClassIdentifier: 
  _id: ExampleGameWindow
  _asset:
    m_AssetGUID: fe4732415d574574eba6dcc7f59a4331
    m_SubObjectName: 
    m_SubObjectType: 
    m_EditorAssetChanged: 0
