{
    "name": "SnortingFox.UIWindowExtenject",
    "rootNamespace": "",
    "references": [
        "GUID:9e24947de15b9834991c9d8411ea37cf",
        "GUID:0d8beb7f090555447a6cf5ce9e54dbb4",
        "GUID:f51ebe6a0ceec4240a699833d6309b23",
        "GUID:84651a3751eca9349aac36a66bba901b"
    ],
    "includePlatforms": [],
    "excludePlatforms": [],
    "allowUnsafeCode": false,
    "overrideReferences": false,
    "precompiledReferences": [],
    "autoReferenced": true,
    "defineConstraints": [],
    "versionDefines": [],
    "noEngineReferences": false
}