%YAML 1.1
%TAG !u! tag:unity3d.com,2011:
--- !u!1045 &1
EditorBuildSettings:
  m_ObjectHideFlags: 0
  serializedVersion: 2
  m_Scenes:
  - enabled: 1
    path: Assets/AudioVisualizer/Scenes/AudioPrototypeVisualizer.unity
    guid: 219352a8487493f4ab7f4183f19719d4
  m_configObjects: {}
