<?xml version="1.0" encoding="utf-8"?><!-- Uploaded to: SVG Repo, www.svgrepo.com, Generator: SVG Repo Mixer Tools -->
<svg width="800px" height="800px" viewBox="0 0 24 24" stroke="#000000" fill="none" xmlns="http://www.w3.org/2000/svg">
<path d="M6 12H18M12 6V18" stroke-width="2" stroke-linecap="round" stroke-linejoin="round"/>
</svg>