Division,WeightClassKg,Place,Name,Team,BodyweightKg,Best3SquatKg,Best3BenchKg,Best3DeadliftKg,TotalKg,Equipment,Event,Sex
Boys,51.71,1,Darrian Butler,Denison,50.8,136.08,68.04,151.95,356.07,Single-ply,SBD,M
Boys,51.71,2,Wesley Gage,Paris,51.71,138.35,68.04,140.61,347,Single-ply,SBD,M
Boys,51.71,3,Jeremiah Carino,Ladonia Fannindel,50.08,124.74,65.77,140.61,331.12,Single-ply,SBD,M
Boys,51.71,4,Pablo Gutierrez #1,Mount Pleasant,49.99,120.2,70.31,136.08,326.59,Single-ply,SBD,M
Boys,51.71,5,Oscar Yanez,Sulphur Springs,49.99,113.4,61.23,124.74,299.37,Single-ply,SBD,M
Boys,51.71,6,Austin Caldwell,Wills Point,48.72,99.79,52.16,113.4,265.35,Single-ply,SBD,M
Boys,51.71,7,Alex Rodriguez #8,Sulphur Springs,49.17,102.06,49.9,102.06,254.01,Single-ply,SBD,M
Boys,51.71,8,Kyron Cobb,Wills Point,37.83,61.23,27.22,70.31,158.76,Single-ply,SBD,M
Boys,55.79,1,Joe'ell Morales,Sulphur Springs,54.16,145.15,72.57,136.08,353.8,Single-ply,SBD,M
Boys,55.79,2,Jeremy Cuellar,Denison,53.61,108.86,74.84,136.08,319.78,Single-ply,SBD,M
Boys,55.79,3,Zach Grabanski,Pattonville Prairiland,54.98,124.74,70.31,122.47,317.51,Single-ply,SBD,M
Boys,55.79,4,Bryce Evans,Paris North Lamar,53.89,115.67,63.5,129.27,308.44,Single-ply,SBD,M
Boys,55.79,5,Omar Villegas,Melissa,54.79,120.2,61.23,127.01,308.44,Single-ply,SBD,M
Boys,55.79,6,Weston Aycock,Honey Grove,54.07,106.59,54.43,111.13,272.16,Single-ply,SBD,M
Boys,55.79,7,Luis Ortiz,Wills Point,52.98,95.25,52.16,99.79,247.21,Single-ply,SBD,M
Boys,55.79,8,Joseph Ibarra,Paris,51.98,102.06,65.77,,167.83,Single-ply,SB,M
Boys,59.87,1,Wilson Kirkbride,Denison,59.69,192.78,104.33,199.58,496.68,Single-ply,SBD,M
Boys,59.87,2,Baldemar Carbajal,Sherman,59.24,165.56,106.59,174.63,446.79,Single-ply,SBD,M
Boys,59.87,3,Josh Bolton,Paris North Lamar,58.15,170.1,97.52,172.37,439.98,Single-ply,SBD,M
Boys,59.87,4,Jonathen Alvarez,Sulphur Springs,59.78,172.37,81.65,170.1,424.11,Single-ply,SBD,M
Boys,59.87,5,Gilbert Garcia,Longview Spring Hill,57.24,154.22,92.99,156.49,403.7,Single-ply,SBD,M
Boys,59.87,6,Isaiah Peters,Paris Chisum,59.15,136.08,92.99,147.42,376.48,Single-ply,SBD,M
Boys,59.87,7,Daniel Landaverde,Mount Pleasant,58.15,136.08,74.84,161.03,371.95,Single-ply,SBD,M
Boys,59.87,8,Anqurrus Harris,Paris,58.97,149.69,72.57,140.61,362.87,Single-ply,SBD,M
Boys,59.87,9,Dustin Crabtree,Sulphur Springs,58.88,149.69,65.77,145.15,360.61,Single-ply,SBD,M
Boys,59.87,10,Sam Collins,Paris Chisum,58.79,133.81,81.65,142.88,358.34,Single-ply,SBD,M
Boys,59.87,11,Taylor Dodd,Bogata Rivercrest,59.87,108.86,83.91,136.08,328.85,Single-ply,SBD,M
Boys,59.87,12,Brian Wilson,Paris,59.87,129.27,68.04,129.27,326.59,Single-ply,SBD,M
Boys,59.87,13,Cesar Leija,Bogata Rivercrest,57.15,113.4,70.31,136.08,319.78,Single-ply,SBD,M
Boys,59.87,14,Devin Brunson,Melissa,59.15,106.59,72.57,136.08,315.25,Single-ply,SBD,M
Boys,59.87,DQ,Gage Yeley,Detroit,59.87,,,,,Single-ply,SBD,M
Boys,59.87,DQ,Kyle Humphrey,Sherman,59.87,,,,,Single-ply,SBD,M
Boys,59.87,DQ,Ranger Dollins,Pattonville Prairiland,59.87,,,,,Single-ply,SBD,M
Boys,59.87,DQ,Daytoryah Johnson,Ladonia Fannindel,59.15,117.93,,,,Single-ply,SBD,M
Boys,67.13,1,X-Zavius Gray,Paris,66.04,226.8,124.74,226.8,578.33,Single-ply,SBD,M
Boys,67.13,2,Jake Ratcliff,Denison,65.23,201.85,102.06,192.78,496.68,Single-ply,SBD,M
Boys,67.13,3,Cor'tavius Pruitt,Sulphur Springs,67.13,190.51,104.33,176.9,471.74,Single-ply,SBD,M
Boys,67.13,4,Josh Johnson,Paris North Lamar,65.5,174.63,102.06,181.44,458.13,Single-ply,SBD,M
Boys,67.13,5,Travius Bronner,Paris,63.96,195.04,92.99,158.76,446.79,Single-ply,SBD,M
Boys,67.13,6,Dakota Vanderburg,Paris Chisum,61.87,158.76,95.25,161.03,415.04,Single-ply,SBD,M
Boys,67.13,7,Decorean Willis,Detroit,65.95,133.81,88.45,170.1,392.36,Single-ply,SBD,M
Boys,67.13,8,Trevor Harrell,Wills Point,60.69,136.08,90.72,158.76,385.55,Single-ply,SBD,M
Boys,67.13,9,Joseph Moore,Cooper,65.95,156.49,74.84,149.69,381.02,Single-ply,SBD,M
Boys,67.13,10,Colby Smith,Ladonia Fannindel,64.59,129.27,81.65,161.03,371.95,Single-ply,SBD,M
Boys,67.13,11,Lee Armstrong,Paris Chisum,64.32,127.01,77.11,161.03,365.14,Single-ply,SBD,M
Boys,67.13,12,Trace Smith,Pattonville Prairiland,65.41,124.74,74.84,145.15,344.73,Single-ply,SBD,M
Boys,67.13,13,Jonathan Woods #1,Mount Pleasant,66.77,140.61,65.77,124.74,331.12,Single-ply,SBD,M
Boys,67.13,14,Tyrell Fluellen,Pittsburg,62.41,102.06,70.31,127.01,299.37,Single-ply,SBD,M
Boys,67.13,15,Conner Darnell,Paris North Lamar,62.96,151.95,129.27,,281.23,Single-ply,SB,M
Boys,67.13,DQ,Elijah Robinson,Pattonville Prairiland,63.87,142.88,,,,Single-ply,SBD,M
Boys,74.84,1,Brandon Gillen,Paris Chisum,72.94,231.33,145.15,240.4,616.89,Single-ply,SBD,M
Boys,74.84,2,Joshua Martinez,Mount Pleasant,71.3,208.65,154.22,217.72,580.6,Single-ply,SBD,M
Boys,74.84,3,Tadarius Williams,Paris,73.94,208.65,113.4,188.24,510.29,Single-ply,SBD,M
Boys,74.84,4,Jakerian Brown,Paris,74.57,199.58,117.93,188.24,505.76,Single-ply,SBD,M
Boys,74.84,5,David By,Pittsburg,71.49,181.44,104.33,201.85,487.61,Single-ply,SBD,M
Boys,74.84,6,Vincent Morales,Sulphur Springs,69.4,172.37,108.86,204.12,485.34,Single-ply,SBD,M
Boys,74.84,7,Michael Wallace,Sherman,71.12,181.44,95.25,190.51,467.2,Single-ply,SBD,M
Boys,74.84,8,Tre King,Paris,72.12,192.78,102.06,165.56,460.4,Single-ply,SBD,M
Boys,74.84,9,DeVante Clayton,Sherman,67.68,167.83,95.25,181.44,444.52,Single-ply,SBD,M
Boys,74.84,10,Jeremy Gunther,Paris North Lamar,70.94,161.03,95.25,181.44,437.72,Single-ply,SBD,M
Boys,74.84,11,Jermiane Rogers,Pittsburg,68.58,149.69,106.59,161.03,417.3,Single-ply,SBD,M
Boys,74.84,12,Greg Yarbrough,Paris,70.22,147.42,79.38,181.44,408.23,Single-ply,SBD,M
Boys,74.84,13,Carson Bridges,Sulphur Springs,69.31,154.22,83.91,165.56,403.7,Single-ply,SBD,M
Boys,74.84,14,Brendan Morrow,Ladonia Fannindel,70.4,131.54,86.18,158.76,376.48,Single-ply,SBD,M
Boys,74.84,15,Hunter Jones #1,Paris North Lamar,68.95,136.08,83.91,149.69,369.68,Single-ply,SBD,M
Boys,74.84,16,Layne Miller,Ladonia Fannindel,71.12,117.93,83.91,163.29,365.14,Single-ply,SBD,M
Boys,74.84,17,Marco Morales,Melissa,74.39,136.08,83.91,142.88,362.87,Single-ply,SBD,M
Boys,74.84,18,Tristan Hollon,Cooper,69.31,145.15,68.04,140.61,353.8,Single-ply,SBD,M
Boys,74.84,19,Collin O'Neal,Melissa,71.49,124.74,70.31,131.54,326.59,Single-ply,SBD,M
Boys,74.84,20,Bryan Fritz,Longview Spring Hill,70.03,136.08,61.23,120.2,317.51,Single-ply,SBD,M
Boys,74.84,21,Bradley Davis,Cooper,70.94,108.86,61.23,120.2,290.3,Single-ply,SBD,M
Boys,82.1,1,Eric Pheng,Paris North Lamar,76.11,204.12,120.2,201.85,526.17,Single-ply,SBD,M
Boys,82.1,2,Isaiah Neal,Sulphur Springs,80.1,201.85,106.59,208.65,517.1,Single-ply,SBD,M
Boys,82.1,3,Jaxon Heveron,Paris North Lamar,79.29,190.51,120.2,192.78,503.49,Single-ply,SBD,M
Boys,82.1,4,Josh Hull,Wills Point,79.11,172.37,120.2,192.78,485.34,Single-ply,SBD,M
Boys,82.1,5,Mason Chrisman,Paris North Lamar,75.75,181.44,102.06,188.24,471.74,Single-ply,SBD,M
Boys,82.1,6,Kelsey Smith #2,Paris,80.83,165.56,104.33,185.97,455.86,Single-ply,SBD,M
Boys,82.1,7,Roby Pridemore,Paris Chisum,78.47,163.29,113.4,172.37,449.06,Single-ply,SBD,M
Boys,82.1,8,Keyon Braxton,Ladonia Fannindel,80.92,145.15,92.99,192.78,430.91,Single-ply,SBD,M
Boys,82.1,9,Carlos Martinez #19,Mount Pleasant,81.47,140.61,83.91,156.49,381.02,Single-ply,SBD,M
Boys,82.1,10,Michael Mercer,Pittsburg,79.83,113.4,83.91,158.76,356.07,Single-ply,SBD,M
Boys,82.1,11,Jordan Russell,Paris,80.74,129.27,83.91,138.35,351.53,Single-ply,SBD,M
Boys,82.1,12,Caleb Freeman,Longview Spring Hill,75.39,106.59,45.36,117.93,269.89,Single-ply,SBD,M
Boys,82.1,13,Kyle Carver,Ladonia Fannindel,77.93,81.65,70.31,108.86,260.82,Single-ply,SBD,M
Boys,82.1,DQ,Casey Breeze,Honey Grove,79.47,145.15,,,,Single-ply,SBD,M
Boys,89.81,1,Bowen Kirkbride,Denison,88.18,274.42,149.69,242.67,666.78,Single-ply,SBD,M
Boys,89.81,2,Link Emard,Pittsburg,86.45,195.04,122.47,217.72,535.24,Single-ply,SBD,M
Boys,89.81,3,Kobi Fort,Detroit,84.73,183.7,131.54,208.65,523.9,Single-ply,SBD,M
Boys,89.81,4,Brandon Alverez,Bogata Rivercrest,84.91,215.46,124.74,179.17,519.36,Single-ply,SBD,M
Boys,89.81,5,Hunter Bigelow,Denison,84.91,181.44,104.33,208.65,494.42,Single-ply,SBD,M
Boys,89.81,6,Morgan Landreth,Pattonville Prairiland,82.83,204.12,111.13,176.9,492.15,Single-ply,SBD,M
Boys,89.81,7,Michael Godwin,Paris,87.54,188.24,106.59,174.63,469.47,Single-ply,SBD,M
Boys,89.81,8,Jett Jordan,Longview Spring Hill,84.91,163.29,113.4,165.56,442.25,Single-ply,SBD,M
Boys,89.81,9,Tanner Boggess,Ladonia Fannindel,89.72,154.22,90.72,195.04,439.98,Single-ply,SBD,M
Boys,89.81,10,Eric Kimble,Pittsburg,84.46,172.37,99.79,163.29,435.45,Single-ply,SBD,M
Boys,89.81,11,Tyson James Owens,Melissa,87.63,172.37,90.72,167.83,430.91,Single-ply,SBD,M
Boys,89.81,12,Tommy Gallardo,Melissa,84.91,158.76,90.72,176.9,426.38,Single-ply,SBD,M
Boys,89.81,13,Gunner Vest,Paris,89.72,158.76,95.25,172.37,426.38,Single-ply,SBD,M
Boys,89.81,14,Tyler Woods,Paris Chisum,87,149.69,95.25,163.29,408.23,Single-ply,SBD,M
Boys,89.81,15,Braden Jones,Pittsburg,82.92,149.69,90.72,163.29,403.7,Single-ply,SBD,M
Boys,89.81,16,Ben Boswell,Sherman,89.09,149.69,90.72,154.22,394.63,Single-ply,SBD,M
Boys,89.81,17,Kyson Hogue,Paris,86,131.54,92.99,158.76,383.29,Single-ply,SBD,M
Boys,89.81,18,Martin Flores,Melissa,89.63,140.61,99.79,142.88,383.29,Single-ply,SBD,M
Boys,89.81,19,Caleb Wiley,Paris North Lamar,85.73,156.49,77.11,147.42,381.02,Single-ply,SBD,M
Boys,89.81,20,Brandon Simpson #2,Bogata Rivercrest,87.36,120.2,88.45,165.56,374.21,Single-ply,SBD,M
Boys,89.81,21,Reese Jessee,Bogata Rivercrest,84.1,108.86,68.04,140.61,317.51,Single-ply,SBD,M
Boys,99.79,1,Andrew Turner,Mount Pleasant,94.08,249.48,154.22,249.48,653.17,Single-ply,SBD,M
Boys,99.79,2,Quez Allen,Paris,96.8,240.4,124.74,242.67,607.81,Single-ply,SBD,M
Boys,99.79,3,Tyriq Burnett,Wills Point,96.71,215.46,147.42,240.4,603.28,Single-ply,SBD,M
Boys,99.79,4,Sloan Rodburg,Wills Point,98.25,208.65,149.69,204.12,562.45,Single-ply,SBD,M
Boys,99.79,5,Julien Landin,Denison,99.25,192.78,124.74,210.92,528.44,Single-ply,SBD,M
Boys,99.79,6,Zanderius Hearn,Paris,96.98,215.46,108.86,188.24,512.56,Single-ply,SBD,M
Boys,99.79,7,Brody Bushnell,Wills Point,98.52,195.04,113.4,204.12,512.56,Single-ply,SBD,M
Boys,99.79,8,Ethan Wickersham,Paris North Lamar,94.44,183.7,97.52,163.29,444.52,Single-ply,SBD,M
Boys,99.79,9,Larry Gaston,Melissa,96.71,142.88,95.25,161.03,399.16,Single-ply,SBD,M
Boys,99.79,DQ,Jay Wheeler,Detroit,97.79,,,,,Single-ply,SBD,M
Boys,109.77,1,Ian Blanch,Sulphur Springs,102.33,240.4,136.08,226.8,603.28,Single-ply,SBD,M
Boys,109.77,2,Andrew Hardman,Wills Point,106.05,272.16,131.54,190.51,594.21,Single-ply,SBD,M
Boys,109.77,3,Justin Nichols,Sherman,100.61,226.8,136.08,192.78,555.65,Single-ply,SBD,M
Boys,109.77,4,Riley Russell,Bogata Rivercrest,103.87,222.26,136.08,197.31,555.65,Single-ply,SBD,M
Boys,109.77,5,Antonio Ellis,Paris,109.77,226.8,122.47,197.31,546.58,Single-ply,SBD,M
Boys,109.77,6,Hayden Hayes,Sherman,108.59,188.24,133.81,206.38,528.44,Single-ply,SBD,M
Boys,109.77,7,Bones Davis,Pittsburg,105.69,190.51,113.4,208.65,512.56,Single-ply,SBD,M
Boys,109.77,8,Garrett Holcombe,Denison,105.78,195.04,124.74,183.7,503.49,Single-ply,SBD,M
Boys,109.77,9,Tanner Cornell,Longview Spring Hill,108.5,208.65,122.47,161.03,492.15,Single-ply,SBD,M
Boys,109.77,10,Joey Haley,Paris North Lamar,104.69,181.44,90.72,210.92,483.08,Single-ply,SBD,M
Boys,109.77,11,Cade Blount,Longview Spring Hill,106.5,183.7,90.72,181.44,455.86,Single-ply,SBD,M
Boys,109.77,12,Brayden Yantes,Longview Spring Hill,102.69,170.1,113.4,158.76,442.25,Single-ply,SBD,M
Boys,109.77,13,Antonio Zuniga,Longview Spring Hill,104.69,181.44,77.11,158.76,417.3,Single-ply,SBD,M
Boys,109.77,14,Trenton Blondell,Cooper,102.6,127.01,81.65,149.69,358.34,Single-ply,SBD,M
Boys,109.77,DQ,Brandon Haliday,Paris North Lamar,103.51,,,,,Single-ply,SBD,M
Boys,124.74,1,Dakota Helm,Paris,119.48,226.8,136.08,240.4,603.28,Single-ply,SBD,M
Boys,124.74,2,Josh Schnitker,Sherman,118.75,210.92,158.76,226.8,596.47,Single-ply,SBD,M
Boys,124.74,3,Denim McIntire,Paris Chisum,112.76,235.87,142.88,204.12,582.87,Single-ply,SBD,M
Boys,124.74,4,Antoine Robinson,Denison,111.04,215.46,113.4,215.46,544.31,Single-ply,SBD,M
Boys,124.74,5,Colton Chamberlin,Paris North Lamar,115.67,204.12,136.08,192.78,532.97,Single-ply,SBD,M
Boys,124.74,6,Alec Dickinson,Honey Grove,113.76,215.46,92.99,197.31,505.76,Single-ply,SBD,M
Boys,124.74,7,Jesus Moreno,Paris,122.47,204.12,108.86,185.97,498.95,Single-ply,SBD,M
Boys,124.74,8,Trevor Duggan,Melissa,113.4,195.04,97.52,183.7,476.27,Single-ply,SBD,M
Boys,124.74,9,Rudy Vasquez,Sherman,112.58,165.56,92.99,151.95,410.5,Single-ply,SBD,M
Boys,124.74,10,Cade Rester,Pittsburg,120.93,158.76,90.72,156.49,405.97,Single-ply,SBD,M
Boys,124.74,11,Kyle Brooks,Denison,120.02,142.88,102.06,156.49,401.43,Single-ply,SBD,M
Boys,124.74,12,Brayden Withrow,Cooper,120.38,142.88,86.18,151.95,381.02,Single-ply,SBD,M
Boys,124.74,13,Riley Miner,Paris North Lamar,115.12,124.74,72.57,136.08,333.39,Single-ply,SBD,M
Boys,124.74,DQ,Fragar Armour,Pittsburg,119.2,149.69,124.74,,,Single-ply,SBD,M
Boys,124.74+,1,Byron Muse,Paris,126.01,242.67,167.83,219.99,630.49,Single-ply,SBD,M
Boys,124.74+,2,Jonathan Amaro,Wills Point,129.46,260.82,149.69,208.65,619.15,Single-ply,SBD,M
Boys,124.74+,3,Caleb Johnson,Mount Pleasant,138.35,249.48,142.88,219.99,612.35,Single-ply,SBD,M
Boys,124.74+,4,Damon Lippert,Sherman,128.73,210.92,154.22,204.12,569.26,Single-ply,SBD,M
Boys,124.74+,5,Chris McKinney,Denison,157.49,213.19,113.4,235.87,562.45,Single-ply,SBD,M
Boys,124.74+,6,Colton Chandler,Longview Spring Hill,129.09,210.92,133.81,213.19,557.92,Single-ply,SBD,M
Boys,124.74+,7,Jaden Forbes,Denison,148.23,195.04,117.93,195.04,508.02,Single-ply,SBD,M
Boys,124.74+,8,Braydon Jones,Wills Point,130.73,210.92,97.52,185.97,494.42,Single-ply,SBD,M
Boys,124.74+,9,Jakeb Jonaitis,Sulphur Springs,126.37,226.8,102.06,158.76,487.61,Single-ply,SBD,M
Boys,124.74+,10,Cruz Tobar,Sherman,150.86,185.97,102.06,172.37,460.4,Single-ply,SBD,M
