Division,WeightClassKg,Place,Name,Team,BodyweightKg,Best3SquatKg,Best3BenchKg,Best3DeadliftKg,TotalKg,Equipment,Event,Sex
Boys,51.71,1,Nicholas Perez,Natalia,46.72,61.23,56.7,83.91,201.85,Single-ply,SBD,M
Boys,51.71,2,Clayton Hutto,San Marcos,51.62,58.97,31.75,74.84,165.56,Single-ply,SBD,M
Boys,55.79,1,Jorge Saldana,Natalia,55.38,188.24,92.99,167.83,449.06,Single-ply,SBD,M
Boys,55.79,2,Dominic Mercado,San Antonio Cole,54.66,92.99,58.97,108.86,260.82,Single-ply,SBD,M
Boys,55.79,3,Isaac Trejo,San Marcos,52.57,52.16,43.09,74.84,170.1,Single-ply,SBD,M
Boys,55.79,DQ,Brandon Mercado,San Antonio Cole,55.47,,,,,Single-ply,SBD,M
Boys,55.79,DQ,Maverick Graham,Lytle,54.02,,,,,Single-ply,SBD,M
Boys,59.87,1,Orlando Gonzalez,Natalia,59.74,156.49,83.91,170.1,410.5,Single-ply,SBD,M
Boys,59.87,2,Manual Saldana,Natalia,59.87,145.15,61.23,165.56,371.95,Single-ply,SBD,M
Boys,59.87,3,Oziel Padilla,Natalia,57.97,154.22,70.31,142.88,367.41,Single-ply,SBD,M
Boys,59.87,4,Josh Banda,San Marcos,56.79,86.18,58.97,106.59,251.74,Single-ply,SBD,M
Boys,59.87,5,Jason Berry,Comal Canyon,56.52,68.04,47.63,102.06,217.72,Single-ply,SBD,M
Boys,67.13,DQ,Harley Contreras,Lytle,60.1,,,,,Single-ply,SBD,M
Boys,59.87,DQ,Jonathan Hinshaw,Lytle,59.47,,,,,Single-ply,SBD,M
Boys,67.13,1,Kristopher Imhof,San Antonio Cole,65.14,156.49,102.06,183.7,442.25,Single-ply,SBD,M
Boys,67.13,2,Steven Nicholson,Natalia,66.72,158.76,92.99,174.63,426.38,Single-ply,SBD,M
Boys,67.13,3,Jordan Owens,San Marcos,64.05,86.18,56.7,104.33,247.21,Single-ply,SBD,M
Boys,67.13,DQ,Joseph Lopez #7,Lytle,64.64,,,,,Single-ply,SBD,M
Boys,67.13,DQ,Drake Reyes,Lytle,61.46,,,,,Single-ply,SBD,M
Boys,74.84,1,Nathan Medrano,Lytle,73.44,192.78,129.27,199.58,521.63,Single-ply,SBD,M
Boys,74.84,2,Jerren Scott,San Antonio Cole,73.21,158.76,102.06,192.78,453.59,Single-ply,SBD,M
Boys,74.84,3,Antonio Martinez,Lytle,72.62,147.42,122.47,181.44,451.32,Single-ply,SBD,M
Boys,74.84,4,Caden Fregia,Natalia,70.4,136.08,65.77,124.74,326.59,Single-ply,SBD,M
Boys,74.84,5,Keith Wilkinson,San Antonio Cole,71.58,113.4,79.38,120.2,312.98,Single-ply,SBD,M
Boys,82.1,DQ,Dean Santos,Lytle,75.07,,,,,Single-ply,SBD,M
Boys,82.1,1,Sergio Sanchez,Natalia,81.42,179.17,92.99,165.56,437.72,Single-ply,SBD,M
Boys,82.1,2,Art Contreras,Natalia,75.98,154.22,83.91,174.63,412.77,Single-ply,SBD,M
Boys,82.1,3,Victor Martinez,San Marcos,80.83,136.08,86.18,136.08,358.34,Single-ply,SBD,M
Boys,82.1,4,Joseph Wilburn,San Marcos,77.43,136.08,77.11,136.08,349.27,Single-ply,SBD,M
Boys,82.1,5,Isaiah Manzanares,San Marcos,81.28,138.35,79.38,127.01,344.73,Single-ply,SBD,M
Boys,82.1,6,Mark Bloxham,Comal Canyon,81.92,79.38,56.7,108.86,244.94,Single-ply,SBD,M
Boys,89.81,1,Jonathan Darby,Lytle,86.45,226.8,108.86,242.67,578.33,Single-ply,SBD,M
Boys,89.81,2,Casey Nagey,Comal Canyon,88.27,199.58,124.74,204.12,528.44,Single-ply,SBD,M
Boys,99.79,3,Paul Castro,Lytle,90.04,204.12,127.01,192.78,523.9,Single-ply,SBD,M
Boys,89.81,4,Julian Martinez,Natalia,88.36,154.22,86.18,165.56,405.97,Single-ply,SBD,M
Boys,99.79,5,Jonas Nava,San Marcos,89.95,149.69,77.11,174.63,401.43,Single-ply,SBD,M
Boys,89.81,6,Peter Billilobos,Natalia,87.45,151.95,70.31,147.42,369.68,Single-ply,SBD,M
Boys,89.81,7,Jose Olivieri,San Antonio Cole,87.5,115.67,74.84,136.08,326.59,Single-ply,SBD,M
Boys,99.79,1,Zach Nelson,Comal Canyon,92.49,183.7,129.27,197.31,510.29,Single-ply,SBD,M
Boys,99.79,2,Tyler Mamere,San Antonio Cole,97.34,172.37,122.47,192.78,487.61,Single-ply,SBD,M
Boys,99.79,3,Ricardo Garcia,Comal Canyon,99.65,158.76,74.84,170.1,403.7,Single-ply,SBD,M
Boys,99.79,4,Jorge Riojas,San Marcos,97.11,131.54,90.72,149.69,371.95,Single-ply,SBD,M
Boys,99.79,5,Trevor Hopkins,Comal Canyon,96.12,92.99,104.33,161.03,358.34,Single-ply,SBD,M
Boys,109.77,1,Andre Hernandez,Natalia,105.73,226.8,120.2,229.06,576.06,Single-ply,SBD,M
Boys,109.77,2,Jacob Caldera,San Antonio Cole,106.41,215.46,138.35,174.63,528.44,Single-ply,SBD,M
Boys,109.77,3,Abraham Mayo,San Antonio Cole,102.24,163.29,113.4,172.37,449.06,Single-ply,SBD,M
Boys,109.77,4,Joshua Heiser,Comal Canyon,100.33,158.76,83.91,158.76,401.43,Single-ply,SBD,M
Boys,124.74,5,Antonio Castro,Comal Canyon,109.95,106.59,86.18,136.08,328.85,Single-ply,SBD,M
Boys,124.74,1,Oscar Flores,Comal Canyon,117.62,265.35,151.95,242.67,659.98,Single-ply,SBD,M
Boys,124.74,2,Joshua Macat,Lytle,118.84,254.01,147.42,233.6,635.03,Single-ply,SBD,M
Boys,124.74,3,Richard Pacheco,Natalia,116.44,204.12,124.74,229.06,557.92,Single-ply,SBD,M
Boys,124.74,4,Santiago Lejia,Natalia,111.27,188.24,111.13,188.24,487.61,Single-ply,SBD,M
Boys,124.74,5,Oliver Terrazos,Comal Canyon,112.54,161.03,74.84,136.08,371.95,Single-ply,SBD,M
Boys,124.74,6,Elijah Terrazos,Comal Canyon,118.16,136.08,83.91,136.08,356.07,Single-ply,SBD,M
Boys,124.74+,1,Ray Navarro,Natalia,132.49,251.74,106.59,229.06,587.4,Single-ply,SBD,M
Boys,124.74+,2,Jon Lara,Natalia,134.99,192.78,108.86,190.51,492.15,Single-ply,SBD,M
Boys,124.74+,3,Jonah Masters,San Antonio Cole,127.23,181.44,106.59,201.85,489.88,Single-ply,SBD,M
Boys,124.74+,4,Josh Urrutia,San Marcos,130.68,145.15,124.74,156.49,426.38,Single-ply,SBD,M
Boys,124.74+,5,Nick Dela Rosa,San Marcos,139.25,127.01,65.77,136.08,328.85,Single-ply,SBD,M
Boys,124.74+,DQ,Jonathan Turner,Three Rivers,162.11,,,,,Single-ply,SBD,M
