Place,Name,Sex,Event,Division,WeightClassKg,Equipment,BirthYear,Team,State,BodyweightKg,Squat1Kg,Squat2Kg,Squat3Kg,Best3SquatKg,Bench1Kg,Bench2Kg,Bench3Kg,Best3BenchKg,Deadlift1Kg,Deadlift2Kg,Deadlift3Kg,Best3DeadliftKg,TotalKg,Age,BirthDate
1,Rebecca Miracle,F,B,FR-Y3,69,Raw,2007,,MI,64.6,,,,,-35,40,45,45,,,,,45,,
1,Kailee Carr,F,SBD,FR-Jr,52,Raw,2001,McKendree University Powerlifting,MO,51.4,97.5,-107.5,-110,97.5,62.5,65,-70,65,120,130,-145,130,292.5,,
1,Julianna King,F,SBD,FR-Jr,76,Raw,2000,,MI,73.3,147.5,155,-162.5,155,70,75,-80,75,157.5,165,177.5,177.5,407.5,,
1,Morgan Gilliam,F,SBD,FR-Jr,84,Raw,2000,,MI,83.8,152.5,165,-167.5,165,77.5,82.5,85,85,157.5,-167.5,-167.5,157.5,407.5,,
1,Lauren Harrigan,F,SBD,FR-M1a,52,Raw,1978,,MI,51,75,77.5,-82.5,77.5,55,60,65,65,95,100,107.5,107.5,250,,
1,Tanya Marsh,F,SBD,FR-M1a,63,Raw,1979,,MI,62,75,-85,-85,75,52.5,57.5,60,60,110,117.5,122.5,122.5,257.5,,
1,Joanne Preston,F,SBD,FR-M1a,76,Raw,1980,,MI,75.3,77.5,82.5,85,85,47.5,50,55,55,105,112.5,117.5,117.5,257.5,,
1,Rita Metzner,F,SBD,FR-M3a,57,Raw,1960,,MI,52.5,62.5,67.5,70,70,30,32.5,-35,32.5,80,82.5,-90,82.5,185,,
1,Lauren Harrigan,F,SBD,FR-O,52,Raw,1978,,MI,51,75,77.5,-82.5,77.5,55,60,65,65,95,100,107.5,107.5,250,,
1,Allison Kojima,F,SBD,FR-O,63,Raw,2000,,WA,63,-105,-105,105,105,65,70,-72.5,70,137.5,-147.5,150,150,325,,
2,Sarah Hosinski,F,SBD,FR-O,63,Raw,1997,Midwest Power,IN,61.6,70,80,95,95,50,57.5,60,60,82.5,102.5,120,120,275,,
3,Kelly Taylor,F,SBD,FR-O,63,Raw,1987,,MI,61.5,-92.5,92.5,100,100,-57.5,57.5,-62.5,57.5,100,105,112.5,112.5,270,,
4,Lauryn King,F,SBD,FR-O,63,Raw,1986,,MI,57.3,62.5,65,70,70,35,37.5,40,40,75,80,82.5,82.5,192.5,,
1,Alyssa Gildea,F,SBD,FR-O,69,Raw,1985,,MI,67.2,132.5,-140,-145,132.5,72.5,77.5,-80,77.5,147.5,155,162.5,162.5,372.5,,
2,Jessica Vichinsky,F,SBD,FR-O,69,Raw,1987,,MI,67.5,102.5,110,117.5,117.5,57.5,62.5,-65,62.5,147.5,155,162.5,162.5,342.5,,
3,Samantha Wallace,F,SBD,FR-O,69,Raw,1993,,MI,68.1,-82.5,-90,90,90,-55,60,-67.5,60,97.5,112.5,135,135,285,,
4,Taryn Schram,F,SBD,FR-O,69,Raw,1982,,MI,66.1,62.5,65,70,70,-47.5,47.5,-52.5,47.5,70,77.5,85,85,202.5,,
1,Julianna King,F,SBD,FR-O,76,Raw,2000,,MI,73.3,147.5,155,-162.5,155,70,75,-80,75,157.5,165,177.5,177.5,407.5,,
2,Blake Newman #2,F,SBD,FR-O,76,Raw,1997,,MI,75.4,100,107.5,-112.5,107.5,52.5,57.5,-60,57.5,112.5,120,127.5,127.5,292.5,,
3,Joanne Preston,F,SBD,FR-O,76,Raw,1980,,MI,75.3,77.5,82.5,85,85,47.5,50,55,55,105,112.5,117.5,117.5,257.5,,
4,Megan Schuur,F,SBD,FR-O,76,Raw,2002,,MI,70.1,82.5,90,-97.5,90,47.5,-52.5,-52.5,47.5,112.5,117.5,-122.5,117.5,255,,
5,Justine Long,F,SBD,FR-O,76,Raw,1992,,MI,74.4,-75,75,85,85,55,57.5,-60,57.5,82.5,87.5,95,95,237.5,,
DQ,Ashley Hoffman,F,SBD,FR-O,76,Raw,1987,,MI,75.2,-125,-130,-130,,,,,,,,,,,,
1,Morgan Gilliam,F,SBD,FR-O,84,Raw,2000,,MI,83.8,152.5,165,-167.5,165,77.5,82.5,85,85,157.5,-167.5,-167.5,157.5,407.5,,
1,Cherryl Zekeng,F,SBD,FR-O,84+,Raw,1989,,MI,95,140,-150,-155,140,77.5,82.5,-85,82.5,182.5,195,205,205,427.5,,
1,Natalie Gilliam,F,SBD,FR-T1,69,Raw,2006,,MI,63.4,70,77.5,82.5,82.5,37.5,42.5,47.5,47.5,85,95,102.5,102.5,232.5,,
1,Kaydence Jacobs,F,SBD,FR-T1,84,Raw,2007,Midwest Power,MI,81.2,62.5,-77.5,105,105,35,37.5,42.5,42.5,62.5,70,-82.5,70,217.5,,
1,Megan Schuur,F,SBD,FR-T3,76,Raw,2002,,MI,70.1,82.5,90,-97.5,90,47.5,-52.5,-52.5,47.5,112.5,117.5,-122.5,117.5,255,,
1,Emma Strefling,F,SBD,FR-T3,84,Raw,2003,Midwest Power,MI,79.6,82.5,92.5,105,105,50,-55,-55,50,97.5,105,112.5,112.5,267.5,,
1,Kirsty Aguilar,F,SBD,FW-O,63,Wraps,1990,,KY,59.1,87.5,-92.5,-92.5,87.5,42.5,45,47.5,47.5,85,90,97.5,97.5,232.5,,
1,Rebecca Miracle,F,SBD,FR-Y3,69,Raw,2007,,MI,64.6,-75,80,-85,80,-35,40,45,45,85,92.5,97.5,97.5,222.5,,
1,Elizabeth Michelakis,F,SBD,F-T1,84,Single-ply,2005,Midwest Power,MI,81.5,77.5,82.5,-87.5,82.5,35,40,42.5,42.5,92.5,102.5,112.5,112.5,237.5,,
1,Ryan-Cristofer Curamen,M,SBD,MR-Jr,59,Raw,2001,,MI,58.9,132.5,145,155,155,90,102.5,107.5,107.5,155,162.5,-175,162.5,425,,
1,Senan Haque,M,SBD,MR-Jr,66,Raw,2001,,MI,65.4,150,157.5,162.5,162.5,95,102.5,105,105,185,197.5,205,205,472.5,,
1,Jacob Doehring,M,SBD,MR-Jr,74,Raw,1998,,IL,73.3,170,175,-180,175,-110,115,120,120,190,200,210,210,505,,
2,Ethan Mccoy,M,SBD,MR-Jr,74,Raw,1998,,IL,74,-145,147.5,-150,147.5,82.5,87.5,92.5,92.5,192.5,-200,-205,192.5,432.5,,
1,Bryce Burk,M,SBD,MR-Jr,83,Raw,1998,,IL,76,162.5,170,172.5,172.5,87.5,95,97.5,97.5,197.5,210,215,215,485,,
1,Chase Murray,M,SBD,MR-Jr,93,Raw,1997,,IL,91.2,185,200,210,210,130,137.5,142.5,142.5,247.5,265,282.5,282.5,635,,
2,Nathan Stoll,M,SBD,MR-Jr,93,Raw,1998,,IN,86.7,165,177.5,185,185,107.5,120,-125,120,227.5,247.5,257.5,257.5,562.5,,
3,Lucas Thompson,M,SBD,MR-Jr,93,Raw,2001,,MI,91.5,170,177.5,185,185,95,102.5,-110,102.5,177.5,182.5,187.5,187.5,475,,
1,Ryan Montoya,M,SBD,MR-Jr,105,Raw,2000,,MI,103.7,165,177.5,187.5,187.5,115,125,-130,125,165,175,187.5,187.5,500,,
1,Hayden Sontag,M,SBD,MR-Jr,120,Raw,2000,,IL,105.1,187.5,195,-207.5,195,-125,125,127.5,127.5,225,242.5,-250,242.5,565,,
1,Anthony Cerda,M,SBD,MR-Jr,120+,Raw,1998,,MI,146,257.5,272.5,280,280,157.5,167.5,-175,167.5,272.5,287.5,-290,287.5,735,,
2,Carter Conover,M,SBD,MR-Jr,120+,Raw,2001,,MI,131.7,240,250,-260,250,-145,150,160,160,227.5,235,-240,235,645,,
1,Jonathan Rutledge,M,SBD,MR-M1a,105,Raw,1979,,MI,99,157.5,167.5,177.5,177.5,115,120,-130,120,207.5,217.5,232.5,232.5,530,,
1,Kirk Wiley,M,SBD,MR-M2b,105,Raw,1965,,MI,104.3,200,225,-245,225,107.5,117.5,120,120,200,225,-227.5,225,570,,
1,James Bronke,M,SBD,MR-M4a,105,Raw,1950,,MI,102.5,110,120,-122.5,120,-85,85,-87.5,85,130,137.5,-145,137.5,342.5,,
1,Ryan-Cristofer Curamen,M,SBD,MR-O,59,Raw,2001,,MI,58.9,132.5,145,155,155,90,102.5,107.5,107.5,155,162.5,-175,162.5,425,,
1,Joshua Bane,M,SBD,MR-O,66,Raw,1987,,MI,64.5,140,155,162.5,162.5,105,115,122.5,122.5,185,195,205,205,490,,
2,Senan Haque,M,SBD,MR-O,66,Raw,2001,,MI,65.4,150,157.5,162.5,162.5,95,102.5,105,105,185,197.5,205,205,472.5,,
3,Jacob Sansburn,M,SBD,MR-O,66,Raw,1998,,MI,65.3,165,175,-177.5,175,85,87.5,-92.5,87.5,172.5,182.5,187.5,187.5,450,,
4,AJ Shenfeld,M,SBD,MR-O,66,Raw,2002,,MI,65.2,115,125,-137.5,125,82.5,-87.5,-87.5,82.5,160,175,182.5,182.5,390,,
1,Jacob Doehring,M,SBD,MR-O,74,Raw,1998,,IL,73.3,170,175,-180,175,-110,115,120,120,190,200,210,210,505,,
2,Eric Ballou,M,SBD,MR-O,74,Raw,1987,,IN,72.9,165,175,-185,175,125,-130,-130,125,180,-182.5,-182.5,180,480,,
3,Ethan Mccoy,M,SBD,MR-O,74,Raw,1998,,IL,74,-145,147.5,-150,147.5,82.5,87.5,92.5,92.5,192.5,-200,-205,192.5,432.5,,
4,Enzo Bandemehr,M,SBD,MR-O,74,Raw,2005,,MI,73.2,102.5,107.5,112.5,112.5,-85,95,97.5,97.5,125,137.5,145,145,355,,
1,Nolan O'Neil,M,SBD,MR-O,83,Raw,2000,,IL,82.4,180,195,205,205,115,125,-130,125,-210,227.5,240,240,570,,
2,Aaron Flores #1,M,SBD,MR-O,83,Raw,1992,,OH,81.7,172.5,177.5,182.5,182.5,95,100,-105,100,217.5,225,230,230,512.5,,
3,Bryce Burk,M,SBD,MR-O,83,Raw,1998,,IL,76,162.5,170,172.5,172.5,87.5,95,97.5,97.5,197.5,210,215,215,485,,
4,Anthony Dumity,M,SBD,MR-O,83,Raw,2003,,MI,80.7,150,157.5,165,165,92.5,102.5,-107.5,102.5,162.5,182.5,-187.5,182.5,450,,
5,Easton Parent,M,SBD,MR-O,83,Raw,2002,,MI,79.8,127.5,140,152.5,152.5,-87.5,90,102.5,102.5,165,-175,-175,165,420,,
1,Mars Watkins,M,SBD,MR-O,93,Raw,1997,,IN,92.1,232.5,245,-250,245,152.5,162.5,172.5,172.5,257.5,265,272.5,272.5,690,,
2,John Admiraal,M,SBD,MR-O,93,Raw,1995,,MI,92.3,225,237.5,245,245,150,157.5,-162.5,157.5,240,255,262.5,262.5,665,,
3,Robert Millar,M,SBD,MR-O,93,Raw,1983,,MI,91.9,185,195,200,200,-107.5,107.5,115,115,215,220,-227.5,220,535,,
4,Cory Foglesong,M,SBD,MR-O,93,Raw,1988,,MI,90.7,142.5,150,165,165,97.5,102.5,110,110,170,180,192.5,192.5,467.5,,
1,Nathan Hamp,M,SBD,MR-O,105,Raw,1987,,MI,103.4,220,227.5,242.5,242.5,137.5,142.5,147.5,147.5,232.5,247.5,-250,247.5,637.5,,
2,Caleb Grummet,M,SBD,MR-O,105,Raw,1981,,MI,104.5,220,-237.5,242.5,242.5,115,-127.5,-130,115,202.5,210,220,220,577.5,,
3,Kirk Wiley,M,SBD,MR-O,105,Raw,1965,,MI,104.3,200,225,-245,225,107.5,117.5,120,120,200,225,-227.5,225,570,,
4,Jonathan Rutledge,M,SBD,MR-O,105,Raw,1979,,MI,99,157.5,167.5,177.5,177.5,115,120,-130,120,207.5,217.5,232.5,232.5,530,,
5,Jamie Tierney,M,SBD,MR-O,105,Raw,1984,,MI,102.9,152.5,-165,-165,152.5,-102.5,107.5,115,115,170,177.5,195,195,462.5,,
1,Jesse Norman,M,SBD,MR-O,120,Raw,1992,,MI,112.5,272.5,287.5,302.5,302.5,185,192.5,200,200,250,265,277.5,277.5,780,,
2,Jose Salinas,M,SBD,MR-O,120,Raw,1997,,IN,119.3,242.5,260,275,275,185,195,-207.5,195,237.5,250,265,265,735,,
3,Alexander Walters,M,SBD,MR-O,120,Raw,1995,,IN,119.8,240,255,-262.5,255,150,-155,-155,150,275,290,-295,290,695,,
4,Gabe Madgwick,M,SBD,MR-O,120,Raw,2002,,MI,112,175,185,197.5,197.5,112.5,120,127.5,127.5,190,207.5,-227.5,207.5,532.5,,
1,Tristan Howard,M,SBD,MR-O,120+,Raw,1997,,MI,138,260,282.5,-292.5,282.5,160,175,-185,175,272.5,295,-307.5,295,752.5,,
2,Anthony Cerda,M,SBD,MR-O,120+,Raw,1998,,MI,146,257.5,272.5,280,280,157.5,167.5,-175,167.5,272.5,287.5,-290,287.5,735,,
3,Austin Cooper #1,M,SBD,MR-O,120+,Raw,1989,,MI,143.4,-255,255,260,260,185,187.5,192.5,192.5,242.5,250,-255,250,702.5,,
1,Vernon Riggins,M,SBD,MR-T1,53,Raw,2006,Midwest Power,MI,46.9,45,55,65,65,35,-40,40,40,67.5,82.5,97.5,97.5,202.5,,
2,Brady Baker,M,SBD,MR-T1,53,Raw,2007,Midwest Power,MI,41.9,47.5,57.5,-65,57.5,32.5,37.5,42.5,42.5,67.5,80,85,85,185,,
1,Paul Hess III,M,SBD,MR-T1,74,Raw,2007,Midwest Power,MI,70.8,-135,135,162.5,162.5,92.5,-107.5,107.5,107.5,145,185,-195,185,455,,
1,Ronan Hussar,M,SBD,MR-T2,74,Raw,2003,,IL,70.7,100,115,125,125,80,87.5,95,95,160,175,190,190,410,,
2,Enzo Bandemehr,M,SBD,MR-T2,74,Raw,2005,,MI,73.2,102.5,107.5,112.5,112.5,-85,95,97.5,97.5,125,137.5,145,145,355,,
1,Colin Hess,M,SBD,MR-T2,83,Raw,2003,Midwest Power,MI,81.4,142.5,165,185,185,102.5,112.5,-122.5,112.5,165,192.5,-207.5,192.5,490,,
2,Hunter Crowe,M,SBD,MR-T2,83,Raw,2004,,MI,78.5,162.5,165,-180,165,105,110,117.5,117.5,165,185,-220,185,467.5,,
1,Aiden Mcconnell,M,SBD,MR-T2,120,Raw,2005,,MI,116.8,147.5,150,-155,150,-145,150,-152.5,150,185,197.5,-202.5,197.5,497.5,,
2,Jeffrey Thomas,M,SBD,MR-T2,120,Raw,2004,Midwest Power,MI,112,82.5,90,112.5,112.5,62.5,70,-77.5,70,82.5,112.5,127.5,127.5,310,,
1,Owen Powers,M,SBD,MR-T2,120+,Raw,2005,,MI,145.7,220,227.5,,227.5,122.5,-135,-135,122.5,-212.5,212.5,217.5,217.5,567.5,,
1,AJ Shenfeld,M,SBD,MR-T3,66,Raw,2002,,MI,65.2,115,125,-137.5,125,82.5,-87.5,-87.5,82.5,160,175,182.5,182.5,390,,
1,Anthony Dumity,M,SBD,MR-T3,83,Raw,2003,,MI,80.7,150,157.5,165,165,92.5,102.5,-107.5,102.5,162.5,182.5,-187.5,182.5,450,,
2,Easton Parent,M,SBD,MR-T3,83,Raw,2002,,MI,79.8,127.5,140,152.5,152.5,-87.5,90,102.5,102.5,165,-175,-175,165,420,,
1,Gabe Madgwick,M,SBD,MR-T3,120,Raw,2002,,MI,112,175,185,197.5,197.5,112.5,120,127.5,127.5,190,207.5,-227.5,207.5,532.5,,
1,Chad Kennedy,M,SBD,MW-M1b,105,Wraps,1975,,IN,104.9,192.5,205,215,215,140,-150,150,150,192.5,200,212.5,212.5,577.5,,
1,Benjamin Bedeck,M,SBD,MW-O,93,Wraps,1990,,MI,89.3,235,250,265,265,165,175,-185,175,215,227.5,237.5,237.5,677.5,,
1,Dustin Thomas,M,SBD,MW-O,105,Wraps,1994,,MI,102,-212.5,217.5,-230,217.5,112.5,-115,-117.5,112.5,220,230,240,240,570,,
1,Jacob Iwaniuk,M,SBD,MR-Y3,53,Raw,2008,Midwest Power,MI,50.5,30,35,40,40,25,30,35,35,47.5,57.5,62.5,62.5,137.5,,
1,Rebecca Miracle,F,BD,FR-Y3,69,Raw,2007,,MI,64.6,,,,,-35,40,45,45,85,92.5,97.5,97.5,142.5,,
1,Lucas Thompson,M,BD,MR-Jr,93,Raw,2001,,MI,91.5,,,,,95,102.5,-110,102.5,177.5,182.5,187.5,187.5,290,,
1,James Bronke,M,BD,MR-M4a,105,Raw,1950,,MI,102.5,,,,,-85,85,-87.5,85,130,137.5,-145,137.5,222.5,,
