﻿Ergebnisse Bank Mönchenfrei 08
Junioren -95 kg                  K.-gewicht   1       2       3       Relativ   Platz
D. Hasche                        85,5 kg      120     130     135     44,5      1
T. Kusche                        83,5 kg      120     130     130     36,5      2
Junioren -115 kg
N. Stoll                         97,5 kg      175     180     185     87,5      1
D. Thalheim                      102 kg       162,5   167,5   172,5   70,5      2
S. Schubert                      96 kg        125     130     135     39        3
Aktive -75 kg
S. Keller                        67 kg        125     135     140     73        1
T. Schmidt                       74,5 kg      120     130     135     60,5      2
S. Becker                        74,5 kg      115     120     125     50,5      3
Aktive -95 kg
N . Schmidt                      93 kg        170     182,5   190     97        1
M . Löver                        80,5 kg      140     147,5   152,5   72        2
J. Fügner                        85,5 kg      120     130     150     64,5      3
K. Haderk                        81,5 kg      132,5   140     145     58,5      4
M. Bonk                          95 kg        140     147,5   152,5   57,5      5
A. Rüger                         88,5 kg      125     132,5   140     51,5      6
H. Fritzsch                      89,5 kg      120     130     137,5   48        7
A. John                          85,5 kg      115     120     120     29,5      8
Aktive -115 kg
M. Jentzsch                      110,5 kg     200     210     222,5   112       1
R. Uhlig                         99,5 kg      180     200     210     110,5     2
L. Göhler                        105,5 kg     170     180     185     74,5      3
T. Maltzen                       97,5 kg      160     165     170     72,5      4
Aktive +115 kg
M. Schmidtke                     118 kg       200     220     227,5   109,5     1
K.-U. Werner                     122 kg       187,5   192,5   197,5   75,5      2
D. Schmalz                       122 kg       185     190     195     73        3
V. Kayser                        144 kg       170     185     195     51        4
Masters I -95 kg
M. Huster                        84 kg        150     160     170     86        1
F. Butze                         91,5 kg      145     152,5   157,5   66        2
F. Bock                          77,5 kg      135     142,5   147,5   65        3
U. Muster                        89 kg        95      102,5   105     16        4
Masters I -115 kg
U. Haase                         98 kg        190     200     210     112       1
R. Döhne                         108,5 kg     160     175     190     66,5      2
Masters II -75 kg
M. Geipel                        73,5 kg      105     115     120     46,5      1
Master II +115 kg
J. Marek                         117,5 kg     210     220     230     112,5     1
Seite 1
