{
  "project_info": {
    "project_number": "536381560836",
    "firebase_url": "https://scholarship-chat.firebaseio.com",
    "project_id": "scholarship-chat",
    "storage_bucket": "scholarship-chat.appspot.com"
  },
  "client": [
    {
      "client_info": {
        "mobilesdk_app_id": "1:536381560836:android:c845fd990045fe4a",
        "android_client_info": {
          "package_name": "com.udicity.shams.scholarshipchat"
        }
      },
      "oauth_client": [
        {
          "client_id": "536381560836-lulbqoc2te0u8o0pegsm1qjof9vm2jt3.apps.googleusercontent.com",
          "client_type": 1,
          "android_info": {
            "package_name": "com.udicity.shams.scholarshipchat",
            "certificate_hash": "c496c3587d364eb26846df005d3ea90bde45e58c"
          }
        },
        {
          "client_id": "536381560836-2dnvvma56omptrvfuj89f3qmtgejln6p.apps.googleusercontent.com",
          "client_type": 3
        }
      ],
      "api_key": [
        {
          "current_key": "AIzaSyBQibln8h-qW4aHcHa59A_260OR9Liivbk"
        }
      ],
      "services": {
        "analytics_service": {
          "status": 1
        },
        "appinvite_service": {
          "status": 2,
          "other_platform_oauth_client": [
            {
              "client_id": "536381560836-2dnvvma56omptrvfuj89f3qmtgejln6p.apps.googleusercontent.com",
              "client_type": 3
            }
          ]
        },
        "ads_service": {
          "status": 2
        }
      }
    }
  ],
  "configuration_version": "1"
}