<!DOCTYPE html>
<html lang="en">
<head>
  <meta charset="utf-8">
  <meta http-equiv="X-UA-Compatible" content="IE=edge">
  <meta name="viewport" content="width=device-width, initial-scale=1">
  <meta name="description" content="Home page of The Apache Software Foundation">
  <link rel="apple-touch-icon" sizes="57x57" href="/favicons/apple-touch-icon-57x57.png">
  <link rel="apple-touch-icon" sizes="60x60" href="/favicons/apple-touch-icon-60x60.png">
  <link rel="apple-touch-icon" sizes="72x72" href="/favicons/apple-touch-icon-72x72.png">
  <link rel="apple-touch-icon" sizes="76x76" href="/favicons/apple-touch-icon-76x76.png">
  <link rel="apple-touch-icon" sizes="114x114" href="/favicons/apple-touch-icon-114x114.png">
  <link rel="apple-touch-icon" sizes="120x120" href="/favicons/apple-touch-icon-120x120.png">
  <link rel="apple-touch-icon" sizes="144x144" href="/favicons/apple-touch-icon-144x144.png">
  <link rel="apple-touch-icon" sizes="152x152" href="/favicons/apple-touch-icon-152x152.png">
  <link rel="apple-touch-icon" sizes="180x180" href="/favicons/apple-touch-icon-180x180.png">
  <link rel="icon" type="image/png" href="/favicons/favicon-32x32.png" sizes="32x32">
  <link rel="icon" type="image/png" href="/favicons/favicon-194x194.png" sizes="194x194">
  <link rel="icon" type="image/png" href="/favicons/favicon-96x96.png" sizes="96x96">
  <link rel="icon" type="image/png" href="/favicons/android-chrome-192x192.png" sizes="192x192">
  <link rel="icon" type="image/png" href="/favicons/favicon-16x16.png" sizes="16x16">
  <link rel="manifest" href="/favicons/manifest.json">
  <link rel="shortcut icon" href="/favicons/favicon.ico">
  <meta name="msapplication-TileColor" content="#603cba">
  <meta name="msapplication-TileImage" content="/favicons/mstile-144x144.png">
  <meta name="msapplication-config" content="/favicons/browserconfig.xml">
  <meta name="theme-color" content="#282661">

  <title>Apache License, Version 2.0</title>
  <link href="https://fonts.googleapis.com/css?family=Montserrat:300,600" rel="stylesheet">
  <link href="/css/min.bootstrap.css" rel="stylesheet">
  <link href="/css/styles.css" rel="stylesheet">
  <style>
.headerlink {
  visibility: hidden;
}
dt:hover > .headerlink, p:hover > .headerlink, td:hover > .headerlink, h1:hover > .headerlink, h2:hover > .headerlink, h3:hover > .headerlink, h4:hover > .headerlink, h5:hover > .headerlink, h6:hover > .headerlink {
  visibility: visible
}  </style>

<!-- https://www.apache.org/licenses/LICENSE-2.0 -->
</head>

<body >
  <!-- Navigation -->
  <header>
	<div id="skiptocontent">
		<a href="#maincontent">Skip to Main Content</a>
	</div>
    <nav class="navbar navbar-inverse navbar-fixed-top mainmenu">
      <div class="container">
        <div class="navbar-header">
          <button class="navbar-toggle" type="button" data-toggle="collapse" data-target="#mainnav-collapse">
            <span class="sr-only">Toggle navigation</span>
            <span class="icon-bar"></span>
            <span class="icon-bar"></span>
            <span class="icon-bar"></span>
          </button>
        </div>
        <div class="collapse navbar-collapse" id="mainnav-collapse">
          <ul class="nav navbar-nav navbar-justified">
            <li>
              <form class="visible-xs">
                <div class="input-group" style="width: 100%;">
                  <script>
                    (function() {
                    var cx = '005703438322411770421:5mgshgrgx2u';
                    var gcse = document.createElement('script');
                    gcse.type = 'text/javascript';
                    gcse.async = true;
                    gcse.src = (document.location.protocol == 'https:' ? 'https:' : 'http:') +
                    '//cse.google.com/cse.js?cx=' + cx;
                    var s = document.getElementsByTagName('script')[0];
                    s.parentNode.insertBefore(gcse, s);
                    })();
                  </script>
                  <gcse:searchbox-only></gcse:searchbox-only>
                </div>
              </form>
            </li>
            <li><a href="/index.html#news">News</a></li>
            <li class="dropdown">
              <a href="#" class="dropdown-toggle" data-toggle="dropdown" role="button">About&nbsp;<span class="caret"></span></a>
              <ul class="dropdown-menu" role="menu">
                <li><a href="/foundation">Overview</a></li>
                <li><a href="/foundation/how-it-works.html">Process</a></li>
                <li><a href="/foundation/governance/">Governance</a></li>
                <li><a href="/theapacheway/index.html">The Apache Way</a></li>
                <li><a href="/foundation/governance/members.html">Membership</a></li>
                <li><a href="https://community.apache.org/">Community</a></li>
                <li><a href="https://diversity.apache.org/">Diversity & Inclusion</a></li>
                <li><a href="/foundation/policies/conduct">Code of Conduct</a></li>
                <li><a href="/foundation/glossary.html">Glossary</a></li>
				  <li><a href="/apache-name">About Our Name</a></li>
                <li><a href="/foundation/preFAQ.html">FAQ</a></li>
                <li><a href="/foundation/contributing.html">Support Apache</a></li>
                <li><a href="/press/">Media/Analysts</a></li>
                <li><a href="/foundation/contact.html">Contact</a></li>
              </ul>
            </li>
            <li class="dropdown">
              <a href="#" class="dropdown-toggle" data-toggle="dropdown" role="button">Make a Donation&nbsp;<span class="caret"></span></a>
              <ul class="dropdown-menu" role="menu">
                <li><a href="/foundation/contributing.html">Donate Now</a></li>
                <li><a href="https://donate.apache.org/">&nbsp;&nbsp;Via Credit Card</a></li>
                <li><a href="https://donate.apache.org/">&nbsp;&nbsp;Via ACH</a></li>
                <li><a href="https://donate.apache.org/">&nbsp;&nbsp;Via PayPal</a></li>
                <li><a href="https://www.redbubble.com/people/comdev">Buy Swag</a></li>
                <li><a href="https://smile.amazon.com/gp/chpf/homepage/ref=smi_se_scyc_srch_stsr?q=apache+software+foundation&orig=%2F">Shop smile.amazon.com</a></li>
                <li><a href="/foundation/sponsorship.html">ASF Sponsorship</a></li>
                <li><a href="/foundation/thanks#targeted-sponsors">Targeted Sponsorship</a></li>
                <li><a href="/foundation/contributing.html#CorporateGiving">Corporate Giving</a></li>
              </ul>
            </li>
            <li class="dropdown">
              <a href="#" class="dropdopwn-toggle" data-toggle="dropdown">The Apache Way&nbsp;<span class="caret"></span></a>
              <ul class="dropdown-menu" role="menu">
                <li><a href="/theapacheway/index.html">The Apache Way</a></li>
                <li><a href="https://s.apache.org/GhnI">Sustainable Open Source</a></li>
                <li><a href="/foundation/how-it-works.html">How it Works</a></li>
                <li><a href="/foundation/how-it-works.html#meritocracy">Merit</a></li>
                <li><a href="https://blogs.apache.org/foundation/category/SuccessAtApache">Success at Apache</a></li>
              </ul>
            </li>
            <li class="dropdown">
              <a href="#" class="dropdopwn-toggle" data-toggle="dropdown">Join Us&nbsp;<span class="caret"></span></a>
              <ul class="dropdown-menu" role="menu">
                <li><a href="https://community.apache.org/gettingStarted/101.html">Getting Started</a></li>
                <li><a href="https://helpwanted.apache.org/">Help Wanted</a></li>
                <li><a href="https://www.apachecon.com/">ApacheCon</a></li>
                <li><a href="http://community.apache.org/calendars/">Community Events</a></li>
                <li><a href="/travel/">Travel Assistance</a></li>
                <li><a href="https://community.apache.org/gsoc.html">Summer of Code</a></li>
                <li><a href="/foundation/policies/conduct">Code of Conduct</a></li>
                <li><a href="https://community.apache.org/contributors/etiquette">Etiquette</a></li>
                <li class="dropdown dropdown-submenu visible-xs">
                  <a href="#" class="dropdown-toggle" data-toggle="dropdown" role="button">Projects&nbsp;<span class="caret"></span></a>
                  <ul class="dropdown-menu" role="menu">
                    <li><a href="/index.html#projects-list">Project List</a></li>
                    <li><a href="/foundation/how-it-works.html#management">How they work</a></li>
                    <li><a href="https://community.apache.org/projectIndependence.html">Independence</a></li>
                    <li><a href="https://projects.apache.org/committees.html?date">Date Founded</a></li>
                    <li><a href="https://projects.apache.org/projects.html?name">Names</a></li>
                    <li><a href="https://projects.apache.org/projects.html?category">Categories</a></li>
                    <li><a href="https://projects.apache.org/projects.html?language">Languages</a></li>
                    <li><a href="https://projects.apache.org/statistics.html">Statistics</a></li>
                    <li><a href="https://incubator.apache.org/">Apache Incubator</a></li>
                    <li><a href="https://helpwanted.apache.org/">Help Wanted</a></li>
                    <li><a href="/foundation/marks/">Brand Management</a></li>
                  </ul>
                </li>
                <li class="drowpdown dropdown-submenu visible-xs">
                  <a href="#" class="dropdown-toggle" data-toggle="dropdown" role="button">People&nbsp;<span class="caret"></span></a>
                  <ul class="dropdown-menu" role="menu">
                    <li><a href="/foundation/how-it-works.html#roles">Roles</a></li>
                    <li><a href="/foundation/members.html">Members</a></li>
                    <li><a href="https://community.apache.org/contributors/">Committers</a></li>
                    <li><a href="/foundation/#who-runs-the-asf">Board of Directors</a></li>
                    <li><a href="/foundation/#who-runs-the-asf">Officers  &amp; Project VPs</a></li>
                    <li><a href="https://community.zones.apache.org/map.html">Location Map</a></li>
                    <li><a href="/foundation/policies/conduct">Code of Conduct</a></li>
                    <li><a href="https://people.apache.org/">Committer Directory</a></li>
                  </ul>
                </li>
                <li class="drowpdown dropdown-submenu visible-xs">
                  <a href="#" class="dropdown-toggle" data-toggle="dropdown" role="button">Community&nbsp;<span class="caret"></span></a>
                  <ul class="dropdown-menu" role="menu">
                    <li><a href="https://community.apache.org/about/">Community Development</a></li>
                    <li><a href="/foundation/policies/conduct">Code of Conduct</a></li>
                    <li><a href="https://community.apache.org/">Get Involved</a></li>
                    <li><a href="https://community.apache.org/mentoringprogramme.html">Mentoring</a></li>
                    <li><a href="https://helpwanted.apache.org/">Help Wanted</a></li>
                    <li><a href="https://community.apache.org/calendars/">Community Events</a></li>
                    <li><a href="https://community.apache.org/newbiefaq.html">FAQ</a></li>
                    <li><a href="https://community.apache.org/lists.html">Mailing Lists</a></li>
                  </ul>
                </li>
                <li class="drowpdown dropdown-submenu visible-xs">
                  <a href="#" class="dropdown-toggle" data-toggle="dropdown" role="button">License&nbsp;<span class="caret"></span></a>
                  <ul class="dropdown-menu" role="menu">
                    <li><a href="/licenses/LICENSE-2.0">Apache License 2.0</a></li>
                    <li><a href="/foundation/license-faq.html">Licensing FAQ</a></li>
                    <li><a href="/licenses/contributor-agreements.html">Contributor License Agreements</a></li>
                    <li><a href="/licenses/contributor-agreements.html#grants">Software Grants</a></li>
                    <li><a href="/foundation/marks/list/">Trademarks</a></li>
					<li><a href="/licenses/exports/">Exports</a></li>
                  </ul>
                </li>
                <li class="drowpdown dropdown-submenu visible-xs">
                  <a href="#" class="dropdown-toggle" data-toggle="dropdown" role="button">Sponsors&nbsp;<span class="caret"></span></a>
                  <ul class="dropdown-menu" role="menu">
                    <li><a href="/foundation/sponsorship.html">Sponsor the ASF</a></li>
                    <li><a href="/foundation/thanks">Sponsor Thanks</a></li>
                    <li><a href="/foundation/contributing.html#CorporateGiving">Corporate Giving</a></li>
                    <li><a href="/foundation/contributing.html">Individual Donations</a></li>
                    <li><a href="https://www.redbubble.com/people/comdev/">Buy Stuff</a></li>
                  </ul>
                </li>
              </ul>
            </li>
            <li class="dropdown">
              <a href="#" class="dropdown-toggle" data-toggle="dropdown" role="button">Downloads&nbsp;<span class="caret"></span></a>
              <ul class="dropdown-menu" role="menu">
                <li><a href="https://downloads.apache.org/">Distribution</a></li>
                <li><a href="https://projects.apache.org/releases.html">Releases</a></li>
                <li><a href="https://status.apache.org/">Infrastructure Status</a></li>
                <li><a href="/uptime/">Infrastructure Statistics</a></li>
              </ul>
            </li>
            <li class="dropdown hidden-xs">
              <a href="#" class="dropdown-toggle" data-toggle="dropdown" role="button"><span class="glyphicon glyphicon-search"
                  aria-hidden="true"></span><span class="sr-only">Search</span></a>
              <ul class="dropdown-menu search-form" role="search">
                <li>
                  <div class="input-group" style="width: 100%; padding: 0 5px;">
                    <script async src="https://cse.google.com/cse.js?cx=cb41d2753d228d8b7"></script>
                    <div class="gcse-search"></div>
                  </div>
                </li>
              </ul>
            </li>
          </ul>
        </div>
      </div>
    </nav>
  </header>
  <!-- / Navigation -->
  <header id="main-header" class="container">
    <div class="sideImg">
	  <!-- <a class="visible-home" href="https://events.apache.org/"><img class="img-responsive" style="width: 100%;" src="/events/current-event-125x125.png" alt="Apache Events"></a> -->
          <a class="visible-home" href="https://events.apache.org/x/current-event.html">
              <img class="img-responsive" style="width: 125px;" src="https://www.apachecon.com/event-images/default-square-light.png" alt="ApacheCon 2021 Coming Soon!" />
          </a>
      <a class="hidden-home" href="/"><img class="img-responsive" src="/img/asf-estd-1999-logo.jpg" alt="The Apache Software Foundation"></a>
    </div>
    <div class="main">
      <img class="img-responsive center-block visible-home" src="/img/asf-estd-1999-logo.jpg" alt="Apache 20th Anniversary Logo">
      <h2 class="text-center">Community-led development "The&nbsp;Apache&nbsp;Way"</h2>
      <ul class="nav navbar-nav navbar-justified">
        <li class="drowpdown">
          <a href="#" class="dropdown-toggle" data-toggle="dropdown" role="button">Projects&nbsp;<span class="caret hidden-sm"></span></a>
          <ul class="dropdown-menu" role="menu">
            <li><a href="/index.html#projects-list">Project List</a></li>
            <li><a href="/foundation/how-it-works.html#management">How they work</a></li>
            <li><a href="https://community.apache.org/projectIndependence.html">Independence</a></li>
            <li><a href="https://projects.apache.org/committees.html?date">Date Founded</a></li>
            <li><a href="https://projects.apache.org/projects.html?name">Names</a></li>
            <li><a href="https://projects.apache.org/projects.html?category">Categories</a></li>
            <li><a href="https://projects.apache.org/projects.html?language">Languages</a></li>
            <li><a href="https://projects.apache.org/statistics.html">Statistics</a></li>
            <li><a href="https://incubator.apache.org/">Apache Incubator</a></li>
            <li><a href="https://helpwanted.apache.org/">Help Wanted</a></li>
            <li><a href="/foundation/marks/">Brand Management</a></li>
            <li><a href="/foundation/glossary.html">Glossary of Terms</a></li>
          </ul>
        </li>
        <li class="dropdown">
          <a href="#" class="dropdown-toggle" data-toggle="dropdown" role="button">People&nbsp;<span class="caret hidden-sm"></span></a>
          <ul class="dropdown-menu" role="menu">
            <li><a href="/foundation/how-it-works.html#roles">Roles</a></li>
            <li><a href="/foundation/members.html">Members</a></li>
            <li><a href="https://community.apache.org/contributors/">Committers</a></li>
            <li><a href="/foundation/#who-runs-the-asf">Board of Directors</a></li>
            <li><a href="/foundation/#who-runs-the-asf">Officers &amp; Project VPs</a></li>
            <li><a href="https://diversity.apache.org/">Diversity & Inclusion</a></li>
            <li><a href="/foundation/policies/conduct">Code of Conduct</a></li>
            <li><a href="https://people.apache.org/">Committer Directory</a></li>
            <li><a href="https://community.zones.apache.org/map.html">Heat Map</a></li>
          </ul>
        </li>
        <li class="dropdown">
          <a href="#" class="dropdown-toggle" data-toggle="dropdown" role="button">Community&nbsp;<span class="caret hidden-sm"></span></a>
          <ul class="dropdown-menu" role="menu">
            <li><a href="https://community.apache.org/about/">Community Development</a></li>
            <li><a href="/foundation/policies/conduct">Code of Conduct</a></li>
            <li><a href="https://community.apache.org/">Get Involved</a></li>
            <li><a href="https://community.apache.org/mentoringprogramme.html">Mentoring</a></li>
            <li><a href="https://helpwanted.apache.org/">Help Wanted</a></li>
            <li><a href="https://community.apache.org/calendars/">Community Events</a></li>
            <li><a href="https://community.apache.org/newbiefaq.html">FAQ</a></li>
            <li><a href="https://community.apache.org/lists.html">Mailing Lists</a></li>
          </ul>
        </li>
        <li class="dropdown">
          <a href="#" class="dropdown-toggle" data-toggle="dropdown" role="button">License&nbsp;<span class="caret hidden-sm"></span></a>
          <ul class="dropdown-menu" role="menu">
            <li><a href="/licenses/LICENSE-2.0">Apache License 2.0</a></li>
            <li><a href="/foundation/license-faq.html">Licensing FAQ</a></li>
            <li><a href="/licenses/contributor-agreements.html">Contributor License Agreements</a></li>
            <li><a href="/licenses/contributor-agreements.html#grants">Software Grants</a></li>
            <li><a href="/foundation/marks/list/">Trademarks</a></li>
			<li><a href="/licenses/exports/">Exports</a></li>
          </ul>
        </li>
        <li class="dropdown">
          <a href="#" class="dropdown-toggle" data-toggle="dropdown" role="button">Sponsors&nbsp;<span class="caret hidden-sm"></span></a>
          <ul class="dropdown-menu" role="menu">
            <li><a href="/foundation/sponsorship.html">Sponsor the ASF</a></li>
            <li><a href="/foundation/thanks">Sponsor Thanks</a></li>
            <li><a href="/foundation/contributing.html#CorporateGiving">Corporate Giving</a></li>
            <li><a href="/foundation/contributing.html">Individual Donations</a></li>
            <li><a href="https://www.redbubble.com/people/comdev/">Buy Stuff</a></li>
          </ul>
        </li>
      </ul>
    </div>
    <div class="sideImg">
      <a href="/foundation/contributing.html"><img class="img-responsive" src="/img/support-apache.jpg" alt="Apache Support Logo" /></a>
    </div>
  </header>
  <main id="maincontent">
<div class="container">    <h3 id="apache-license-version-20">Apache License, Version 2.0<a class="headerlink" href="#apache-license-version-20" title="Permalink">&para;</a></h3>
<ul>
<li>Text version: <a href="LICENSE-2.0.txt">https://www.apache.org/licenses/LICENSE-2.0.txt</a></li>
<li>SPDX short identifier: <a href="https://spdx.org/licenses/Apache-2.0.html">Apache-2.0</a></li>
<li>OSI Approved License: <a href="https://opensource.org/licenses/Apache-2.0">https://opensource.org/licenses/Apache-2.0</a></li>
</ul>
<p>The 2.0 version of the Apache License, approved by the ASF in 2004, helps us achieve our goal of providing
reliable and long-lived software products through collaborative, open-source software development.</p>
<p>All packages produced by the ASF are implicitly licensed under the Apache
License, Version 2.0, unless otherwise explicitly stated.</p>
<div style="margin: 3em 10%; font-family:serif;text-align:justify; border: 1px solid black; padding: 2em;   box-shadow: 4px 8px #888888;">
<p style="text-align:center">
<strong>Apache License<br/>Version 2.0, January 2004<br/></strong>
<strong><a href="http://www.apache.org/licenses/">http://www.apache.org/licenses/</a></strong>
</p>
<p>TERMS AND CONDITIONS FOR USE, REPRODUCTION, AND DISTRIBUTION</p>
<p><strong><a name="definitions">1. Definitions</a></strong>.</p>
<div style="margin-left: 1em;">
<p>"<strong>License</strong>" shall mean the terms and conditions for use, reproduction, and
distribution as defined by Sections 1 through 9 of this document.</p>
<p>"<strong>Licensor</strong>" shall mean the copyright owner or entity authorized by the
copyright owner that is granting the License.</p>
<p>"<strong>Legal Entity</strong>" shall mean the union of the acting entity and all other
entities that control, are controlled by, or are under common control with
that entity. For the purposes of this definition, "<strong>control</strong>" means (i) the
power, direct or indirect, to cause the direction or management of such
entity, whether by contract or otherwise, or (ii) ownership of fifty
percent (50%) or more of the outstanding shares, or (iii) beneficial
ownership of such entity.</p>
<p>"<strong>You</strong>" (or "<strong>Your</strong>") shall mean an individual or Legal Entity exercising
permissions granted by this License.</p>
<p>"<strong>Source</strong>" form shall mean the preferred form for making modifications,
including but not limited to software source code, documentation source,
and configuration files.</p>
<p>"<strong>Object</strong>" form shall mean any form resulting from mechanical transformation
or translation of a Source form, including but not limited to compiled
object code, generated documentation, and conversions to other media types.</p>
<p>"<strong>Work</strong>" shall mean the work of authorship, whether in Source or Object form,
made available under the License, as indicated by a copyright notice that
is included in or attached to the work (an example is provided in the
Appendix below).</p>
<p>"<strong>Derivative Works</strong>" shall mean any work, whether in Source or Object form,
that is based on (or derived from) the Work and for which the editorial
revisions, annotations, elaborations, or other modifications represent, as
a whole, an original work of authorship. For the purposes of this License,
Derivative Works shall not include works that remain separable from, or
merely link (or bind by name) to the interfaces of, the Work and Derivative
Works thereof.</p>
<p>"<strong>Contribution</strong>" shall mean any work of authorship, including the original
version of the Work and any modifications or additions to that Work or
Derivative Works thereof, that is intentionally submitted to Licensor for
inclusion in the Work by the copyright owner or by an individual or Legal
Entity authorized to submit on behalf of the copyright owner. For the
purposes of this definition, "<strong>submitted</strong>" means any form of electronic,
verbal, or written communication sent to the Licensor or its
representatives, including but not limited to communication on electronic
mailing lists, source code control systems, and issue tracking systems that
are managed by, or on behalf of, the Licensor for the purpose of discussing
and improving the Work, but excluding communication that is conspicuously
marked or otherwise designated in writing by the copyright owner as "<strong>Not a
Contribution.</strong>"</p>
<p>"<strong>Contributor</strong>" shall mean Licensor and any individual or Legal Entity on
behalf of whom a Contribution has been received by Licensor and
subsequently incorporated within the Work.</p>
</div>
<p><strong><a name="copyright">2. Grant of Copyright License</a></strong>. Subject to the
terms and conditions of this License, each Contributor hereby grants to You
a perpetual, worldwide, non-exclusive, no-charge, royalty-free, irrevocable
copyright license to reproduce, prepare Derivative Works of, publicly
display, publicly perform, sublicense, and distribute the Work and such
Derivative Works in Source or Object form.</p>
<p><strong><a name="patent">3. Grant of Patent License</a></strong>. Subject to the terms
and conditions of this License, each Contributor hereby grants to You a
perpetual, worldwide, non-exclusive, no-charge, royalty-free, irrevocable
(except as stated in this section) patent license to make, have made, use,
offer to sell, sell, import, and otherwise transfer the Work, where such
license applies only to those patent claims licensable by such Contributor
that are necessarily infringed by their Contribution(s) alone or by
combination of their Contribution(s) with the Work to which such
Contribution(s) was submitted. If You institute patent litigation against
any entity (including a cross-claim or counterclaim in a lawsuit) alleging
that the Work or a Contribution incorporated within the Work constitutes
direct or contributory patent infringement, then any patent licenses
granted to You under this License for that Work shall terminate as of the
date such litigation is filed.</p>
<p><strong><a name="redistribution">4. Redistribution</a></strong>. You may reproduce and
distribute copies of the Work or Derivative Works thereof in any medium,
with or without modifications, and in Source or Object form, provided that
You meet the following conditions:</p>
<ol style="list-style: lower-latin;">
<li>You must give any other recipients of the Work or Derivative Works a
copy of this License; and</li>
<li>You must cause any modified files to carry prominent notices stating
that You changed the files; and</li>
<li>You must retain, in the Source form of any Derivative Works that You
distribute, all copyright, patent, trademark, and attribution notices from
the Source form of the Work, excluding those notices that do not pertain to
any part of the Derivative Works; and</li>
<li>If the Work includes a "<strong>NOTICE</strong>" text file as part of its distribution,
then any Derivative Works that You distribute must include a readable copy
of the attribution notices contained within such NOTICE file, excluding
those notices that do not pertain to any part of the Derivative Works, in
at least one of the following places: within a NOTICE text file distributed
as part of the Derivative Works; within the Source form or documentation,
if provided along with the Derivative Works; or, within a display generated
by the Derivative Works, if and wherever such third-party notices normally
appear. The contents of the NOTICE file are for informational purposes only
and do not modify the License. You may add Your own attribution notices
within Derivative Works that You distribute, alongside or as an addendum to
the NOTICE text from the Work, provided that such additional attribution
notices cannot be construed as modifying the License.
<br/>
<br/>
You may add Your own copyright statement to Your modifications and may
provide additional or different license terms and conditions for use,
reproduction, or distribution of Your modifications, or for any such
Derivative Works as a whole, provided Your use, reproduction, and
distribution of the Work otherwise complies with the conditions stated in
this License.
</li>
</ol>
<p><strong><a name="contributions">5. Submission of Contributions</a></strong>. Unless You
explicitly state otherwise, any Contribution intentionally submitted for
inclusion in the Work by You to the Licensor shall be under the terms and
conditions of this License, without any additional terms or conditions.
Notwithstanding the above, nothing herein shall supersede or modify the
terms of any separate license agreement you may have executed with Licensor
regarding such Contributions.</p>
<p><strong><a name="trademarks">6. Trademarks</a></strong>. This License does not grant
permission to use the trade names, trademarks, service marks, or product
names of the Licensor, except as required for reasonable and customary use
in describing the origin of the Work and reproducing the content of the
NOTICE file.</p>
<p><strong><a name="no-warranty">7. Disclaimer of Warranty</a></strong>. Unless required by
applicable law or agreed to in writing, Licensor provides the Work (and
each Contributor provides its Contributions) on an "AS IS" BASIS, WITHOUT
WARRANTIES OR CONDITIONS OF ANY KIND, either express or implied, including,
without limitation, any warranties or conditions of TITLE,
NON-INFRINGEMENT, MERCHANTABILITY, or FITNESS FOR A PARTICULAR PURPOSE. You
are solely responsible for determining the appropriateness of using or
redistributing the Work and assume any risks associated with Your exercise
of permissions under this License.</p>
<p><strong><a name="no-liability">8. Limitation of Liability</a></strong>. In no event and
under no legal theory, whether in tort (including negligence), contract, or
otherwise, unless required by applicable law (such as deliberate and
grossly negligent acts) or agreed to in writing, shall any Contributor be
liable to You for damages, including any direct, indirect, special,
incidental, or consequential damages of any character arising as a result
of this License or out of the use or inability to use the Work (including
but not limited to damages for loss of goodwill, work stoppage, computer
failure or malfunction, or any and all other commercial damages or losses),
even if such Contributor has been advised of the possibility of such
damages.</p>
<p><strong><a name="additional">9. Accepting Warranty or Additional Liability</a></strong>.
While redistributing the Work or Derivative Works thereof, You may choose
to offer, and charge a fee for, acceptance of support, warranty, indemnity,
or other liability obligations and/or rights consistent with this License.
However, in accepting such obligations, You may act only on Your own behalf
and on Your sole responsibility, not on behalf of any other Contributor,
and only if You agree to indemnify, defend, and hold each Contributor
harmless for any liability incurred by, or claims asserted against, such
Contributor by reason of your accepting any such warranty or additional
liability.</p>
<p>END OF TERMS AND CONDITIONS</p>
</div>
<h1 id="apply">How to apply the Apache License to your work<a class="headerlink" href="#apply" title="Permalink">&para;</a></h1>
<p>Include a copy of the Apache License, typically in a file called
LICENSE, in your work, and consider also including a NOTICE file that references the License.</p>
<p>To apply the Apache License to specific files in your work, attach the following boilerplate
declaration, replacing the fields enclosed by brackets "[]" with your own
identifying information. (Don't include the brackets!) Enclose the text in the appropriate comment syntax for the file format. We also
recommend that you include a file or class name and description of purpose on the same "printed page" as the copyright notice for easier
identification within third-party archives.</p>
<pre><code>Copyright [yyyy] [name of copyright owner]

Licensed under the Apache License, Version 2.0 (the "License");
you may not use this file except in compliance with the License.
You may obtain a copy of the License at

    http://www.apache.org/licenses/LICENSE-2.0

Unless required by applicable law or agreed to in writing, software
distributed under the License is distributed on an "AS IS" BASIS,
WITHOUT WARRANTIES OR CONDITIONS OF ANY KIND, either express or implied.
See the License for the specific language governing permissions and
limitations under the License.
</code></pre>

</div>  </main>

  <!-- Footer -->
  <footer class="bg-primary">
    <div class="container">
      <div class="row">
        <br />
        <div class="col-sm-1">

        </div>
        <div class="col-sm-2">
          <h5 class="white">Community</h5>
          <ul class="list-unstyled white" role="menu">
            <li><a href="http://community.apache.org/">Overview</a></li>
            <li><a href="/foundation/conferences.html">Conferences</a></li>
            <li><a href="http://community.apache.org/gsoc.html">Summer of Code</a></li>
            <li><a href="http://community.apache.org/newcomers/">Getting Started</a></li>
            <li><a href="/foundation/how-it-works.html">The Apache Way</a></li>
            <li><a href="/travel/">Travel Assistance</a></li>
            <li><a href="/foundation/getinvolved.html">Get Involved</a></li>
            <li><a href="/foundation/policies/conduct.html">Code of Conduct</a></li>
            <li><a href="http://community.apache.org/newbiefaq.html">Community FAQ</a></li>
            <li><a href="/memorials/">Memorials</a></li>
          </ul>
        </div>

        <div class="col-sm-2">
          <h5 class="white">Innovation</h5>
          <ul class="list-unstyled white" role="menu">
            <li><a href="http://incubator.apache.org/">Incubator</a></li>
            <li><a href="http://labs.apache.org/">Labs</a></li>
            <li><a href="/licenses/">Licensing</a></li>
            <li><a href="/foundation/license-faq.html">Licensing FAQ</a></li>
            <li><a href="/foundation/marks/">Trademark Policy</a></li>
            <li><a href="/foundation/contact.html">Contacts</a></li>
          </ul>
        </div>

        <div class="col-sm-2">
          <h5 class="white">Tech Operations</h5>
          <ul class="list-unstyled white" role="menu">
            <li><a href="/dev/">Developer Information</a></li>
            <li><a href="/dev/infrastructure.html">Infrastructure</a></li>
            <li><a href="/security/">Security</a></li>
            <li><a href="http://status.apache.org">Status</a></li>
            <li><a href="/foundation/contact.html">Contacts</a></li>
          </ul>
        </div>

        <div class="col-sm-2">
          <h5 class="white">Press</h5>
          <ul class="list-unstyled white" role="menu">
            <li><a href="/press/">Overview</a></li>
            <li><a href="https://blogs.apache.org/">ASF News</a></li>
            <li><a href="https://blogs.apache.org/foundation/">Announcements</a></li>
            <li><a href="https://twitter.com/TheASF">Twitter Feed</a></li>
            <li><a href="/press/#contact">Contacts</a></li>
          </ul>
        </div>

        <div class="col-sm-2">
          <h5 class="white">Legal</h5>
          <ul class="list-unstyled white" role="menu">
            <li><a href="/legal/">Legal Affairs</a></li>
            <li><a href="/legal/dmca.html">DMCA</a></li>
            <li><a href="/licenses/">Licensing</a></li>
            <li><a href="/foundation/marks/">Trademark Policy</a></li>
            <li><a href="/foundation/records/">Public Records</a></li>
            <li><a href="/foundation/policies/privacy.html">Privacy Policy</a></li>
            <li><a href="/licenses/exports/">Export Information</a></li>
            <li><a href="/foundation/license-faq.html">Licensing FAQ</a></li>
            <li><a href="/foundation/contact.html">Contacts</a></li>
          </ul>
        </div>

        <div class="col-sm-1">
        </div>

      </div>
      <hr class="col-lg-12 hr-white" />
      <div class="row">
        <div class="col-lg-12">
          <p class="text-center">Copyright &#169; 2021 The Apache Software Foundation, Licensed under the <a class="white" href="/licenses/LICENSE-2.0">Apache License, Version 2.0</a>.</p>
          <p class="text-center">Apache and the Apache feather logo are trademarks of The Apache Software Foundation. </p>
        </div>
      </div>
    </div>

  </footer>

  <!-- / Footer -->

  <script src="/js/jquery-2.1.1.min.js"></script>
  <script src="/js/bootstrap.js"></script>
  <script src="/js/slideshow.js"></script>
  <script>
    (function($){
    $(document).ready(function(){
    $('ul.dropdown-menu [data-toggle=dropdown]').on('click', function(event) {
    event.preventDefault();
    event.stopPropagation();
    $(this).parent().siblings().removeClass('open');
    $(this).parent().toggleClass('open');
    console.log('WOrked');
    });
    });
    })(jQuery);
  </script>
</body>
</html>
